qpid-notifications mailing list archives

Site index · List index
Message view « Date » · « Thread »
Top « Date » · « Thread »
From Apache Jenkins Server <jenk...@builds.apache.org>
Subject Build failed in Jenkins: Qpid-Java-Java-Test-JDK1.8 #1002
Date Tue, 10 Feb 2015 02:26:32 GMT
See <https://builds.apache.org/job/Qpid-Java-Java-Test-JDK1.8/1002/changes>

Changes:

[gsim] NON_JIRA: remove over-cautious assertion

[gsim] QPID-6324: refine previous fix such that no explicit reliability setting on durable
subscription results in timeout by default

[orudyy] QPID-6364: Set Keystore/Truststore derived attribute 'path' to non-data URL. Change
the upgrader to upgrade only FileKeyStore and FileTrustStore

[orudyy] QPID-6365: Fix failing tests

[orudyy] QPID-6365: [Java Broker] Only expose secure attribute values when transport is SSL
and initial configuration is requested

------------------------------------------
[...truncated 13962 lines...]
[INFO] Pushing /x1/jenkins/jenkins-slave/workspace/Qpid-Java-Java-Test-JDK1.8/trunk/qpid/java/perftests/visualisation-jfc/target/site
[INFO]    >>> to file:///x1/jenkins/jenkins-slave/workspace/Qpid-Java-Java-Test-JDK1.8/trunk/qpid/java/target/staging/perftests/visualisation-jfc/perftests/qpid-perftests-visualisation-jfc
file:///x1/jenkins/jenkins-slave/workspace/Qpid-Java-Java-Test-JDK1.8/trunk/qpid/java/target/staging/
- Session: Disconnecting  
file:///x1/jenkins/jenkins-slave/workspace/Qpid-Java-Java-Test-JDK1.8/trunk/qpid/java/target/staging/
- Session: Disconnected
[INFO]                                                                         
[INFO] ------------------------------------------------------------------------
[INFO] Building Qpid BDB Store System Tests 0.32-SNAPSHOT
[INFO] ------------------------------------------------------------------------
[INFO] 
[INFO] --- maven-clean-plugin:2.5:clean (default-clean) @ qpid-bdbstore-systests ---
[INFO] 
[INFO] --- maven-antrun-plugin:1.7:run (output-test-properties) @ qpid-bdbstore-systests ---
[INFO] Executing tasks

main:
     [echo] Qpid Test Profile Properties
     [echo] [profile] java-mms.0-10
     [echo] [profile.broker.language] java
     [echo] [profile.broker.type] internal
     [echo] [profile.broker.command] "/x1/jenkins/jenkins-slave/workspace/Qpid-Java-Java-Test-JDK1.8/trunk/qpid/java/bdbstore/systests/target/qpid-broker/0.32-SNAPSHOT/bin/qpid-server"
-sp @STORE_PATH -st @STORE_TYPE -l @LOG_CONFIG_FILE
     [echo] [profile.specific.excludes] JavaTransientExcludes Java010Excludes
     [echo] [profile.test.excludes] Excludes JavaExcludes java-mms.0-10.excludes JavaTransientExcludes
Java010Excludes
     [echo] [profile.broker.version] v0_10
     [echo] [profile.test.amqp_port_protocols] ["AMQP_0_8","AMQP_0_9","AMQP_0_9_1","AMQP_0_10"]
     [echo] [profile.broker.persistent] false
     [echo] [profile.virtualhostnode.type] Memory
     [echo] [profile.virtualhostnode.context.blueprint] {"type":"ProvidedStore"}
[INFO] Executed tasks
[INFO] 
[INFO] --- maven-enforcer-plugin:1.3.1:enforce (enforce-minimum-versions) @ qpid-bdbstore-systests
---
[INFO] 
[INFO] --- maven-enforcer-plugin:1.3.1:enforce (enforce-versions-standard-properties) @ qpid-bdbstore-systests
---
[INFO] 
[INFO] --- jacoco-maven-plugin:0.7.0.201403182114:prepare-agent (default-prepare-agent) @
qpid-bdbstore-systests ---
[INFO] Skipping JaCoCo execution because property jacoco.skip is set.
[INFO] argLine set to empty
[INFO] 
[INFO] --- maven-remote-resources-plugin:1.5:process (default) @ qpid-bdbstore-systests ---
[INFO] 
[INFO] --- maven-resources-plugin:2.6:copy-resources (copy-systests-etc-resources) @ qpid-bdbstore-systests
---
[INFO] Using 'UTF-8' encoding to copy filtered resources.
[INFO] Copying 4 resources
[INFO] 
[INFO] --- maven-resources-plugin:2.6:copy-resources (copy-test-profile-resources) @ qpid-bdbstore-systests
---
[INFO] Using 'UTF-8' encoding to copy filtered resources.
[INFO] Copying 45 resources
[INFO] 
[INFO] --- maven-resources-plugin:2.6:copy-resources (copy-bdbstore-bin-resources) @ qpid-bdbstore-systests
---
[INFO] Using 'UTF-8' encoding to copy filtered resources.
[INFO] Copying 1 resource
[INFO] 
[INFO] --- maven-resources-plugin:2.6:resources (default-resources) @ qpid-bdbstore-systests
---
[INFO] Using 'UTF-8' encoding to copy filtered resources.
[INFO] skip non existing resourceDirectory /x1/jenkins/jenkins-slave/workspace/Qpid-Java-Java-Test-JDK1.8/trunk/qpid/java/bdbstore/systests/src/main/resources
[INFO] Copying 24 resources
[INFO] Copying 3 resources
[INFO] 
[INFO] --- maven-compiler-plugin:3.1:compile (default-compile) @ qpid-bdbstore-systests ---
[INFO] No sources to compile
[INFO] 
[INFO] --- maven-resources-plugin:2.6:testResources (default-testResources) @ qpid-bdbstore-systests
---
[INFO] Using 'UTF-8' encoding to copy filtered resources.
[INFO] skip non existing resourceDirectory /x1/jenkins/jenkins-slave/workspace/Qpid-Java-Java-Test-JDK1.8/trunk/qpid/java/bdbstore/systests/src/test/resources
[INFO] Copying 3 resources
[INFO] 
[INFO] --- maven-compiler-plugin:3.1:testCompile (default-testCompile) @ qpid-bdbstore-systests
---
[INFO] Changes detected - recompiling the module!
[INFO] Compiling 8 source files to /x1/jenkins/jenkins-slave/workspace/Qpid-Java-Java-Test-JDK1.8/trunk/qpid/java/bdbstore/systests/target/test-classes
[WARNING] bootstrap class path not set in conjunction with -source 1.7
[INFO] 
[INFO] --- maven-surefire-plugin:2.16:test (default-test) @ qpid-bdbstore-systests ---
[INFO] Tests are skipped.
[INFO] 
[INFO] --- maven-jar-plugin:2.4:jar (default-jar) @ qpid-bdbstore-systests ---
[INFO] Building jar: /x1/jenkins/jenkins-slave/workspace/Qpid-Java-Java-Test-JDK1.8/trunk/qpid/java/bdbstore/systests/target/qpid-bdbstore-systests-0.32-SNAPSHOT.jar
[INFO] 
[INFO] --- maven-site-plugin:3.3:attach-descriptor (attach-descriptor) @ qpid-bdbstore-systests
---
[INFO] 
[INFO] --- maven-antrun-plugin:1.7:run (fix-bdb-script-permissions) @ qpid-bdbstore-systests
---
[INFO] Executing tasks

main:
[INFO] Executed tasks
[INFO] 
[INFO] --- maven-antrun-plugin:1.7:run (create-qbtc-output-dir) @ qpid-bdbstore-systests ---
[INFO] Executing tasks

main:
    [mkdir] Created dir: /x1/jenkins/jenkins-slave/workspace/Qpid-Java-Java-Test-JDK1.8/trunk/qpid/java/bdbstore/systests/target/qpid-broker/0.32-SNAPSHOT/qbtc-test-config
[INFO] Executed tasks
[INFO] 
[INFO] --- maven-dependency-plugin:2.8:unpack (extract-broker-distribution) @ qpid-bdbstore-systests
---
[INFO] Configured Artifact: org.apache.qpid:qpid-broker:bin:0.32-SNAPSHOT:tar.gz
[INFO] Unpacking /x1/jenkins/jenkins-slave/workspace/Qpid-Java-Java-Test-JDK1.8/trunk/qpid/java/broker/target/qpid-broker-0.32-SNAPSHOT-bin.tar.gz
to /x1/jenkins/jenkins-slave/workspace/Qpid-Java-Java-Test-JDK1.8/trunk/qpid/java/bdbstore/systests/target
with includes "" and excludes ""
[INFO] Expanding: /x1/jenkins/jenkins-slave/workspace/Qpid-Java-Java-Test-JDK1.8/trunk/qpid/java/broker/target/qpid-broker-0.32-SNAPSHOT-bin.tar.gz
into /x1/jenkins/jenkins-slave/workspace/Qpid-Java-Java-Test-JDK1.8/trunk/qpid/java/bdbstore/systests/target
[INFO] 
[INFO] --- maven-dependency-plugin:2.8:copy (copy-sleepycat-jar-for-bdb-tests) @ qpid-bdbstore-systests
---
[INFO] Configured Artifact: com.sleepycat:je:5.0.104:jar
[INFO] Copying je-5.0.104.jar to /x1/jenkins/jenkins-slave/workspace/Qpid-Java-Java-Test-JDK1.8/trunk/qpid/java/bdbstore/systests/target/qpid-broker/0.32-SNAPSHOT/lib/je-5.0.104.jar
[INFO] 
[INFO] --- maven-surefire-plugin:2.16:test (integration-test) @ qpid-bdbstore-systests ---
[INFO] Surefire report directory: /x1/jenkins/jenkins-slave/workspace/Qpid-Java-Java-Test-JDK1.8/trunk/qpid/java/bdbstore/systests/target/surefire-reports

-------------------------------------------------------
 T E S T S
-------------------------------------------------------
Running org.apache.qpid.server.store.berkeleydb.BDBUpgradeTest
log4j:WARN No appenders could be found for logger (org.apache.qpid.test.utils.QpidTestCase).
log4j:WARN Please initialize the log4j system properly.
log4j:WARN See http://logging.apache.org/log4j/1.2/faq.html#noconfig for more info.
Tests run: 8, Failures: 0, Errors: 0, Skipped: 0, Time elapsed: 0.168 sec - in org.apache.qpid.server.store.berkeleydb.BDBUpgradeTest
Running org.apache.qpid.server.store.berkeleydb.BDBBackupTest
Tests run: 1, Failures: 0, Errors: 0, Skipped: 0, Time elapsed: 0 sec - in org.apache.qpid.server.store.berkeleydb.BDBBackupTest
Running org.apache.qpid.server.store.berkeleydb.replication.BDBHAVirtualHostNodeRestTest
Tests run: 7, Failures: 0, Errors: 0, Skipped: 0, Time elapsed: 0.011 sec - in org.apache.qpid.server.store.berkeleydb.replication.BDBHAVirtualHostNodeRestTest
Running org.apache.qpid.server.store.berkeleydb.replication.JMXManagementTest
Tests run: 7, Failures: 0, Errors: 0, Skipped: 0, Time elapsed: 0.059 sec - in org.apache.qpid.server.store.berkeleydb.replication.JMXManagementTest
Running org.apache.qpid.server.store.berkeleydb.replication.MultiNodeTest
Tests run: 10, Failures: 0, Errors: 0, Skipped: 0, Time elapsed: 0.039 sec - in org.apache.qpid.server.store.berkeleydb.replication.MultiNodeTest
Running org.apache.qpid.server.store.berkeleydb.replication.TwoNodeTest
Tests run: 7, Failures: 0, Errors: 0, Skipped: 0, Time elapsed: 0.012 sec - in org.apache.qpid.server.store.berkeleydb.replication.TwoNodeTest
Running org.apache.qpid.server.store.berkeleydb.replication.BDBHAVirtualHostRestTest
Tests run: 3, Failures: 0, Errors: 0, Skipped: 0, Time elapsed: 0.003 sec - in org.apache.qpid.server.store.berkeleydb.replication.BDBHAVirtualHostRestTest

Results :

Tests run: 43, Failures: 0, Errors: 0, Skipped: 0

[INFO] 
[INFO] --- maven-site-plugin:3.3:site (default-site) @ qpid-bdbstore-systests ---
[INFO] configuring report plugin org.apache.maven.plugins:maven-project-info-reports-plugin:2.7
[INFO] configuring report plugin org.codehaus.mojo:license-maven-plugin:1.6
[INFO] configuring report plugin org.apache.maven.plugins:maven-surefire-report-plugin:2.16
[INFO] configuring report plugin org.apache.maven.plugins:maven-jxr-plugin:2.3
[INFO] configuring report plugin org.jacoco:jacoco-maven-plugin:0.7.0.201403182114
[INFO] Skipping JaCoCo execution because property jacoco.skip is set.
[INFO] Skipping JaCoCo execution because property jacoco.skip is set.
[INFO] configuring report plugin org.apache.rat:apache-rat-plugin:0.10
[INFO] Parent project loaded from repository: org.apache.qpid:qpid-parent:pom:1.0
[INFO] Parent project loaded from repository: org.apache:apache:pom:14
[INFO] Relativizing decoration links with respect to project URL: http://qpid.apache.org/qpid-java-build/qpid-systests-parent/qpid-bdbstore-systests
[INFO] Rendering site with org.apache.maven.skins:maven-default-skin:jar:1.0 skin.
[INFO] Generating "About" report    --- maven-project-info-reports-plugin:2.7
[INFO] Generating "Plugin Management" report    --- maven-project-info-reports-plugin:2.7
[INFO] Generating "Distribution Management" report    --- maven-project-info-reports-plugin:2.7
[INFO] Generating "Dependency Information" report    --- maven-project-info-reports-plugin:2.7
[INFO] Generating "Dependency Convergence" report    --- maven-project-info-reports-plugin:2.7
[INFO] Generating "Source Repository" report    --- maven-project-info-reports-plugin:2.7
[INFO] Generating "Mailing Lists" report    --- maven-project-info-reports-plugin:2.7
[INFO] Generating "Issue Tracking" report    --- maven-project-info-reports-plugin:2.7
[INFO] Generating "Continuous Integration" report    --- maven-project-info-reports-plugin:2.7
[INFO] Generating "Project Plugins" report    --- maven-project-info-reports-plugin:2.7
[INFO] Generating "Project License" report    --- maven-project-info-reports-plugin:2.7
[INFO] Generating "Dependency Management" report    --- maven-project-info-reports-plugin:2.7
[INFO] Generating "Project Team" report    --- maven-project-info-reports-plugin:2.7
[INFO] Generating "Project Summary" report    --- maven-project-info-reports-plugin:2.7
[INFO] Generating "Dependencies" report    --- maven-project-info-reports-plugin:2.7
[INFO] Generating "Third Parties" report    --- license-maven-plugin:1.6
[INFO] Generating "Surefire Report" report    --- maven-surefire-report-plugin:2.16
[INFO] Generating "Test Source Xref" report    --- maven-jxr-plugin:2.3
[INFO] Generating "Rat Report" report    --- apache-rat-plugin:0.10
[INFO] 51 implicit excludes (use -debug for more details).
[INFO] Exclude: build/**
[INFO] Exclude: lib/**
[INFO] Exclude: test-profiles/test_resources/ssl/**
[INFO] 9 resources included (use -debug for more details)
Warning:  org.apache.xerces.jaxp.SAXParserImpl$JAXPSAXParser: Property 'http://www.oracle.com/xml/jaxp/properties/entityExpansionLimit'
is not recognized.
Compiler warnings:
  WARNING:  'org.apache.xerces.jaxp.SAXParserImpl: Property 'http://javax.xml.XMLConstants/property/accessExternalDTD'
is not recognized.'
Warning:  org.apache.xerces.parsers.SAXParser: Feature 'http://javax.xml.XMLConstants/feature/secure-processing'
is not recognized.
Warning:  org.apache.xerces.parsers.SAXParser: Property 'http://javax.xml.XMLConstants/property/accessExternalDTD'
is not recognized.
Warning:  org.apache.xerces.parsers.SAXParser: Property 'http://www.oracle.com/xml/jaxp/properties/entityExpansionLimit'
is not recognized.
[INFO] 
[INFO] --- maven-site-plugin:3.3:stage (default-cli) @ qpid-bdbstore-systests ---
[INFO] Using this base directory for staging: /x1/jenkins/jenkins-slave/workspace/Qpid-Java-Java-Test-JDK1.8/trunk/qpid/java/target/staging
[INFO] Parent project loaded from repository: org.apache.qpid:qpid-parent:pom:1.0
file:///x1/jenkins/jenkins-slave/workspace/Qpid-Java-Java-Test-JDK1.8/trunk/qpid/java/target/staging/
- Session: Opened  
[INFO] Pushing /x1/jenkins/jenkins-slave/workspace/Qpid-Java-Java-Test-JDK1.8/trunk/qpid/java/bdbstore/systests/target/site
[INFO]    >>> to file:///x1/jenkins/jenkins-slave/workspace/Qpid-Java-Java-Test-JDK1.8/trunk/qpid/java/target/staging/bdbstore/systests/qpid-systests-parent/qpid-bdbstore-systests
file:///x1/jenkins/jenkins-slave/workspace/Qpid-Java-Java-Test-JDK1.8/trunk/qpid/java/target/staging/
- Session: Disconnecting  
file:///x1/jenkins/jenkins-slave/workspace/Qpid-Java-Java-Test-JDK1.8/trunk/qpid/java/target/staging/
- Session: Disconnected
[INFO] ------------------------------------------------------------------------
[INFO] Reactor Summary:
[INFO] 
[INFO] Qpid Java Build ................................... SUCCESS [23.113s]
[INFO] Qpid AMQP 1.0 Common .............................. SUCCESS [7.145s]
[INFO] Qpid AMQP 1.0 Client .............................. SUCCESS [1.985s]
[INFO] Qpid AMQP 1.0 Client JMS .......................... SUCCESS [2.756s]
[INFO] Qpid AMQP 1.0 JMS Client Examples ................. SUCCESS [1.464s]
[INFO] Qpid AMQP 1.0 Client WebSocket .................... SUCCESS [1.880s]
[INFO] Qpid Broker Code Generation ....................... SUCCESS [1.586s]
[INFO] Qpid Test Utilities ............................... SUCCESS [1.602s]
[INFO] Qpid Common ....................................... SUCCESS [32.535s]
[INFO] Qpid Management Common ............................ SUCCESS [2.964s]
[INFO] Qpid Java Broker Core ............................. SUCCESS [1:41.088s]
[INFO] Qpid Access Control Broker Plug-in ................ SUCCESS [4.851s]
[INFO] Qpid AMQP 0-8 Protocol Broker Plug-in ............. SUCCESS [21.388s]
[INFO] Qpid AMQP 0-10 Protocol Plug-in ................... SUCCESS [4.324s]
[INFO] Qpid AMQP 1-0 Protocol Broker Plug-in ............. SUCCESS [2.108s]
[INFO] Qpid AMQP 0-8 to 0-10 Message Conversion Broker Plug-in  SUCCESS [1.607s]
[INFO] Qpid AMQP 0-8 to 1-0 Message Conversion Broker Plug-in  SUCCESS [1.866s]
[INFO] Qpid AMQP 0-10 to 1-0 Message Conversion Broker Plug-in  SUCCESS [1.527s]
[INFO] Qpid Derby Message Store .......................... SUCCESS [1:38.971s]
[INFO] Qpid JDBC Message Store Connection Pooling Plug-in  SUCCESS [1.532s]
[INFO] Qpid JDBC Message Store Broker Plug-in ............ SUCCESS [8.412s]
[INFO] Qpid HTTP Management Broker Plug-in ............... SUCCESS [7.111s]
[INFO] Qpid JMX Management Broker Plug-in ................ SUCCESS [3.983s]
[INFO] Qpid Memory Message Store Broker Plug-in .......... SUCCESS [1.575s]
[INFO] Qpid WebSocket Broker Plug-in ..................... SUCCESS [1.706s]
[INFO] Qpid AMQP 0-x JMS Client .......................... SUCCESS [7.741s]
[INFO] Qpid BDB Message Store ............................ SUCCESS [40.096s]
[INFO] Qpid BDB Message Store JMX ........................ SUCCESS [2.892s]
[INFO] Qpid Java Broker .................................. SUCCESS [5.382s]
[INFO] Qpid AMQP Management Protocol Broker Plug-in ...... SUCCESS [1.436s]
[INFO] Qpid AMQP 0-x JMS Client Examples ................. SUCCESS [1.243s]
[INFO] Qpid JCA .......................................... SUCCESS [3.200s]
[INFO] Qpid Resource Adaptor ............................. SUCCESS [1.391s]
[INFO] Qpid Tools ........................................ SUCCESS [1.552s]
[INFO] Qpid Management Examples .......................... SUCCESS [1.211s]
[INFO] Qpid Java System Test Parent ...................... SUCCESS [1.537s]
[INFO] Qpid System Tests ................................. SUCCESS [15:16.044s]
[INFO] Qpid Performance Tests ............................ SUCCESS [26.136s]
[INFO] Qpid Performance Test System Tests ................ FAILURE [17.382s]
[INFO] Qpid Performance Tests Visualisation JFC .......... SUCCESS [6.946s]
[INFO] Qpid BDB Store System Tests ....................... SUCCESS [3.957s]
[INFO] ------------------------------------------------------------------------
[INFO] BUILD FAILURE
[INFO] ------------------------------------------------------------------------
[INFO] Total time: 22:58.026s
[INFO] Finished at: Tue Feb 10 02:26:28 UTC 2015
[INFO] Final Memory: 113M/923M
[INFO] ------------------------------------------------------------------------
[ERROR] Failed to execute goal org.apache.maven.plugins:maven-surefire-plugin:2.16:test (integration-test)
on project qpid-perftests-systests: There are test failures.
[ERROR] 
[ERROR] Please refer to /x1/jenkins/jenkins-slave/workspace/Qpid-Java-Java-Test-JDK1.8/trunk/qpid/java/qpid-perftests-systests/target/surefire-reports
for the individual test results.
[ERROR] -> [Help 1]
[ERROR] 
[ERROR] To see the full stack trace of the errors, re-run Maven with the -e switch.
[ERROR] Re-run Maven using the -X switch to enable full debug logging.
[ERROR] 
[ERROR] For more information about the errors and possible solutions, please read the following
articles:
[ERROR] [Help 1] http://cwiki.apache.org/confluence/display/MAVEN/MojoFailureException
[ERROR] 
[ERROR] After correcting the problems, you can resume the build with the command
[ERROR]   mvn <goals> -rf :qpid-perftests-systests
Build step 'Invoke top-level Maven targets' marked build as failure
[locks-and-latches] Releasing all the locks
[locks-and-latches] All the locks released
Recording test results

Mime
View raw message