qpid-notifications mailing list archives

Site index · List index
Message view « Date » · « Thread »
Top « Date » · « Thread »
From Apache Jenkins Server <jenk...@builds.apache.org>
Subject Build failed in Jenkins: Qpid-proton-j-Deploy » proton-j #394
Date Fri, 20 Feb 2015 03:03:46 GMT
See <https://builds.apache.org/job/Qpid-proton-j-Deploy/org.apache.qpid$proton-j/394/changes>

Changes:

[dominic.evans] PROTON-811: safely handle TransportException

[dominic.evans] PROTON-811: FrameWriter: stop encoding a null body

[dominic.evans] PROTON-811: fix coding error in TransportImpl#tick

------------------------------------------
[INFO]                                                                         
[INFO] ------------------------------------------------------------------------
[INFO] Building proton-j 1.0-SNAPSHOT
[INFO] ------------------------------------------------------------------------
Downloading: http://repo.maven.apache.org/maven2/org/apache/maven/plugins/maven-resources-plugin/2.6/maven-resources-plugin-2.6.pom
Downloaded: http://repo.maven.apache.org/maven2/org/apache/maven/plugins/maven-resources-plugin/2.6/maven-resources-plugin-2.6.pom
(8 KB at 107.1 KB/sec)
Downloading: http://repo.maven.apache.org/maven2/org/apache/maven/plugins/maven-resources-plugin/2.6/maven-resources-plugin-2.6.jar
Downloaded: http://repo.maven.apache.org/maven2/org/apache/maven/plugins/maven-resources-plugin/2.6/maven-resources-plugin-2.6.jar
(29 KB at 389.6 KB/sec)
Downloading: http://repo.maven.apache.org/maven2/org/apache/maven/plugins/maven-compiler-plugin/2.5.1/maven-compiler-plugin-2.5.1.pom
Downloaded: http://repo.maven.apache.org/maven2/org/apache/maven/plugins/maven-compiler-plugin/2.5.1/maven-compiler-plugin-2.5.1.pom
(8 KB at 103.2 KB/sec)
Downloading: http://repo.maven.apache.org/maven2/org/apache/maven/plugins/maven-compiler-plugin/2.5.1/maven-compiler-plugin-2.5.1.jar
Downloaded: http://repo.maven.apache.org/maven2/org/apache/maven/plugins/maven-compiler-plugin/2.5.1/maven-compiler-plugin-2.5.1.jar
(32 KB at 434.9 KB/sec)
Downloading: http://repo.maven.apache.org/maven2/org/apache/maven/plugins/maven-surefire-plugin/2.12.4/maven-surefire-plugin-2.12.4.pom
Downloaded: http://repo.maven.apache.org/maven2/org/apache/maven/plugins/maven-surefire-plugin/2.12.4/maven-surefire-plugin-2.12.4.pom
(11 KB at 138.2 KB/sec)
Downloading: http://repo.maven.apache.org/maven2/org/apache/maven/surefire/surefire/2.12.4/surefire-2.12.4.pom
Downloaded: http://repo.maven.apache.org/maven2/org/apache/maven/surefire/surefire/2.12.4/surefire-2.12.4.pom
(14 KB at 182.0 KB/sec)
Downloading: http://repo.maven.apache.org/maven2/org/apache/maven/plugins/maven-surefire-plugin/2.12.4/maven-surefire-plugin-2.12.4.jar
Downloaded: http://repo.maven.apache.org/maven2/org/apache/maven/plugins/maven-surefire-plugin/2.12.4/maven-surefire-plugin-2.12.4.jar
(30 KB at 396.6 KB/sec)
Downloading: http://repo.maven.apache.org/maven2/org/apache/maven/plugins/maven-jar-plugin/2.4/maven-jar-plugin-2.4.pom
Downloaded: http://repo.maven.apache.org/maven2/org/apache/maven/plugins/maven-jar-plugin/2.4/maven-jar-plugin-2.4.pom
(6 KB at 77.0 KB/sec)
Downloading: http://repo.maven.apache.org/maven2/org/apache/maven/plugins/maven-jar-plugin/2.4/maven-jar-plugin-2.4.jar
Downloaded: http://repo.maven.apache.org/maven2/org/apache/maven/plugins/maven-jar-plugin/2.4/maven-jar-plugin-2.4.jar
(34 KB at 449.0 KB/sec)
[INFO] 
[INFO] --- maven-clean-plugin:2.5:clean (default-clean) @ proton-j ---
[INFO] 
[INFO] --- maven-remote-resources-plugin:1.4:process (default) @ proton-j ---
[INFO] 
[INFO] --- maven-resources-plugin:2.6:resources (default-resources) @ proton-j ---
Downloading: http://repo.maven.apache.org/maven2/org/codehaus/plexus/plexus-interpolation/1.13/plexus-interpolation-1.13.jar
Downloaded: http://repo.maven.apache.org/maven2/org/codehaus/plexus/plexus-interpolation/1.13/plexus-interpolation-1.13.jar
(60 KB at 774.4 KB/sec)
[INFO] Using 'UTF-8' encoding to copy filtered resources.
[INFO] Copying 18 resources
[INFO] Copying 3 resources
[INFO] 
[INFO] --- maven-compiler-plugin:2.5.1:compile (default-compile) @ proton-j ---
Downloading: http://repo.maven.apache.org/maven2/org/apache/maven/maven-core/2.0.9/maven-core-2.0.9.pom
Downloaded: http://repo.maven.apache.org/maven2/org/apache/maven/maven-core/2.0.9/maven-core-2.0.9.pom
(8 KB at 101.4 KB/sec)
Downloading: http://repo.maven.apache.org/maven2/org/apache/maven/maven-plugin-parameter-documenter/2.0.9/maven-plugin-parameter-documenter-2.0.9.pom
Downloaded: http://repo.maven.apache.org/maven2/org/apache/maven/maven-plugin-parameter-documenter/2.0.9/maven-plugin-parameter-documenter-2.0.9.pom
(2 KB at 25.9 KB/sec)
Downloading: http://repo.maven.apache.org/maven2/org/apache/maven/maven-error-diagnostics/2.0.9/maven-error-diagnostics-2.0.9.pom
Downloaded: http://repo.maven.apache.org/maven2/org/apache/maven/maven-error-diagnostics/2.0.9/maven-error-diagnostics-2.0.9.pom
(2 KB at 23.0 KB/sec)
Downloading: http://repo.maven.apache.org/maven2/org/apache/maven/maven-plugin-descriptor/2.0.9/maven-plugin-descriptor-2.0.9.pom
Downloaded: http://repo.maven.apache.org/maven2/org/apache/maven/maven-plugin-descriptor/2.0.9/maven-plugin-descriptor-2.0.9.pom
(3 KB at 27.4 KB/sec)
Downloading: http://repo.maven.apache.org/maven2/org/apache/maven/maven-monitor/2.0.9/maven-monitor-2.0.9.pom
Downloaded: http://repo.maven.apache.org/maven2/org/apache/maven/maven-monitor/2.0.9/maven-monitor-2.0.9.pom
(2 KB at 16.7 KB/sec)
Downloading: http://repo.maven.apache.org/maven2/org/apache/maven/maven-toolchain/1.0/maven-toolchain-1.0.pom
Downloaded: http://repo.maven.apache.org/maven2/org/apache/maven/maven-toolchain/1.0/maven-toolchain-1.0.pom
(4 KB at 45.1 KB/sec)
Downloading: http://repo.maven.apache.org/maven2/org/codehaus/plexus/plexus-compiler-api/1.9.1/plexus-compiler-api-1.9.1.pom
Downloaded: http://repo.maven.apache.org/maven2/org/codehaus/plexus/plexus-compiler-api/1.9.1/plexus-compiler-api-1.9.1.pom
(867 B at 11.4 KB/sec)
Downloading: http://repo.maven.apache.org/maven2/org/codehaus/plexus/plexus-compiler/1.9.1/plexus-compiler-1.9.1.pom
Downloaded: http://repo.maven.apache.org/maven2/org/codehaus/plexus/plexus-compiler/1.9.1/plexus-compiler-1.9.1.pom
(4 KB at 50.7 KB/sec)
Downloading: http://repo.maven.apache.org/maven2/org/codehaus/plexus/plexus-compiler-manager/1.9.1/plexus-compiler-manager-1.9.1.pom
Downloaded: http://repo.maven.apache.org/maven2/org/codehaus/plexus/plexus-compiler-manager/1.9.1/plexus-compiler-manager-1.9.1.pom
(692 B at 9.1 KB/sec)
Downloading: http://repo.maven.apache.org/maven2/org/codehaus/plexus/plexus-compiler-javac/1.9.1/plexus-compiler-javac-1.9.1.pom
Downloaded: http://repo.maven.apache.org/maven2/org/codehaus/plexus/plexus-compiler-javac/1.9.1/plexus-compiler-javac-1.9.1.pom
(688 B at 9.1 KB/sec)
Downloading: http://repo.maven.apache.org/maven2/org/codehaus/plexus/plexus-compilers/1.9.1/plexus-compilers-1.9.1.pom
Downloaded: http://repo.maven.apache.org/maven2/org/codehaus/plexus/plexus-compilers/1.9.1/plexus-compilers-1.9.1.pom
(2 KB at 16.2 KB/sec)
Downloading: http://repo.maven.apache.org/maven2/org/codehaus/plexus/plexus-compiler-api/1.9.1/plexus-compiler-api-1.9.1.jar
Downloading: http://repo.maven.apache.org/maven2/org/codehaus/plexus/plexus-compiler-manager/1.9.1/plexus-compiler-manager-1.9.1.jar
Downloading: http://repo.maven.apache.org/maven2/org/codehaus/plexus/plexus-compiler-javac/1.9.1/plexus-compiler-javac-1.9.1.jar
Downloaded: http://repo.maven.apache.org/maven2/org/codehaus/plexus/plexus-compiler-manager/1.9.1/plexus-compiler-manager-1.9.1.jar
(5 KB at 60.9 KB/sec)
Downloaded: http://repo.maven.apache.org/maven2/org/codehaus/plexus/plexus-compiler-api/1.9.1/plexus-compiler-api-1.9.1.jar
(21 KB at 278.6 KB/sec)
Downloaded: http://repo.maven.apache.org/maven2/org/codehaus/plexus/plexus-compiler-javac/1.9.1/plexus-compiler-javac-1.9.1.jar
(14 KB at 183.9 KB/sec)
[INFO] Compiling 301 source files to <https://builds.apache.org/job/Qpid-proton-j-Deploy/org.apache.qpid$proton-j/ws/target/classes>
[WARNING] <https://builds.apache.org/job/Qpid-proton-j-Deploy/org.apache.qpid$proton-j/ws/src/main/java/org/apache/qpid/proton/engine/Connection.java>:[44,19]
[deprecation] ConnectionImpl() in org.apache.qpid.proton.engine.impl.ConnectionImpl has been
deprecated
[WARNING] <https://builds.apache.org/job/Qpid-proton-j-Deploy/org.apache.qpid$proton-j/ws/src/main/java/org/apache/qpid/proton/engine/Transport.java>:[73,19]
[deprecation] TransportImpl() in org.apache.qpid.proton.engine.impl.TransportImpl has been
deprecated
[WARNING] <https://builds.apache.org/job/Qpid-proton-j-Deploy/org.apache.qpid$proton-j/ws/src/main/java/org/apache/qpid/proton/engine/SslDomain.java>:[32,19]
[deprecation] SslDomainImpl() in org.apache.qpid.proton.engine.impl.ssl.SslDomainImpl has
been deprecated
[WARNING] <https://builds.apache.org/job/Qpid-proton-j-Deploy/org.apache.qpid$proton-j/ws/src/main/java/org/apache/qpid/proton/engine/SslPeerDetails.java>:[37,19]
[deprecation] SslPeerDetailsImpl(java.lang.String,int) in org.apache.qpid.proton.engine.impl.ssl.SslPeerDetailsImpl
has been deprecated
[WARNING] <https://builds.apache.org/job/Qpid-proton-j-Deploy/org.apache.qpid$proton-j/ws/src/main/java/org/apache/qpid/proton/engine/impl/TransportImpl.java>:[302,15]
[deprecation] output(byte[],int,int) in org.apache.qpid.proton.engine.Transport has been deprecated
[WARNING] <https://builds.apache.org/job/Qpid-proton-j-Deploy/org.apache.qpid$proton-j/ws/src/main/java/org/apache/qpid/proton/engine/impl/TransportImpl.java>:[271,15]
[deprecation] input(byte[],int,int) in org.apache.qpid.proton.engine.Transport has been deprecated
[WARNING] <https://builds.apache.org/job/Qpid-proton-j-Deploy/org.apache.qpid$proton-j/ws/src/main/java/org/apache/qpid/proton/engine/impl/LinkImpl.java>:[329,16]
[deprecation] setRemoteSenderSettleMode(org.apache.qpid.proton.amqp.transport.SenderSettleMode)
in org.apache.qpid.proton.engine.Link has been deprecated
[WARNING] <https://builds.apache.org/job/Qpid-proton-j-Deploy/org.apache.qpid$proton-j/ws/src/main/java/org/apache/qpid/proton/message/Message.java>:[45,19]
[deprecation] MessageImpl() in org.apache.qpid.proton.message.impl.MessageImpl has been deprecated
[WARNING] <https://builds.apache.org/job/Qpid-proton-j-Deploy/org.apache.qpid$proton-j/ws/src/main/java/org/apache/qpid/proton/message/Message.java>:[55,19]
[deprecation] MessageImpl(org.apache.qpid.proton.amqp.messaging.Header,org.apache.qpid.proton.amqp.messaging.DeliveryAnnotations,org.apache.qpid.proton.amqp.messaging.MessageAnnotations,org.apache.qpid.proton.amqp.messaging.Properties,org.apache.qpid.proton.amqp.messaging.ApplicationProperties,org.apache.qpid.proton.amqp.messaging.Section,org.apache.qpid.proton.amqp.messaging.Footer)
in org.apache.qpid.proton.message.impl.MessageImpl has been deprecated
[WARNING] <https://builds.apache.org/job/Qpid-proton-j-Deploy/org.apache.qpid$proton-j/ws/src/main/java/org/apache/qpid/proton/messenger/Messenger.java>:[78,19]
[deprecation] MessengerImpl() in org.apache.qpid.proton.messenger.impl.MessengerImpl has been
deprecated
[WARNING] <https://builds.apache.org/job/Qpid-proton-j-Deploy/org.apache.qpid$proton-j/ws/src/main/java/org/apache/qpid/proton/messenger/Messenger.java>:[82,19]
[deprecation] MessengerImpl(java.lang.String) in org.apache.qpid.proton.messenger.impl.MessengerImpl
has been deprecated
[INFO] 
[INFO] --- maven-resources-plugin:2.6:testResources (default-testResources) @ proton-j ---
[INFO] Using 'UTF-8' encoding to copy filtered resources.
[INFO] Copying 1 resource
[INFO] Copying 3 resources
[INFO] 
[INFO] --- maven-compiler-plugin:2.5.1:testCompile (default-testCompile) @ proton-j ---
[INFO] Compiling 32 source files to <https://builds.apache.org/job/Qpid-proton-j-Deploy/org.apache.qpid$proton-j/ws/target/test-classes>
[INFO] -------------------------------------------------------------
[ERROR] COMPILATION ERROR : 
[INFO] -------------------------------------------------------------
[ERROR] <https://builds.apache.org/job/Qpid-proton-j-Deploy/org.apache.qpid$proton-j/ws/src/test/java/org/apache/qpid/proton/systemtests/engine/TransportTest.java>:[54,22]
[deprecation] input(byte[],int,int) in org.apache.qpid.proton.engine.Transport has been deprecated
[ERROR] <https://builds.apache.org/job/Qpid-proton-j-Deploy/org.apache.qpid$proton-j/ws/src/test/java/org/apache/qpid/proton/systemtests/engine/TransportTest.java>:[66,37]
[deprecation] output(byte[],int,int) in org.apache.qpid.proton.engine.Transport has been deprecated
[ERROR] <https://builds.apache.org/job/Qpid-proton-j-Deploy/org.apache.qpid$proton-j/ws/src/test/java/org/apache/qpid/proton/systemtests/engine/TransportTest.java>:[79,37]
[deprecation] input(byte[],int,int) in org.apache.qpid.proton.engine.Transport has been deprecated
[ERROR] <https://builds.apache.org/job/Qpid-proton-j-Deploy/org.apache.qpid$proton-j/ws/src/test/java/org/apache/qpid/proton/systemtests/engine/TransportTest.java>:[83,36]
[deprecation] output(byte[],int,int) in org.apache.qpid.proton.engine.Transport has been deprecated
[ERROR] <https://builds.apache.org/job/Qpid-proton-j-Deploy/org.apache.qpid$proton-j/ws/src/test/java/org/apache/qpid/proton/systemtests/engine/TransportPumper.java>:[64,40]
[deprecation] output(byte[],int,int) in org.apache.qpid.proton.engine.Transport has been deprecated
[ERROR] <https://builds.apache.org/job/Qpid-proton-j-Deploy/org.apache.qpid$proton-j/ws/src/test/java/org/apache/qpid/proton/systemtests/engine/TransportPumper.java>:[67,52]
[deprecation] input(byte[],int,int) in org.apache.qpid.proton.engine.Transport has been deprecated
[ERROR] <https://builds.apache.org/job/Qpid-proton-j-Deploy/org.apache.qpid$proton-j/ws/src/test/java/org/apache/qpid/proton/engine/impl/ssl/RememberingTransportInput.java>:[28,0]
org.apache.qpid.proton.engine.impl.ssl.RememberingTransportInput is not abstract and does
not override abstract method position() in org.apache.qpid.proton.engine.impl.TransportInput
[ERROR] <https://builds.apache.org/job/Qpid-proton-j-Deploy/org.apache.qpid$proton-j/ws/src/test/java/org/apache/qpid/proton/systemtests/engine/ConnectionTest.java>:[91,45]
[deprecation] input(byte[],int,int) in org.apache.qpid.proton.engine.Transport has been deprecated
[ERROR] <https://builds.apache.org/job/Qpid-proton-j-Deploy/org.apache.qpid$proton-j/ws/src/test/java/org/apache/qpid/proton/systemtests/engine/ConnectionTest.java>:[118,45]
[deprecation] input(byte[],int,int) in org.apache.qpid.proton.engine.Transport has been deprecated
[ERROR] <https://builds.apache.org/job/Qpid-proton-j-Deploy/org.apache.qpid$proton-j/ws/src/test/java/org/apache/qpid/proton/systemtests/engine/ConnectionTest.java>:[149,45]
[deprecation] input(byte[],int,int) in org.apache.qpid.proton.engine.Transport has been deprecated
[ERROR] <https://builds.apache.org/job/Qpid-proton-j-Deploy/org.apache.qpid$proton-j/ws/src/test/java/org/apache/qpid/proton/systemtests/engine/ConnectionTest.java>:[167,45]
[deprecation] input(byte[],int,int) in org.apache.qpid.proton.engine.Transport has been deprecated
[ERROR] <https://builds.apache.org/job/Qpid-proton-j-Deploy/org.apache.qpid$proton-j/ws/src/test/java/org/apache/qpid/proton/systemtests/engine/ConnectionTest.java>:[194,44]
[deprecation] input(byte[],int,int) in org.apache.qpid.proton.engine.Transport has been deprecated
[ERROR] <https://builds.apache.org/job/Qpid-proton-j-Deploy/org.apache.qpid$proton-j/ws/src/test/java/org/apache/qpid/proton/systemtests/engine/ConnectionTest.java>:[213,33]
[deprecation] input(byte[],int,int) in org.apache.qpid.proton.engine.Transport has been deprecated
[ERROR] <https://builds.apache.org/job/Qpid-proton-j-Deploy/org.apache.qpid$proton-j/ws/src/test/java/org/apache/qpid/proton/systemtests/engine/ConnectionTest.java>:[401,24]
[deprecation] input(byte[],int,int) in org.apache.qpid.proton.engine.Transport has been deprecated
[ERROR] <https://builds.apache.org/job/Qpid-proton-j-Deploy/org.apache.qpid$proton-j/ws/src/test/java/org/apache/qpid/proton/engine/impl/TransportImplTest.java>:[231,12]
[deprecation] TransportImpl() in org.apache.qpid.proton.engine.impl.TransportImpl has been
deprecated
[INFO] 15 errors 
[INFO] -------------------------------------------------------------
[JENKINS] Archiving disabled

Mime
View raw message