qpid-notifications mailing list archives

Site index · List index
Message view « Date » · « Thread »
Top « Date » · « Thread »
From Apache Jenkins Server <jenk...@builds.apache.org>
Subject Build failed in Jenkins: Qpid-Java-Cpp-Test #2402
Date Mon, 09 Feb 2015 15:27:59 GMT
See <https://builds.apache.org/job/Qpid-Java-Cpp-Test/2402/changes>

Changes:

[orudyy] QPID-6365: [Java Broker] Only expose secure attribute values when transport is SSL
and initial configuration is requested

------------------------------------------
[...truncated 6792 lines...]
	at sun.net.NetworkClient.doConnect(NetworkClient.java:175)
	at sun.net.www.http.HttpClient.openServer(HttpClient.java:378)
	at sun.net.www.http.HttpClient.openServer(HttpClient.java:473)
	at sun.net.www.http.HttpClient.<init>(HttpClient.java:203)
	at sun.net.www.http.HttpClient.New(HttpClient.java:290)
	at sun.net.www.http.HttpClient.New(HttpClient.java:306)
	at sun.net.www.protocol.http.HttpURLConnection.getNewHttpClient(HttpURLConnection.java:995)
	at sun.net.www.protocol.http.HttpURLConnection.plainConnect(HttpURLConnection.java:931)
	at sun.net.www.protocol.http.HttpURLConnection.connect(HttpURLConnection.java:849)
	at sun.net.www.protocol.http.HttpURLConnection.getOutputStream(HttpURLConnection.java:1090)
	at org.apache.qpid.systest.rest.RestTestHelper.writeJsonRequest(RestTestHelper.java:234)
	at org.apache.qpid.systest.rest.RestTestHelper.submitRequest(RestTestHelper.java:508)
	at org.apache.qpid.systest.rest.RestTestHelper.submitRequest(RestTestHelper.java:522)
	at org.apache.qpid.server.store.berkeleydb.replication.BDBHAVirtualHostNodeRestTest.createHANode(BDBHAVirtualHostNodeRestTest.java:317)
	at org.apache.qpid.server.store.berkeleydb.replication.BDBHAVirtualHostNodeRestTest.testMutateStateOfOneNode(BDBHAVirtualHostNodeRestTest.java:103)

testIntruderProtection(org.apache.qpid.server.store.berkeleydb.replication.BDBHAVirtualHostNodeRestTest)
 Time elapsed: 0.037 sec  <<< ERROR!
java.net.ConnectException: Connection refused
	at java.net.PlainSocketImpl.socketConnect(Native Method)
	at java.net.AbstractPlainSocketImpl.doConnect(AbstractPlainSocketImpl.java:339)
	at java.net.AbstractPlainSocketImpl.connectToAddress(AbstractPlainSocketImpl.java:200)
	at java.net.AbstractPlainSocketImpl.connect(AbstractPlainSocketImpl.java:182)
	at java.net.SocksSocketImpl.connect(SocksSocketImpl.java:392)
	at java.net.Socket.connect(Socket.java:579)
	at sun.net.NetworkClient.doConnect(NetworkClient.java:175)
	at sun.net.www.http.HttpClient.openServer(HttpClient.java:378)
	at sun.net.www.http.HttpClient.openServer(HttpClient.java:473)
	at sun.net.www.http.HttpClient.<init>(HttpClient.java:203)
	at sun.net.www.http.HttpClient.New(HttpClient.java:290)
	at sun.net.www.http.HttpClient.New(HttpClient.java:306)
	at sun.net.www.protocol.http.HttpURLConnection.getNewHttpClient(HttpURLConnection.java:995)
	at sun.net.www.protocol.http.HttpURLConnection.plainConnect(HttpURLConnection.java:931)
	at sun.net.www.protocol.http.HttpURLConnection.connect(HttpURLConnection.java:849)
	at sun.net.www.protocol.http.HttpURLConnection.getOutputStream(HttpURLConnection.java:1090)
	at org.apache.qpid.systest.rest.RestTestHelper.writeJsonRequest(RestTestHelper.java:234)
	at org.apache.qpid.systest.rest.RestTestHelper.submitRequest(RestTestHelper.java:508)
	at org.apache.qpid.systest.rest.RestTestHelper.submitRequest(RestTestHelper.java:522)
	at org.apache.qpid.server.store.berkeleydb.replication.BDBHAVirtualHostNodeRestTest.createHANode(BDBHAVirtualHostNodeRestTest.java:317)
	at org.apache.qpid.server.store.berkeleydb.replication.BDBHAVirtualHostNodeRestTest.testIntruderProtection(BDBHAVirtualHostNodeRestTest.java:252)

testDeleteMasterNode(org.apache.qpid.server.store.berkeleydb.replication.BDBHAVirtualHostNodeRestTest)
 Time elapsed: 0.038 sec  <<< ERROR!
java.net.ConnectException: Connection refused
	at java.net.PlainSocketImpl.socketConnect(Native Method)
	at java.net.AbstractPlainSocketImpl.doConnect(AbstractPlainSocketImpl.java:339)
	at java.net.AbstractPlainSocketImpl.connectToAddress(AbstractPlainSocketImpl.java:200)
	at java.net.AbstractPlainSocketImpl.connect(AbstractPlainSocketImpl.java:182)
	at java.net.SocksSocketImpl.connect(SocksSocketImpl.java:392)
	at java.net.Socket.connect(Socket.java:579)
	at sun.net.NetworkClient.doConnect(NetworkClient.java:175)
	at sun.net.www.http.HttpClient.openServer(HttpClient.java:378)
	at sun.net.www.http.HttpClient.openServer(HttpClient.java:473)
	at sun.net.www.http.HttpClient.<init>(HttpClient.java:203)
	at sun.net.www.http.HttpClient.New(HttpClient.java:290)
	at sun.net.www.http.HttpClient.New(HttpClient.java:306)
	at sun.net.www.protocol.http.HttpURLConnection.getNewHttpClient(HttpURLConnection.java:995)
	at sun.net.www.protocol.http.HttpURLConnection.plainConnect(HttpURLConnection.java:931)
	at sun.net.www.protocol.http.HttpURLConnection.connect(HttpURLConnection.java:849)
	at sun.net.www.protocol.http.HttpURLConnection.getOutputStream(HttpURLConnection.java:1090)
	at org.apache.qpid.systest.rest.RestTestHelper.writeJsonRequest(RestTestHelper.java:234)
	at org.apache.qpid.systest.rest.RestTestHelper.submitRequest(RestTestHelper.java:508)
	at org.apache.qpid.systest.rest.RestTestHelper.submitRequest(RestTestHelper.java:522)
	at org.apache.qpid.server.store.berkeleydb.replication.BDBHAVirtualHostNodeRestTest.createHANode(BDBHAVirtualHostNodeRestTest.java:317)
	at org.apache.qpid.server.store.berkeleydb.replication.BDBHAVirtualHostNodeRestTest.testDeleteMasterNode(BDBHAVirtualHostNodeRestTest.java:192)

testCreate3NodeGroup(org.apache.qpid.server.store.berkeleydb.replication.BDBHAVirtualHostNodeRestTest)
 Time elapsed: 0.051 sec  <<< ERROR!
java.net.ConnectException: Connection refused
	at java.net.PlainSocketImpl.socketConnect(Native Method)
	at java.net.AbstractPlainSocketImpl.doConnect(AbstractPlainSocketImpl.java:339)
	at java.net.AbstractPlainSocketImpl.connectToAddress(AbstractPlainSocketImpl.java:200)
	at java.net.AbstractPlainSocketImpl.connect(AbstractPlainSocketImpl.java:182)
	at java.net.SocksSocketImpl.connect(SocksSocketImpl.java:392)
	at java.net.Socket.connect(Socket.java:579)
	at sun.net.NetworkClient.doConnect(NetworkClient.java:175)
	at sun.net.www.http.HttpClient.openServer(HttpClient.java:378)
	at sun.net.www.http.HttpClient.openServer(HttpClient.java:473)
	at sun.net.www.http.HttpClient.<init>(HttpClient.java:203)
	at sun.net.www.http.HttpClient.New(HttpClient.java:290)
	at sun.net.www.http.HttpClient.New(HttpClient.java:306)
	at sun.net.www.protocol.http.HttpURLConnection.getNewHttpClient(HttpURLConnection.java:995)
	at sun.net.www.protocol.http.HttpURLConnection.plainConnect(HttpURLConnection.java:931)
	at sun.net.www.protocol.http.HttpURLConnection.connect(HttpURLConnection.java:849)
	at sun.net.www.protocol.http.HttpURLConnection.getOutputStream(HttpURLConnection.java:1090)
	at org.apache.qpid.systest.rest.RestTestHelper.writeJsonRequest(RestTestHelper.java:234)
	at org.apache.qpid.systest.rest.RestTestHelper.submitRequest(RestTestHelper.java:508)
	at org.apache.qpid.systest.rest.RestTestHelper.submitRequest(RestTestHelper.java:522)
	at org.apache.qpid.server.store.berkeleydb.replication.BDBHAVirtualHostNodeRestTest.createHANode(BDBHAVirtualHostNodeRestTest.java:317)
	at org.apache.qpid.server.store.berkeleydb.replication.BDBHAVirtualHostNodeRestTest.testCreate3NodeGroup(BDBHAVirtualHostNodeRestTest.java:92)

testDeleteReplicaNode(org.apache.qpid.server.store.berkeleydb.replication.BDBHAVirtualHostNodeRestTest)
 Time elapsed: 0.037 sec  <<< ERROR!
java.net.ConnectException: Connection refused
	at java.net.PlainSocketImpl.socketConnect(Native Method)
	at java.net.AbstractPlainSocketImpl.doConnect(AbstractPlainSocketImpl.java:339)
	at java.net.AbstractPlainSocketImpl.connectToAddress(AbstractPlainSocketImpl.java:200)
	at java.net.AbstractPlainSocketImpl.connect(AbstractPlainSocketImpl.java:182)
	at java.net.SocksSocketImpl.connect(SocksSocketImpl.java:392)
	at java.net.Socket.connect(Socket.java:579)
	at sun.net.NetworkClient.doConnect(NetworkClient.java:175)
	at sun.net.www.http.HttpClient.openServer(HttpClient.java:378)
	at sun.net.www.http.HttpClient.openServer(HttpClient.java:473)
	at sun.net.www.http.HttpClient.<init>(HttpClient.java:203)
	at sun.net.www.http.HttpClient.New(HttpClient.java:290)
	at sun.net.www.http.HttpClient.New(HttpClient.java:306)
	at sun.net.www.protocol.http.HttpURLConnection.getNewHttpClient(HttpURLConnection.java:995)
	at sun.net.www.protocol.http.HttpURLConnection.plainConnect(HttpURLConnection.java:931)
	at sun.net.www.protocol.http.HttpURLConnection.connect(HttpURLConnection.java:849)
	at sun.net.www.protocol.http.HttpURLConnection.getOutputStream(HttpURLConnection.java:1090)
	at org.apache.qpid.systest.rest.RestTestHelper.writeJsonRequest(RestTestHelper.java:234)
	at org.apache.qpid.systest.rest.RestTestHelper.submitRequest(RestTestHelper.java:508)
	at org.apache.qpid.systest.rest.RestTestHelper.submitRequest(RestTestHelper.java:522)
	at org.apache.qpid.server.store.berkeleydb.replication.BDBHAVirtualHostNodeRestTest.createHANode(BDBHAVirtualHostNodeRestTest.java:317)
	at org.apache.qpid.server.store.berkeleydb.replication.BDBHAVirtualHostNodeRestTest.testDeleteReplicaNode(BDBHAVirtualHostNodeRestTest.java:166)

testIntruderBDBHAVHNNotAllowedToConnect(org.apache.qpid.server.store.berkeleydb.replication.BDBHAVirtualHostNodeRestTest)
 Time elapsed: 0.035 sec  <<< ERROR!
java.net.ConnectException: Connection refused
	at java.net.PlainSocketImpl.socketConnect(Native Method)
	at java.net.AbstractPlainSocketImpl.doConnect(AbstractPlainSocketImpl.java:339)
	at java.net.AbstractPlainSocketImpl.connectToAddress(AbstractPlainSocketImpl.java:200)
	at java.net.AbstractPlainSocketImpl.connect(AbstractPlainSocketImpl.java:182)
	at java.net.SocksSocketImpl.connect(SocksSocketImpl.java:392)
	at java.net.Socket.connect(Socket.java:579)
	at sun.net.NetworkClient.doConnect(NetworkClient.java:175)
	at sun.net.www.http.HttpClient.openServer(HttpClient.java:378)
	at sun.net.www.http.HttpClient.openServer(HttpClient.java:473)
	at sun.net.www.http.HttpClient.<init>(HttpClient.java:203)
	at sun.net.www.http.HttpClient.New(HttpClient.java:290)
	at sun.net.www.http.HttpClient.New(HttpClient.java:306)
	at sun.net.www.protocol.http.HttpURLConnection.getNewHttpClient(HttpURLConnection.java:995)
	at sun.net.www.protocol.http.HttpURLConnection.plainConnect(HttpURLConnection.java:931)
	at sun.net.www.protocol.http.HttpURLConnection.connect(HttpURLConnection.java:849)
	at sun.net.www.protocol.http.HttpURLConnection.getOutputStream(HttpURLConnection.java:1090)
	at org.apache.qpid.systest.rest.RestTestHelper.writeJsonRequest(RestTestHelper.java:234)
	at org.apache.qpid.systest.rest.RestTestHelper.submitRequest(RestTestHelper.java:508)
	at org.apache.qpid.systest.rest.RestTestHelper.submitRequest(RestTestHelper.java:522)
	at org.apache.qpid.server.store.berkeleydb.replication.BDBHAVirtualHostNodeRestTest.createHANode(BDBHAVirtualHostNodeRestTest.java:317)
	at org.apache.qpid.server.store.berkeleydb.replication.BDBHAVirtualHostNodeRestTest.testIntruderBDBHAVHNNotAllowedToConnect(BDBHAVirtualHostNodeRestTest.java:232)

Running org.apache.qpid.server.store.berkeleydb.BDBBackupTest
Tests run: 0, Failures: 0, Errors: 0, Skipped: 0, Time elapsed: 0 sec - in org.apache.qpid.server.store.berkeleydb.BDBBackupTest

Results :

Failed tests: 
  TwoNodeTest>QpidTestCase.run:148->QpidBrokerTestCase.runBare:272->setUp:55 null
  TwoNodeTest>QpidTestCase.run:148->QpidBrokerTestCase.runBare:272->setUp:55 null
  TwoNodeTest>QpidTestCase.run:148->QpidBrokerTestCase.runBare:272->setUp:55 null
  TwoNodeTest>QpidTestCase.run:148->QpidBrokerTestCase.runBare:272->setUp:55 null
  TwoNodeTest>QpidTestCase.run:148->QpidBrokerTestCase.runBare:272->setUp:55 null
  TwoNodeTest>QpidTestCase.run:148->QpidBrokerTestCase.runBare:272->setUp:55 null
  TwoNodeTest>QpidTestCase.run:148->QpidBrokerTestCase.runBare:272->setUp:55 null
  MultiNodeTest>QpidTestCase.run:148->QpidBrokerTestCase.runBare:272->setUp:81 null
  MultiNodeTest>QpidTestCase.run:148->QpidBrokerTestCase.runBare:272->setUp:81 null
  MultiNodeTest>QpidTestCase.run:148->QpidBrokerTestCase.runBare:272->setUp:81 null
  MultiNodeTest>QpidTestCase.run:148->QpidBrokerTestCase.runBare:272->setUp:81 null
  MultiNodeTest>QpidTestCase.run:148->QpidBrokerTestCase.runBare:272->setUp:81 null
  MultiNodeTest>QpidTestCase.run:148->QpidBrokerTestCase.runBare:272->setUp:81 null
  MultiNodeTest>QpidTestCase.run:148->QpidBrokerTestCase.runBare:272->setUp:81 null
  MultiNodeTest>QpidTestCase.run:148->QpidBrokerTestCase.runBare:272->setUp:81 null
  MultiNodeTest>QpidTestCase.run:148->QpidBrokerTestCase.runBare:272->setUp:81 null
  MultiNodeTest>QpidTestCase.run:148->QpidBrokerTestCase.runBare:272->setUp:81 null

Tests in error: 
  JMXManagementTest>QpidTestCase.run:148->QpidBrokerTestCase.runBare:272->testRemoveRemoteNodeFromGroup:164->getStoreBeanForNodeAtBrokerPort:276
» IO
  JMXManagementTest>QpidTestCase.run:148->QpidBrokerTestCase.runBare:272->testVirtualHostOperationsDeniedForNonMasterNode:187->getManagedBrokerBeanForNodeAtBrokerPort:283
» IO
  JMXManagementTest>QpidTestCase.run:148->QpidBrokerTestCase.runBare:272->testStateOfNonActiveBrokerIsNotMaster:133->getStoreBeanForNodeAtBrokerPort:276
» IO
  JMXManagementTest>QpidTestCase.run:148->QpidBrokerTestCase.runBare:272->testStateOfActiveBrokerIsMaster:125->getStoreBeanForNodeAtBrokerPort:276
» IO
  JMXManagementTest>QpidTestCase.run:148->QpidBrokerTestCase.runBare:272->testVirtualHostMbeanOnMasterTransfer:225->getManagedBrokerBeanForNodeAtBrokerPort:283
» IO
  JMXManagementTest>QpidTestCase.run:148->QpidBrokerTestCase.runBare:272->testGroupMembers:142->getStoreBeanForNodeAtBrokerPort:276
» IO
  JMXManagementTest>QpidTestCase.run:148->QpidBrokerTestCase.runBare:272->testReadonlyMBeanAttributes:111->getStoreBeanForNodeAtBrokerPort:276
» IO
  BDBHAVirtualHostRestTest>QpidTestCase.run:148->QpidBrokerTestCase.runBare:272->testSetLocalTransactionSynchronizationPolicy:116->QpidRestTestCase.waitForAttributeChanged:114
» Connect
  BDBHAVirtualHostRestTest>QpidTestCase.run:148->QpidBrokerTestCase.runBare:272->testMutateState:140->QpidRestTestCase.waitForAttributeChanged:114
» Connect
  BDBHAVirtualHostRestTest>QpidTestCase.run:148->QpidBrokerTestCase.runBare:272->testSetRemoteTransactionSynchronizationPolicy:128->QpidRestTestCase.waitForAttributeChanged:114
» Connect
  BDBHAVirtualHostNodeRestTest>QpidTestCase.run:148->QpidBrokerTestCase.runBare:272->testNewMasterElectedWhenVirtualHostIsStopped:135->createHANode:317
» Connect
  BDBHAVirtualHostNodeRestTest>QpidTestCase.run:148->QpidBrokerTestCase.runBare:272->testMutateStateOfOneNode:103->createHANode:317
» Connect
  BDBHAVirtualHostNodeRestTest>QpidTestCase.run:148->QpidBrokerTestCase.runBare:272->testIntruderProtection:252->createHANode:317
» Connect
  BDBHAVirtualHostNodeRestTest>QpidTestCase.run:148->QpidBrokerTestCase.runBare:272->testDeleteMasterNode:192->createHANode:317
» Connect
  BDBHAVirtualHostNodeRestTest>QpidTestCase.run:148->QpidBrokerTestCase.runBare:272->testCreate3NodeGroup:92->createHANode:317
» Connect
  BDBHAVirtualHostNodeRestTest>QpidTestCase.run:148->QpidBrokerTestCase.runBare:272->testDeleteReplicaNode:166->createHANode:317
» Connect
  BDBHAVirtualHostNodeRestTest>QpidTestCase.run:148->QpidBrokerTestCase.runBare:272->testIntruderBDBHAVHNNotAllowedToConnect:232->createHANode:317
» Connect

Tests run: 42, Failures: 17, Errors: 17, Skipped: 0

[INFO] ------------------------------------------------------------------------
[INFO] Reactor Summary:
[INFO] 
[INFO] Qpid Java Build ................................... SUCCESS [2.348s]
[INFO] Qpid AMQP 1.0 Common .............................. SUCCESS [5.394s]
[INFO] Qpid AMQP 1.0 Client .............................. SUCCESS [1.216s]
[INFO] Qpid AMQP 1.0 Client JMS .......................... SUCCESS [2.339s]
[INFO] Qpid AMQP 1.0 JMS Client Examples ................. SUCCESS [0.210s]
[INFO] Qpid AMQP 1.0 Client WebSocket .................... SUCCESS [1.142s]
[INFO] Qpid Broker Code Generation ....................... SUCCESS [0.745s]
[INFO] Qpid Test Utilities ............................... SUCCESS [0.496s]
[INFO] Qpid Common ....................................... SUCCESS [31.455s]
[INFO] Qpid Management Common ............................ SUCCESS [1.762s]
[INFO] Qpid Java Broker Core ............................. SUCCESS [1:25.344s]
[INFO] Qpid Access Control Broker Plug-in ................ SUCCESS [4.243s]
[INFO] Qpid AMQP 0-8 Protocol Broker Plug-in ............. SUCCESS [20.798s]
[INFO] Qpid AMQP 0-10 Protocol Plug-in ................... SUCCESS [4.107s]
[INFO] Qpid AMQP 1-0 Protocol Broker Plug-in ............. SUCCESS [0.478s]
[INFO] Qpid AMQP 0-8 to 0-10 Message Conversion Broker Plug-in  SUCCESS [0.334s]
[INFO] Qpid AMQP 0-8 to 1-0 Message Conversion Broker Plug-in  SUCCESS [0.288s]
[INFO] Qpid AMQP 0-10 to 1-0 Message Conversion Broker Plug-in  SUCCESS [0.275s]
[INFO] Qpid Derby Message Store .......................... SUCCESS [17.280s]
[INFO] Qpid JDBC Message Store Connection Pooling Plug-in  SUCCESS [0.435s]
[INFO] Qpid JDBC Message Store Broker Plug-in ............ SUCCESS [10.092s]
[INFO] Qpid HTTP Management Broker Plug-in ............... SUCCESS [5.507s]
[INFO] Qpid JMX Management Broker Plug-in ................ SUCCESS [3.236s]
[INFO] Qpid Memory Message Store Broker Plug-in .......... SUCCESS [0.474s]
[INFO] Qpid WebSocket Broker Plug-in ..................... SUCCESS [0.268s]
[INFO] Qpid AMQP 0-x JMS Client .......................... SUCCESS [6.391s]
[INFO] Qpid BDB Message Store ............................ SUCCESS [2:11.437s]
[INFO] Qpid BDB Message Store JMX ........................ SUCCESS [1.991s]
[INFO] Qpid Java Broker .................................. SUCCESS [6.316s]
[INFO] Qpid AMQP Management Protocol Broker Plug-in ...... SUCCESS [0.231s]
[INFO] Qpid AMQP 0-x JMS Client Examples ................. SUCCESS [0.138s]
[INFO] Qpid JCA .......................................... SUCCESS [1.741s]
[INFO] Qpid Resource Adaptor ............................. SUCCESS [0.474s]
[INFO] Qpid Tools ........................................ SUCCESS [0.382s]
[INFO] Qpid Management Examples .......................... SUCCESS [0.166s]
[INFO] Qpid Java System Test Parent ...................... SUCCESS [0.808s]
[INFO] Qpid System Tests ................................. SUCCESS [5:51.807s]
[INFO] Qpid Performance Tests ............................ SUCCESS [13.184s]
[INFO] Qpid Performance Test System Tests ................ SUCCESS [16.641s]
[INFO] Qpid Performance Tests Visualisation JFC .......... SUCCESS [4.827s]
[INFO] Qpid BDB Store System Tests ....................... FAILURE [5.645s]
[INFO] ------------------------------------------------------------------------
[INFO] BUILD FAILURE
[INFO] ------------------------------------------------------------------------
[INFO] Total time: 12:23.591s
[INFO] Finished at: Mon Feb 09 15:27:38 UTC 2015
[INFO] Final Memory: 73M/394M
[INFO] ------------------------------------------------------------------------
[ERROR] Failed to execute goal org.apache.maven.plugins:maven-surefire-plugin:2.16:test (integration-test)
on project qpid-bdbstore-systests: There are test failures.
[ERROR] 
[ERROR] Please refer to <https://builds.apache.org/job/Qpid-Java-Cpp-Test/ws/trunk/qpid/java/bdbstore/systests/target/surefire-reports>
for the individual test results.
[ERROR] -> [Help 1]
[ERROR] 
[ERROR] To see the full stack trace of the errors, re-run Maven with the -e switch.
[ERROR] Re-run Maven using the -X switch to enable full debug logging.
[ERROR] 
[ERROR] For more information about the errors and possible solutions, please read the following
articles:
[ERROR] [Help 1] http://cwiki.apache.org/confluence/display/MAVEN/MojoFailureException
[ERROR] 
[ERROR] After correcting the problems, you can resume the build with the command
[ERROR]   mvn <goals> -rf :qpid-bdbstore-systests
Build step 'Invoke top-level Maven targets' marked build as failure
[locks-and-latches] Releasing all the locks
[locks-and-latches] All the locks released
Recording test results

Mime
View raw message