qpid-notifications mailing list archives

Site index · List index
Message view « Date » · « Thread »
Top « Date » · « Thread »
From Apache Jenkins Server <jenk...@builds.apache.org>
Subject Build failed in Jenkins: Qpid-Java-Cpp-Test #2449
Date Fri, 27 Feb 2015 17:35:25 GMT
See <https://builds.apache.org/job/Qpid-Java-Cpp-Test/2449/changes>

Changes:

[aconway] QPID-4710: [AMQP 1.0] Support for transactions in qpid::messaging C++ client.

Implements the "transactional retire and settle immediately" option for
transactions as specified in AMQP 1.0 in the qpid::messaging C++ client.

NOTE: Transactions over AMQP 1.0 require proton 0.9 or greater.  With older
versions, attempting a transactions over AMQP 1.0 will raise a link-detached
exception "Node not found: tx-transaction"

1. Added descriptor list to Variant with support in Encoder and PnData.

Required to support transactions, need to be able to create described lists.
Variant changes are source and binary compatible.

A Variant now has a Variant::List of descripors which can be numeric or string.
Nested descriptors are implemented by putting multiple descriptors in the list.

Other minor changes:
- Variant refactor: don't delete impl on every assignment.
- Add Variant constructors that take a string encoding.
  (new constructors, not defaulted arguments, so the change is binary and source compatible.)
- Growable buffer support for Encoder.
- Printing described Variant prints descriptors in form @descriptor value

2. Added transaction support to AMQP 1.0 client code

Added messaging/amqp/Transaction.h,cpp: transaction logic
- communicate with coordinator, send declare/dischange messages.
- add tx state info to transfers and acknowledgements.
- Sync session after discharge.
- A transactional session automatically acks any message retrieved by fetch/get
  to bring them into the transaction. This is consistent the 0-10 client.

Minor fixes to existing client code:
- Fix use of pn_drain API in C++ client to work with C++ and Java brokers.
- Make amqp::Exception derive from qpid::Exception

3. Fixes to existing broker code:

- Incoming.cpp fix: start async completion before processing message.
- Delay accept of dischage message till commit is complete.
- newSession - handle failover during session creation.

4. Added tests

interop_tests.py: transaction tests that can run against an external broker, see comments.

ha_tests.py: Enable transaction tests over AMQP 1.0.

Minor test fixes:
- brokertest.py don't set default logging if QPID_LOG env vars set.
- brokertest.py Pass kwargs to broker() create function.
- qpid-receive: capacity should never be larger than message count.
- Accept user:pass as well as user/pass in Url.
- brokertest.py: Always do a ready() check on all brokers.

If proton < 0.9 is used, transaction tests will be skipped or will downgrade to
the amqp0-10 protocol with a printed warning.

------------------------------------------
[...truncated 6459 lines...]
	at sun.net.NetworkClient.doConnect(NetworkClient.java:175)
	at sun.net.www.http.HttpClient.openServer(HttpClient.java:378)
	at sun.net.www.http.HttpClient.openServer(HttpClient.java:473)
	at sun.net.www.http.HttpClient.<init>(HttpClient.java:203)
	at sun.net.www.http.HttpClient.New(HttpClient.java:290)
	at sun.net.www.http.HttpClient.New(HttpClient.java:306)
	at sun.net.www.protocol.http.HttpURLConnection.getNewHttpClient(HttpURLConnection.java:995)
	at sun.net.www.protocol.http.HttpURLConnection.plainConnect(HttpURLConnection.java:931)
	at sun.net.www.protocol.http.HttpURLConnection.connect(HttpURLConnection.java:849)
	at sun.net.www.protocol.http.HttpURLConnection.getOutputStream(HttpURLConnection.java:1090)
	at org.apache.qpid.systest.rest.RestTestHelper.writeJsonRequest(RestTestHelper.java:235)
	at org.apache.qpid.systest.rest.RestTestHelper.submitRequest(RestTestHelper.java:509)
	at org.apache.qpid.systest.rest.RestTestHelper.submitRequest(RestTestHelper.java:523)
	at org.apache.qpid.server.store.berkeleydb.replication.BDBHAVirtualHostNodeRestTest.createHANode(BDBHAVirtualHostNodeRestTest.java:317)
	at org.apache.qpid.server.store.berkeleydb.replication.BDBHAVirtualHostNodeRestTest.testMutateStateOfOneNode(BDBHAVirtualHostNodeRestTest.java:103)

testIntruderProtection(org.apache.qpid.server.store.berkeleydb.replication.BDBHAVirtualHostNodeRestTest)
 Time elapsed: 0.041 sec  <<< ERROR!
java.net.ConnectException: Connection refused
	at java.net.PlainSocketImpl.socketConnect(Native Method)
	at java.net.AbstractPlainSocketImpl.doConnect(AbstractPlainSocketImpl.java:339)
	at java.net.AbstractPlainSocketImpl.connectToAddress(AbstractPlainSocketImpl.java:200)
	at java.net.AbstractPlainSocketImpl.connect(AbstractPlainSocketImpl.java:182)
	at java.net.SocksSocketImpl.connect(SocksSocketImpl.java:392)
	at java.net.Socket.connect(Socket.java:579)
	at sun.net.NetworkClient.doConnect(NetworkClient.java:175)
	at sun.net.www.http.HttpClient.openServer(HttpClient.java:378)
	at sun.net.www.http.HttpClient.openServer(HttpClient.java:473)
	at sun.net.www.http.HttpClient.<init>(HttpClient.java:203)
	at sun.net.www.http.HttpClient.New(HttpClient.java:290)
	at sun.net.www.http.HttpClient.New(HttpClient.java:306)
	at sun.net.www.protocol.http.HttpURLConnection.getNewHttpClient(HttpURLConnection.java:995)
	at sun.net.www.protocol.http.HttpURLConnection.plainConnect(HttpURLConnection.java:931)
	at sun.net.www.protocol.http.HttpURLConnection.connect(HttpURLConnection.java:849)
	at sun.net.www.protocol.http.HttpURLConnection.getOutputStream(HttpURLConnection.java:1090)
	at org.apache.qpid.systest.rest.RestTestHelper.writeJsonRequest(RestTestHelper.java:235)
	at org.apache.qpid.systest.rest.RestTestHelper.submitRequest(RestTestHelper.java:509)
	at org.apache.qpid.systest.rest.RestTestHelper.submitRequest(RestTestHelper.java:523)
	at org.apache.qpid.server.store.berkeleydb.replication.BDBHAVirtualHostNodeRestTest.createHANode(BDBHAVirtualHostNodeRestTest.java:317)
	at org.apache.qpid.server.store.berkeleydb.replication.BDBHAVirtualHostNodeRestTest.testIntruderProtection(BDBHAVirtualHostNodeRestTest.java:252)

testDeleteMasterNode(org.apache.qpid.server.store.berkeleydb.replication.BDBHAVirtualHostNodeRestTest)
 Time elapsed: 0.045 sec  <<< ERROR!
java.net.ConnectException: Connection refused
	at java.net.PlainSocketImpl.socketConnect(Native Method)
	at java.net.AbstractPlainSocketImpl.doConnect(AbstractPlainSocketImpl.java:339)
	at java.net.AbstractPlainSocketImpl.connectToAddress(AbstractPlainSocketImpl.java:200)
	at java.net.AbstractPlainSocketImpl.connect(AbstractPlainSocketImpl.java:182)
	at java.net.SocksSocketImpl.connect(SocksSocketImpl.java:392)
	at java.net.Socket.connect(Socket.java:579)
	at sun.net.NetworkClient.doConnect(NetworkClient.java:175)
	at sun.net.www.http.HttpClient.openServer(HttpClient.java:378)
	at sun.net.www.http.HttpClient.openServer(HttpClient.java:473)
	at sun.net.www.http.HttpClient.<init>(HttpClient.java:203)
	at sun.net.www.http.HttpClient.New(HttpClient.java:290)
	at sun.net.www.http.HttpClient.New(HttpClient.java:306)
	at sun.net.www.protocol.http.HttpURLConnection.getNewHttpClient(HttpURLConnection.java:995)
	at sun.net.www.protocol.http.HttpURLConnection.plainConnect(HttpURLConnection.java:931)
	at sun.net.www.protocol.http.HttpURLConnection.connect(HttpURLConnection.java:849)
	at sun.net.www.protocol.http.HttpURLConnection.getOutputStream(HttpURLConnection.java:1090)
	at org.apache.qpid.systest.rest.RestTestHelper.writeJsonRequest(RestTestHelper.java:235)
	at org.apache.qpid.systest.rest.RestTestHelper.submitRequest(RestTestHelper.java:509)
	at org.apache.qpid.systest.rest.RestTestHelper.submitRequest(RestTestHelper.java:523)
	at org.apache.qpid.server.store.berkeleydb.replication.BDBHAVirtualHostNodeRestTest.createHANode(BDBHAVirtualHostNodeRestTest.java:317)
	at org.apache.qpid.server.store.berkeleydb.replication.BDBHAVirtualHostNodeRestTest.testDeleteMasterNode(BDBHAVirtualHostNodeRestTest.java:192)

testCreate3NodeGroup(org.apache.qpid.server.store.berkeleydb.replication.BDBHAVirtualHostNodeRestTest)
 Time elapsed: 0.04 sec  <<< ERROR!
java.net.ConnectException: Connection refused
	at java.net.PlainSocketImpl.socketConnect(Native Method)
	at java.net.AbstractPlainSocketImpl.doConnect(AbstractPlainSocketImpl.java:339)
	at java.net.AbstractPlainSocketImpl.connectToAddress(AbstractPlainSocketImpl.java:200)
	at java.net.AbstractPlainSocketImpl.connect(AbstractPlainSocketImpl.java:182)
	at java.net.SocksSocketImpl.connect(SocksSocketImpl.java:392)
	at java.net.Socket.connect(Socket.java:579)
	at sun.net.NetworkClient.doConnect(NetworkClient.java:175)
	at sun.net.www.http.HttpClient.openServer(HttpClient.java:378)
	at sun.net.www.http.HttpClient.openServer(HttpClient.java:473)
	at sun.net.www.http.HttpClient.<init>(HttpClient.java:203)
	at sun.net.www.http.HttpClient.New(HttpClient.java:290)
	at sun.net.www.http.HttpClient.New(HttpClient.java:306)
	at sun.net.www.protocol.http.HttpURLConnection.getNewHttpClient(HttpURLConnection.java:995)
	at sun.net.www.protocol.http.HttpURLConnection.plainConnect(HttpURLConnection.java:931)
	at sun.net.www.protocol.http.HttpURLConnection.connect(HttpURLConnection.java:849)
	at sun.net.www.protocol.http.HttpURLConnection.getOutputStream(HttpURLConnection.java:1090)
	at org.apache.qpid.systest.rest.RestTestHelper.writeJsonRequest(RestTestHelper.java:235)
	at org.apache.qpid.systest.rest.RestTestHelper.submitRequest(RestTestHelper.java:509)
	at org.apache.qpid.systest.rest.RestTestHelper.submitRequest(RestTestHelper.java:523)
	at org.apache.qpid.server.store.berkeleydb.replication.BDBHAVirtualHostNodeRestTest.createHANode(BDBHAVirtualHostNodeRestTest.java:317)
	at org.apache.qpid.server.store.berkeleydb.replication.BDBHAVirtualHostNodeRestTest.testCreate3NodeGroup(BDBHAVirtualHostNodeRestTest.java:92)

testDeleteReplicaNode(org.apache.qpid.server.store.berkeleydb.replication.BDBHAVirtualHostNodeRestTest)
 Time elapsed: 0.04 sec  <<< ERROR!
java.net.ConnectException: Connection refused
	at java.net.PlainSocketImpl.socketConnect(Native Method)
	at java.net.AbstractPlainSocketImpl.doConnect(AbstractPlainSocketImpl.java:339)
	at java.net.AbstractPlainSocketImpl.connectToAddress(AbstractPlainSocketImpl.java:200)
	at java.net.AbstractPlainSocketImpl.connect(AbstractPlainSocketImpl.java:182)
	at java.net.SocksSocketImpl.connect(SocksSocketImpl.java:392)
	at java.net.Socket.connect(Socket.java:579)
	at sun.net.NetworkClient.doConnect(NetworkClient.java:175)
	at sun.net.www.http.HttpClient.openServer(HttpClient.java:378)
	at sun.net.www.http.HttpClient.openServer(HttpClient.java:473)
	at sun.net.www.http.HttpClient.<init>(HttpClient.java:203)
	at sun.net.www.http.HttpClient.New(HttpClient.java:290)
	at sun.net.www.http.HttpClient.New(HttpClient.java:306)
	at sun.net.www.protocol.http.HttpURLConnection.getNewHttpClient(HttpURLConnection.java:995)
	at sun.net.www.protocol.http.HttpURLConnection.plainConnect(HttpURLConnection.java:931)
	at sun.net.www.protocol.http.HttpURLConnection.connect(HttpURLConnection.java:849)
	at sun.net.www.protocol.http.HttpURLConnection.getOutputStream(HttpURLConnection.java:1090)
	at org.apache.qpid.systest.rest.RestTestHelper.writeJsonRequest(RestTestHelper.java:235)
	at org.apache.qpid.systest.rest.RestTestHelper.submitRequest(RestTestHelper.java:509)
	at org.apache.qpid.systest.rest.RestTestHelper.submitRequest(RestTestHelper.java:523)
	at org.apache.qpid.server.store.berkeleydb.replication.BDBHAVirtualHostNodeRestTest.createHANode(BDBHAVirtualHostNodeRestTest.java:317)
	at org.apache.qpid.server.store.berkeleydb.replication.BDBHAVirtualHostNodeRestTest.testDeleteReplicaNode(BDBHAVirtualHostNodeRestTest.java:166)

testIntruderBDBHAVHNNotAllowedToConnect(org.apache.qpid.server.store.berkeleydb.replication.BDBHAVirtualHostNodeRestTest)
 Time elapsed: 0.042 sec  <<< ERROR!
java.net.ConnectException: Connection refused
	at java.net.PlainSocketImpl.socketConnect(Native Method)
	at java.net.AbstractPlainSocketImpl.doConnect(AbstractPlainSocketImpl.java:339)
	at java.net.AbstractPlainSocketImpl.connectToAddress(AbstractPlainSocketImpl.java:200)
	at java.net.AbstractPlainSocketImpl.connect(AbstractPlainSocketImpl.java:182)
	at java.net.SocksSocketImpl.connect(SocksSocketImpl.java:392)
	at java.net.Socket.connect(Socket.java:579)
	at sun.net.NetworkClient.doConnect(NetworkClient.java:175)
	at sun.net.www.http.HttpClient.openServer(HttpClient.java:378)
	at sun.net.www.http.HttpClient.openServer(HttpClient.java:473)
	at sun.net.www.http.HttpClient.<init>(HttpClient.java:203)
	at sun.net.www.http.HttpClient.New(HttpClient.java:290)
	at sun.net.www.http.HttpClient.New(HttpClient.java:306)
	at sun.net.www.protocol.http.HttpURLConnection.getNewHttpClient(HttpURLConnection.java:995)
	at sun.net.www.protocol.http.HttpURLConnection.plainConnect(HttpURLConnection.java:931)
	at sun.net.www.protocol.http.HttpURLConnection.connect(HttpURLConnection.java:849)
	at sun.net.www.protocol.http.HttpURLConnection.getOutputStream(HttpURLConnection.java:1090)
	at org.apache.qpid.systest.rest.RestTestHelper.writeJsonRequest(RestTestHelper.java:235)
	at org.apache.qpid.systest.rest.RestTestHelper.submitRequest(RestTestHelper.java:509)
	at org.apache.qpid.systest.rest.RestTestHelper.submitRequest(RestTestHelper.java:523)
	at org.apache.qpid.server.store.berkeleydb.replication.BDBHAVirtualHostNodeRestTest.createHANode(BDBHAVirtualHostNodeRestTest.java:317)
	at org.apache.qpid.server.store.berkeleydb.replication.BDBHAVirtualHostNodeRestTest.testIntruderBDBHAVHNNotAllowedToConnect(BDBHAVirtualHostNodeRestTest.java:232)

Running org.apache.qpid.server.store.berkeleydb.BDBBackupTest
Tests run: 0, Failures: 0, Errors: 0, Skipped: 0, Time elapsed: 0 sec - in org.apache.qpid.server.store.berkeleydb.BDBBackupTest

Results :

Failed tests: 
  TwoNodeTest>QpidTestCase.run:148->QpidBrokerTestCase.runBare:286->setUp:55 null
  TwoNodeTest>QpidTestCase.run:148->QpidBrokerTestCase.runBare:286->setUp:55 null
  TwoNodeTest>QpidTestCase.run:148->QpidBrokerTestCase.runBare:286->setUp:55 null
  TwoNodeTest>QpidTestCase.run:148->QpidBrokerTestCase.runBare:286->setUp:55 null
  TwoNodeTest>QpidTestCase.run:148->QpidBrokerTestCase.runBare:286->setUp:55 null
  TwoNodeTest>QpidTestCase.run:148->QpidBrokerTestCase.runBare:286->setUp:55 null
  TwoNodeTest>QpidTestCase.run:148->QpidBrokerTestCase.runBare:286->setUp:55 null
  MultiNodeTest>QpidTestCase.run:148->QpidBrokerTestCase.runBare:286->setUp:81 null
  MultiNodeTest>QpidTestCase.run:148->QpidBrokerTestCase.runBare:286->setUp:81 null
  MultiNodeTest>QpidTestCase.run:148->QpidBrokerTestCase.runBare:286->setUp:81 null
  MultiNodeTest>QpidTestCase.run:148->QpidBrokerTestCase.runBare:286->setUp:81 null
  MultiNodeTest>QpidTestCase.run:148->QpidBrokerTestCase.runBare:286->setUp:81 null
  MultiNodeTest>QpidTestCase.run:148->QpidBrokerTestCase.runBare:286->setUp:81 null
  MultiNodeTest>QpidTestCase.run:148->QpidBrokerTestCase.runBare:286->setUp:81 null
  MultiNodeTest>QpidTestCase.run:148->QpidBrokerTestCase.runBare:286->setUp:81 null
  MultiNodeTest>QpidTestCase.run:148->QpidBrokerTestCase.runBare:286->setUp:81 null
  MultiNodeTest>QpidTestCase.run:148->QpidBrokerTestCase.runBare:286->setUp:81 null

Tests in error: 
  JMXManagementTest>QpidTestCase.run:148->QpidBrokerTestCase.runBare:286->testRemoveRemoteNodeFromGroup:164->getStoreBeanForNodeAtBrokerPort:276
» IO
  JMXManagementTest>QpidTestCase.run:148->QpidBrokerTestCase.runBare:286->testVirtualHostOperationsDeniedForNonMasterNode:187->getManagedBrokerBeanForNodeAtBrokerPort:283
» IO
  JMXManagementTest>QpidTestCase.run:148->QpidBrokerTestCase.runBare:286->testStateOfNonActiveBrokerIsNotMaster:133->getStoreBeanForNodeAtBrokerPort:276
» IO
  JMXManagementTest>QpidTestCase.run:148->QpidBrokerTestCase.runBare:286->testStateOfActiveBrokerIsMaster:125->getStoreBeanForNodeAtBrokerPort:276
» IO
  JMXManagementTest>QpidTestCase.run:148->QpidBrokerTestCase.runBare:286->testVirtualHostMbeanOnMasterTransfer:225->getManagedBrokerBeanForNodeAtBrokerPort:283
» IO
  JMXManagementTest>QpidTestCase.run:148->QpidBrokerTestCase.runBare:286->testGroupMembers:142->getStoreBeanForNodeAtBrokerPort:276
» IO
  JMXManagementTest>QpidTestCase.run:148->QpidBrokerTestCase.runBare:286->testReadonlyMBeanAttributes:111->getStoreBeanForNodeAtBrokerPort:276
» IO
  BDBHAVirtualHostRestTest>QpidTestCase.run:148->QpidBrokerTestCase.runBare:286->testSetLocalTransactionSynchronizationPolicy:116->QpidRestTestCase.waitForAttributeChanged:108
» Connect
  BDBHAVirtualHostRestTest>QpidTestCase.run:148->QpidBrokerTestCase.runBare:286->testMutateState:140->QpidRestTestCase.waitForAttributeChanged:108
» Connect
  BDBHAVirtualHostRestTest>QpidTestCase.run:148->QpidBrokerTestCase.runBare:286->testSetRemoteTransactionSynchronizationPolicy:128->QpidRestTestCase.waitForAttributeChanged:108
» Connect
  BDBHAVirtualHostNodeRestTest>QpidTestCase.run:148->QpidBrokerTestCase.runBare:286->testNewMasterElectedWhenVirtualHostIsStopped:135->createHANode:317
» Connect
  BDBHAVirtualHostNodeRestTest>QpidTestCase.run:148->QpidBrokerTestCase.runBare:286->testMutateStateOfOneNode:103->createHANode:317
» Connect
  BDBHAVirtualHostNodeRestTest>QpidTestCase.run:148->QpidBrokerTestCase.runBare:286->testIntruderProtection:252->createHANode:317
» Connect
  BDBHAVirtualHostNodeRestTest>QpidTestCase.run:148->QpidBrokerTestCase.runBare:286->testDeleteMasterNode:192->createHANode:317
» Connect
  BDBHAVirtualHostNodeRestTest>QpidTestCase.run:148->QpidBrokerTestCase.runBare:286->testCreate3NodeGroup:92->createHANode:317
» Connect
  BDBHAVirtualHostNodeRestTest>QpidTestCase.run:148->QpidBrokerTestCase.runBare:286->testDeleteReplicaNode:166->createHANode:317
» Connect
  BDBHAVirtualHostNodeRestTest>QpidTestCase.run:148->QpidBrokerTestCase.runBare:286->testIntruderBDBHAVHNNotAllowedToConnect:232->createHANode:317
» Connect

Tests run: 42, Failures: 17, Errors: 17, Skipped: 0

[INFO] ------------------------------------------------------------------------
[INFO] Reactor Summary:
[INFO] 
[INFO] Qpid Java Build ................................... SUCCESS [2.340s]
[INFO] Qpid AMQP 1.0 Common .............................. SUCCESS [5.072s]
[INFO] Qpid AMQP 1.0 Client .............................. SUCCESS [0.692s]
[INFO] Qpid AMQP 1.0 Client JMS .......................... SUCCESS [1.669s]
[INFO] Qpid AMQP 1.0 JMS Client Examples ................. SUCCESS [0.202s]
[INFO] Qpid AMQP 1.0 Client WebSocket .................... SUCCESS [0.631s]
[INFO] Qpid Broker Code Generation ....................... SUCCESS [0.295s]
[INFO] Qpid Test Utilities ............................... SUCCESS [0.369s]
[INFO] Qpid Common ....................................... SUCCESS [28.192s]
[INFO] Qpid Management Common ............................ SUCCESS [1.100s]
[INFO] Qpid Java Broker Core ............................. SUCCESS [1:45.897s]
[INFO] Qpid Access Control Broker Plug-in ................ SUCCESS [3.863s]
[INFO] Qpid AMQP 0-8 Protocol Broker Plug-in ............. SUCCESS [20.629s]
[INFO] Qpid AMQP 0-10 Protocol Plug-in ................... SUCCESS [4.091s]
[INFO] Qpid AMQP 1-0 Protocol Broker Plug-in ............. SUCCESS [0.494s]
[INFO] Qpid AMQP 0-8 to 0-10 Message Conversion Broker Plug-in  SUCCESS [0.321s]
[INFO] Qpid AMQP 0-8 to 1-0 Message Conversion Broker Plug-in  SUCCESS [0.244s]
[INFO] Qpid AMQP 0-10 to 1-0 Message Conversion Broker Plug-in  SUCCESS [0.247s]
[INFO] Qpid Derby Message Store .......................... SUCCESS [16.168s]
[INFO] Qpid JDBC Message Store Connection Pooling Plug-in  SUCCESS [0.689s]
[INFO] Qpid JDBC Message Store Broker Plug-in ............ SUCCESS [9.266s]
[INFO] Qpid HTTP Management Broker Plug-in ............... SUCCESS [5.004s]
[INFO] Qpid JMX Management Broker Plug-in ................ SUCCESS [3.193s]
[INFO] Qpid Memory Message Store Broker Plug-in .......... SUCCESS [0.396s]
[INFO] Qpid WebSocket Broker Plug-in ..................... SUCCESS [0.254s]
[INFO] Qpid AMQP 0-x JMS Client .......................... SUCCESS [6.151s]
[INFO] Qpid BDB Message Store ............................ SUCCESS [2:13.120s]
[INFO] Qpid BDB Message Store JMX ........................ SUCCESS [1.915s]
[INFO] Qpid Java Broker .................................. SUCCESS [5.516s]
[INFO] Qpid AMQP Management Protocol Broker Plug-in ...... SUCCESS [0.438s]
[INFO] Qpid AMQP 0-x JMS Client Examples ................. SUCCESS [0.134s]
[INFO] Qpid JCA .......................................... SUCCESS [1.925s]
[INFO] Qpid Resource Adaptor ............................. SUCCESS [0.488s]
[INFO] Qpid Tools ........................................ SUCCESS [0.355s]
[INFO] Qpid Management Examples .......................... SUCCESS [0.166s]
[INFO] Qpid Java System Test Parent ...................... SUCCESS [0.781s]
[INFO] Qpid System Tests ................................. SUCCESS [5:56.810s]
[INFO] Qpid Performance Tests ............................ SUCCESS [13.141s]
[INFO] Qpid Performance Test System Tests ................ SUCCESS [16.908s]
[INFO] Qpid Performance Tests Visualisation JFC .......... SUCCESS [4.329s]
[INFO] Qpid BDB Store System Tests ....................... FAILURE [5.711s]
[INFO] ------------------------------------------------------------------------
[INFO] BUILD FAILURE
[INFO] ------------------------------------------------------------------------
[INFO] Total time: 12:40.358s
[INFO] Finished at: Fri Feb 27 17:35:06 UTC 2015
[INFO] Final Memory: 74M/378M
[INFO] ------------------------------------------------------------------------
[ERROR] Failed to execute goal org.apache.maven.plugins:maven-surefire-plugin:2.16:test (integration-test)
on project qpid-bdbstore-systests: There are test failures.
[ERROR] 
[ERROR] Please refer to <https://builds.apache.org/job/Qpid-Java-Cpp-Test/ws/trunk/qpid/java/bdbstore/systests/target/surefire-reports>
for the individual test results.
[ERROR] -> [Help 1]
[ERROR] 
[ERROR] To see the full stack trace of the errors, re-run Maven with the -e switch.
[ERROR] Re-run Maven using the -X switch to enable full debug logging.
[ERROR] 
[ERROR] For more information about the errors and possible solutions, please read the following
articles:
[ERROR] [Help 1] http://cwiki.apache.org/confluence/display/MAVEN/MojoFailureException
[ERROR] 
[ERROR] After correcting the problems, you can resume the build with the command
[ERROR]   mvn <goals> -rf :qpid-bdbstore-systests
Build step 'Invoke top-level Maven targets' marked build as failure
[locks-and-latches] Releasing all the locks
[locks-and-latches] All the locks released
Recording test results

Mime
View raw message