qpid-notifications mailing list archives

Site index · List index
Message view « Date » · « Thread »
Top « Date » · « Thread »
From Apache Jenkins Server <jenk...@builds.apache.org>
Subject Build failed in Jenkins: Qpid-Java-Cpp-Test #2431
Date Sun, 22 Feb 2015 00:58:16 GMT
See <https://builds.apache.org/job/Qpid-Java-Cpp-Test/2431/changes>

Changes:

[shuston] Replace non-Apache licensed CheckSizeTNativeType.cmake with ASF-licensed and more
correct for our needs, CheckSizetDistinct.cmake. Resolves QPID-6312.

[shuston] Add missing AIX-needed SystemInfo.cpp source; relates to QPID-6312, 0003 attachment

------------------------------------------
[...truncated 6591 lines...]
	at org.apache.qpid.server.store.berkeleydb.replication.MultiNodeTest.setUp(MultiNodeTest.java:81)

testPriority(org.apache.qpid.server.store.berkeleydb.replication.MultiNodeTest)  Time elapsed:
0.006 sec  <<< FAILURE!
junit.framework.AssertionFailedError: null
	at junit.framework.Assert.fail(Assert.java:55)
	at junit.framework.Assert.assertTrue(Assert.java:22)
	at junit.framework.Assert.assertTrue(Assert.java:31)
	at junit.framework.TestCase.assertTrue(TestCase.java:201)
	at org.apache.qpid.server.store.berkeleydb.replication.MultiNodeTest.setUp(MultiNodeTest.java:81)

testQuorumOverride(org.apache.qpid.server.store.berkeleydb.replication.MultiNodeTest)  Time
elapsed: 0.006 sec  <<< FAILURE!
junit.framework.AssertionFailedError: null
	at junit.framework.Assert.fail(Assert.java:55)
	at junit.framework.Assert.assertTrue(Assert.java:22)
	at junit.framework.Assert.assertTrue(Assert.java:31)
	at junit.framework.TestCase.assertTrue(TestCase.java:201)
	at org.apache.qpid.server.store.berkeleydb.replication.MultiNodeTest.setUp(MultiNodeTest.java:81)

testLossOfQuorumCausesClientDisconnection(org.apache.qpid.server.store.berkeleydb.replication.MultiNodeTest)
 Time elapsed: 0.006 sec  <<< FAILURE!
junit.framework.AssertionFailedError: null
	at junit.framework.Assert.fail(Assert.java:55)
	at junit.framework.Assert.assertTrue(Assert.java:22)
	at junit.framework.Assert.assertTrue(Assert.java:31)
	at junit.framework.TestCase.assertTrue(TestCase.java:201)
	at org.apache.qpid.server.store.berkeleydb.replication.MultiNodeTest.setUp(MultiNodeTest.java:81)

testLossOfMasterNodeCausesClientToFailover(org.apache.qpid.server.store.berkeleydb.replication.MultiNodeTest)
 Time elapsed: 0.006 sec  <<< FAILURE!
junit.framework.AssertionFailedError: null
	at junit.framework.Assert.fail(Assert.java:55)
	at junit.framework.Assert.assertTrue(Assert.java:22)
	at junit.framework.Assert.assertTrue(Assert.java:31)
	at junit.framework.TestCase.assertTrue(TestCase.java:201)
	at org.apache.qpid.server.store.berkeleydb.replication.MultiNodeTest.setUp(MultiNodeTest.java:81)

testClusterCannotStartWithIntruder(org.apache.qpid.server.store.berkeleydb.replication.MultiNodeTest)
 Time elapsed: 0.006 sec  <<< FAILURE!
junit.framework.AssertionFailedError: null
	at junit.framework.Assert.fail(Assert.java:55)
	at junit.framework.Assert.assertTrue(Assert.java:22)
	at junit.framework.Assert.assertTrue(Assert.java:31)
	at junit.framework.TestCase.assertTrue(TestCase.java:201)
	at org.apache.qpid.server.store.berkeleydb.replication.MultiNodeTest.setUp(MultiNodeTest.java:81)

testTransferMasterWhilstMessagesInFlight(org.apache.qpid.server.store.berkeleydb.replication.MultiNodeTest)
 Time elapsed: 0.019 sec  <<< FAILURE!
junit.framework.AssertionFailedError: null
	at junit.framework.Assert.fail(Assert.java:55)
	at junit.framework.Assert.assertTrue(Assert.java:22)
	at junit.framework.Assert.assertTrue(Assert.java:31)
	at junit.framework.TestCase.assertTrue(TestCase.java:201)
	at org.apache.qpid.server.store.berkeleydb.replication.MultiNodeTest.setUp(MultiNodeTest.java:81)

testTransferMasterFromRemoteNode(org.apache.qpid.server.store.berkeleydb.replication.MultiNodeTest)
 Time elapsed: 0.007 sec  <<< FAILURE!
junit.framework.AssertionFailedError: null
	at junit.framework.Assert.fail(Assert.java:55)
	at junit.framework.Assert.assertTrue(Assert.java:22)
	at junit.framework.Assert.assertTrue(Assert.java:31)
	at junit.framework.TestCase.assertTrue(TestCase.java:201)
	at org.apache.qpid.server.store.berkeleydb.replication.MultiNodeTest.setUp(MultiNodeTest.java:81)

testLossOfReplicaNodeDoesNotCauseClientToFailover(org.apache.qpid.server.store.berkeleydb.replication.MultiNodeTest)
 Time elapsed: 0.008 sec  <<< FAILURE!
junit.framework.AssertionFailedError: null
	at junit.framework.Assert.fail(Assert.java:55)
	at junit.framework.Assert.assertTrue(Assert.java:22)
	at junit.framework.Assert.assertTrue(Assert.java:31)
	at junit.framework.TestCase.assertTrue(TestCase.java:201)
	at org.apache.qpid.server.store.berkeleydb.replication.MultiNodeTest.setUp(MultiNodeTest.java:81)

testPersistentMessagesAvailableAfterFailover(org.apache.qpid.server.store.berkeleydb.replication.MultiNodeTest)
 Time elapsed: 0.006 sec  <<< FAILURE!
junit.framework.AssertionFailedError: null
	at junit.framework.Assert.fail(Assert.java:55)
	at junit.framework.Assert.assertTrue(Assert.java:22)
	at junit.framework.Assert.assertTrue(Assert.java:31)
	at junit.framework.TestCase.assertTrue(TestCase.java:201)
	at org.apache.qpid.server.store.berkeleydb.replication.MultiNodeTest.setUp(MultiNodeTest.java:81)

Running org.apache.qpid.server.store.berkeleydb.replication.TwoNodeTest
Tests run: 7, Failures: 7, Errors: 0, Skipped: 0, Time elapsed: 0.049 sec <<< FAILURE!
- in org.apache.qpid.server.store.berkeleydb.replication.TwoNodeTest
testMasterDesignatedPrimaryCanBeRestartedWithoutReplica(org.apache.qpid.server.store.berkeleydb.replication.TwoNodeTest)
 Time elapsed: 0.006 sec  <<< FAILURE!
junit.framework.AssertionFailedError: null
	at junit.framework.Assert.fail(Assert.java:55)
	at junit.framework.Assert.assertTrue(Assert.java:22)
	at junit.framework.Assert.assertTrue(Assert.java:31)
	at junit.framework.TestCase.assertTrue(TestCase.java:201)
	at org.apache.qpid.server.store.berkeleydb.replication.TwoNodeTest.setUp(TwoNodeTest.java:55)

testSecondaryDesignatedAsPrimaryAfterOriginalPrimaryStopped(org.apache.qpid.server.store.berkeleydb.replication.TwoNodeTest)
 Time elapsed: 0.006 sec  <<< FAILURE!
junit.framework.AssertionFailedError: null
	at junit.framework.Assert.fail(Assert.java:55)
	at junit.framework.Assert.assertTrue(Assert.java:22)
	at junit.framework.Assert.assertTrue(Assert.java:31)
	at junit.framework.TestCase.assertTrue(TestCase.java:201)
	at org.apache.qpid.server.store.berkeleydb.replication.TwoNodeTest.setUp(TwoNodeTest.java:55)

testClusterRestartWithoutDesignatedPrimary(org.apache.qpid.server.store.berkeleydb.replication.TwoNodeTest)
 Time elapsed: 0.006 sec  <<< FAILURE!
junit.framework.AssertionFailedError: null
	at junit.framework.Assert.fail(Assert.java:55)
	at junit.framework.Assert.assertTrue(Assert.java:22)
	at junit.framework.Assert.assertTrue(Assert.java:31)
	at junit.framework.TestCase.assertTrue(TestCase.java:201)
	at org.apache.qpid.server.store.berkeleydb.replication.TwoNodeTest.setUp(TwoNodeTest.java:55)

testDesignatedPrimaryContinuesAfterSecondaryStopped(org.apache.qpid.server.store.berkeleydb.replication.TwoNodeTest)
 Time elapsed: 0.006 sec  <<< FAILURE!
junit.framework.AssertionFailedError: null
	at junit.framework.Assert.fail(Assert.java:55)
	at junit.framework.Assert.assertTrue(Assert.java:22)
	at junit.framework.Assert.assertTrue(Assert.java:31)
	at junit.framework.TestCase.assertTrue(TestCase.java:201)
	at org.apache.qpid.server.store.berkeleydb.replication.TwoNodeTest.setUp(TwoNodeTest.java:55)

testPersistentOperationsFailOnNonDesignatedPrimaryAfterSecondaryStopped(org.apache.qpid.server.store.berkeleydb.replication.TwoNodeTest)
 Time elapsed: 0.006 sec  <<< FAILURE!
junit.framework.AssertionFailedError: null
	at junit.framework.Assert.fail(Assert.java:55)
	at junit.framework.Assert.assertTrue(Assert.java:22)
	at junit.framework.Assert.assertTrue(Assert.java:31)
	at junit.framework.TestCase.assertTrue(TestCase.java:201)
	at org.apache.qpid.server.store.berkeleydb.replication.TwoNodeTest.setUp(TwoNodeTest.java:55)

testInitialDesignatedPrimaryStateOfNodes(org.apache.qpid.server.store.berkeleydb.replication.TwoNodeTest)
 Time elapsed: 0.006 sec  <<< FAILURE!
junit.framework.AssertionFailedError: null
	at junit.framework.Assert.fail(Assert.java:55)
	at junit.framework.Assert.assertTrue(Assert.java:22)
	at junit.framework.Assert.assertTrue(Assert.java:31)
	at junit.framework.TestCase.assertTrue(TestCase.java:201)
	at org.apache.qpid.server.store.berkeleydb.replication.TwoNodeTest.setUp(TwoNodeTest.java:55)

testSecondaryDoesNotBecomePrimaryWhenDesignatedPrimaryStopped(org.apache.qpid.server.store.berkeleydb.replication.TwoNodeTest)
 Time elapsed: 0.006 sec  <<< FAILURE!
junit.framework.AssertionFailedError: null
	at junit.framework.Assert.fail(Assert.java:55)
	at junit.framework.Assert.assertTrue(Assert.java:22)
	at junit.framework.Assert.assertTrue(Assert.java:31)
	at junit.framework.TestCase.assertTrue(TestCase.java:201)
	at org.apache.qpid.server.store.berkeleydb.replication.TwoNodeTest.setUp(TwoNodeTest.java:55)

Running org.apache.qpid.server.store.berkeleydb.BDBBackupTest
Tests run: 0, Failures: 0, Errors: 0, Skipped: 0, Time elapsed: 0 sec - in org.apache.qpid.server.store.berkeleydb.BDBBackupTest

Results :

Failed tests: 
  MultiNodeTest>QpidTestCase.run:148->QpidBrokerTestCase.runBare:286->setUp:81 null
  MultiNodeTest>QpidTestCase.run:148->QpidBrokerTestCase.runBare:286->setUp:81 null
  MultiNodeTest>QpidTestCase.run:148->QpidBrokerTestCase.runBare:286->setUp:81 null
  MultiNodeTest>QpidTestCase.run:148->QpidBrokerTestCase.runBare:286->setUp:81 null
  MultiNodeTest>QpidTestCase.run:148->QpidBrokerTestCase.runBare:286->setUp:81 null
  MultiNodeTest>QpidTestCase.run:148->QpidBrokerTestCase.runBare:286->setUp:81 null
  MultiNodeTest>QpidTestCase.run:148->QpidBrokerTestCase.runBare:286->setUp:81 null
  MultiNodeTest>QpidTestCase.run:148->QpidBrokerTestCase.runBare:286->setUp:81 null
  MultiNodeTest>QpidTestCase.run:148->QpidBrokerTestCase.runBare:286->setUp:81 null
  MultiNodeTest>QpidTestCase.run:148->QpidBrokerTestCase.runBare:286->setUp:81 null
  TwoNodeTest>QpidTestCase.run:148->QpidBrokerTestCase.runBare:286->setUp:55 null
  TwoNodeTest>QpidTestCase.run:148->QpidBrokerTestCase.runBare:286->setUp:55 null
  TwoNodeTest>QpidTestCase.run:148->QpidBrokerTestCase.runBare:286->setUp:55 null
  TwoNodeTest>QpidTestCase.run:148->QpidBrokerTestCase.runBare:286->setUp:55 null
  TwoNodeTest>QpidTestCase.run:148->QpidBrokerTestCase.runBare:286->setUp:55 null
  TwoNodeTest>QpidTestCase.run:148->QpidBrokerTestCase.runBare:286->setUp:55 null
  TwoNodeTest>QpidTestCase.run:148->QpidBrokerTestCase.runBare:286->setUp:55 null

Tests in error: 
  BDBHAVirtualHostNodeRestTest>QpidTestCase.run:148->QpidBrokerTestCase.runBare:286->testNewMasterElectedWhenVirtualHostIsStopped:135->createHANode:317
» Connect
  BDBHAVirtualHostNodeRestTest>QpidTestCase.run:148->QpidBrokerTestCase.runBare:286->testMutateStateOfOneNode:103->createHANode:317
» Connect
  BDBHAVirtualHostNodeRestTest>QpidTestCase.run:148->QpidBrokerTestCase.runBare:286->testIntruderProtection:252->createHANode:317
» Connect
  BDBHAVirtualHostNodeRestTest>QpidTestCase.run:148->QpidBrokerTestCase.runBare:286->testDeleteMasterNode:192->createHANode:317
» Connect
  BDBHAVirtualHostNodeRestTest>QpidTestCase.run:148->QpidBrokerTestCase.runBare:286->testCreate3NodeGroup:92->createHANode:317
» Connect
  BDBHAVirtualHostNodeRestTest>QpidTestCase.run:148->QpidBrokerTestCase.runBare:286->testDeleteReplicaNode:166->createHANode:317
» Connect
  BDBHAVirtualHostNodeRestTest>QpidTestCase.run:148->QpidBrokerTestCase.runBare:286->testIntruderBDBHAVHNNotAllowedToConnect:232->createHANode:317
» Connect
  BDBHAVirtualHostRestTest>QpidTestCase.run:148->QpidBrokerTestCase.runBare:286->testSetLocalTransactionSynchronizationPolicy:116->QpidRestTestCase.waitForAttributeChanged:108
» Connect
  BDBHAVirtualHostRestTest>QpidTestCase.run:148->QpidBrokerTestCase.runBare:286->testMutateState:140->QpidRestTestCase.waitForAttributeChanged:108
» Connect
  BDBHAVirtualHostRestTest>QpidTestCase.run:148->QpidBrokerTestCase.runBare:286->testSetRemoteTransactionSynchronizationPolicy:128->QpidRestTestCase.waitForAttributeChanged:108
» Connect
  JMXManagementTest>QpidTestCase.run:148->QpidBrokerTestCase.runBare:286->testRemoveRemoteNodeFromGroup:164->getStoreBeanForNodeAtBrokerPort:276
» IO
  JMXManagementTest>QpidTestCase.run:148->QpidBrokerTestCase.runBare:286->testVirtualHostOperationsDeniedForNonMasterNode:187->getManagedBrokerBeanForNodeAtBrokerPort:283
» IO
  JMXManagementTest>QpidTestCase.run:148->QpidBrokerTestCase.runBare:286->testStateOfNonActiveBrokerIsNotMaster:133->getStoreBeanForNodeAtBrokerPort:276
» IO
  JMXManagementTest>QpidTestCase.run:148->QpidBrokerTestCase.runBare:286->testStateOfActiveBrokerIsMaster:125->getStoreBeanForNodeAtBrokerPort:276
» IO
  JMXManagementTest>QpidTestCase.run:148->QpidBrokerTestCase.runBare:286->testVirtualHostMbeanOnMasterTransfer:225->getManagedBrokerBeanForNodeAtBrokerPort:283
» IO
  JMXManagementTest>QpidTestCase.run:148->QpidBrokerTestCase.runBare:286->testGroupMembers:142->getStoreBeanForNodeAtBrokerPort:276
» IO
  JMXManagementTest>QpidTestCase.run:148->QpidBrokerTestCase.runBare:286->testReadonlyMBeanAttributes:111->getStoreBeanForNodeAtBrokerPort:276
» IO

Tests run: 42, Failures: 17, Errors: 17, Skipped: 0

[INFO] ------------------------------------------------------------------------
[INFO] Reactor Summary:
[INFO] 
[INFO] Qpid Java Build ................................... SUCCESS [3.133s]
[INFO] Qpid AMQP 1.0 Common .............................. SUCCESS [4.878s]
[INFO] Qpid AMQP 1.0 Client .............................. SUCCESS [0.808s]
[INFO] Qpid AMQP 1.0 Client JMS .......................... SUCCESS [1.907s]
[INFO] Qpid AMQP 1.0 JMS Client Examples ................. SUCCESS [0.212s]
[INFO] Qpid AMQP 1.0 Client WebSocket .................... SUCCESS [0.711s]
[INFO] Qpid Broker Code Generation ....................... SUCCESS [0.338s]
[INFO] Qpid Test Utilities ............................... SUCCESS [0.293s]
[INFO] Qpid Common ....................................... SUCCESS [29.767s]
[INFO] Qpid Management Common ............................ SUCCESS [1.243s]
[INFO] Qpid Java Broker Core ............................. SUCCESS [1:22.188s]
[INFO] Qpid Access Control Broker Plug-in ................ SUCCESS [3.905s]
[INFO] Qpid AMQP 0-8 Protocol Broker Plug-in ............. SUCCESS [20.658s]
[INFO] Qpid AMQP 0-10 Protocol Plug-in ................... SUCCESS [4.255s]
[INFO] Qpid AMQP 1-0 Protocol Broker Plug-in ............. SUCCESS [0.534s]
[INFO] Qpid AMQP 0-8 to 0-10 Message Conversion Broker Plug-in  SUCCESS [0.278s]
[INFO] Qpid AMQP 0-8 to 1-0 Message Conversion Broker Plug-in  SUCCESS [0.303s]
[INFO] Qpid AMQP 0-10 to 1-0 Message Conversion Broker Plug-in  SUCCESS [0.279s]
[INFO] Qpid Derby Message Store .......................... SUCCESS [15.791s]
[INFO] Qpid JDBC Message Store Connection Pooling Plug-in  SUCCESS [0.413s]
[INFO] Qpid JDBC Message Store Broker Plug-in ............ SUCCESS [9.237s]
[INFO] Qpid HTTP Management Broker Plug-in ............... SUCCESS [5.172s]
[INFO] Qpid JMX Management Broker Plug-in ................ SUCCESS [3.306s]
[INFO] Qpid Memory Message Store Broker Plug-in .......... SUCCESS [0.923s]
[INFO] Qpid WebSocket Broker Plug-in ..................... SUCCESS [0.285s]
[INFO] Qpid AMQP 0-x JMS Client .......................... SUCCESS [6.961s]
[INFO] Qpid BDB Message Store ............................ SUCCESS [2:08.029s]
[INFO] Qpid BDB Message Store JMX ........................ SUCCESS [1.970s]
[INFO] Qpid Java Broker .................................. SUCCESS [4.632s]
[INFO] Qpid AMQP Management Protocol Broker Plug-in ...... SUCCESS [0.290s]
[INFO] Qpid AMQP 0-x JMS Client Examples ................. SUCCESS [0.139s]
[INFO] Qpid JCA .......................................... SUCCESS [2.156s]
[INFO] Qpid Resource Adaptor ............................. SUCCESS [0.484s]
[INFO] Qpid Tools ........................................ SUCCESS [0.421s]
[INFO] Qpid Management Examples .......................... SUCCESS [0.208s]
[INFO] Qpid Java System Test Parent ...................... SUCCESS [0.953s]
[INFO] Qpid System Tests ................................. SUCCESS [5:52.726s]
[INFO] Qpid Performance Tests ............................ SUCCESS [13.296s]
[INFO] Qpid Performance Test System Tests ................ FAILURE [16.358s]
[INFO] Qpid Performance Tests Visualisation JFC .......... SUCCESS [4.825s]
[INFO] Qpid BDB Store System Tests ....................... FAILURE [5.542s]
[INFO] ------------------------------------------------------------------------
[INFO] BUILD FAILURE
[INFO] ------------------------------------------------------------------------
[INFO] Total time: 12:11.041s
[INFO] Finished at: Sun Feb 22 00:57:57 UTC 2015
[INFO] Final Memory: 73M/395M
[INFO] ------------------------------------------------------------------------
[ERROR] Failed to execute goal org.apache.maven.plugins:maven-surefire-plugin:2.16:test (integration-test)
on project qpid-perftests-systests: There are test failures.
[ERROR] 
[ERROR] Please refer to <https://builds.apache.org/job/Qpid-Java-Cpp-Test/ws/trunk/qpid/java/qpid-perftests-systests/target/surefire-reports>
for the individual test results.
[ERROR] -> [Help 1]
[ERROR] Failed to execute goal org.apache.maven.plugins:maven-surefire-plugin:2.16:test (integration-test)
on project qpid-bdbstore-systests: There are test failures.
[ERROR] 
[ERROR] Please refer to <https://builds.apache.org/job/Qpid-Java-Cpp-Test/ws/trunk/qpid/java/bdbstore/systests/target/surefire-reports>
for the individual test results.
[ERROR] -> [Help 1]
[ERROR] 
[ERROR] To see the full stack trace of the errors, re-run Maven with the -e switch.
[ERROR] Re-run Maven using the -X switch to enable full debug logging.
[ERROR] 
[ERROR] For more information about the errors and possible solutions, please read the following
articles:
[ERROR] [Help 1] http://cwiki.apache.org/confluence/display/MAVEN/MojoFailureException
[ERROR] 
[ERROR] After correcting the problems, you can resume the build with the command
[ERROR]   mvn <goals> -rf :qpid-perftests-systests
Build step 'Invoke top-level Maven targets' marked build as failure
[locks-and-latches] Releasing all the locks
[locks-and-latches] All the locks released
Recording test results

Mime
View raw message