qpid-notifications mailing list archives

Site index · List index
Message view « Date » · « Thread »
Top « Date » · « Thread »
From Apache Jenkins Server <jenk...@builds.apache.org>
Subject Build failed in Jenkins: Qpid-Java-Cpp-Test #2401
Date Sat, 07 Feb 2015 22:42:28 GMT
See <https://builds.apache.org/job/Qpid-Java-Cpp-Test/2401/changes>

Changes:

[kwall] QPID-6372: [Java Broker] Windows - localise the environment variable changes made
by qpid-startup.bat

[kwall] QPID-6371: [Java Broker/Java Common] Prevent log4j warning during Broker startup

------------------------------------------
[...truncated 5874 lines...]
Tests run: 3, Failures: 0, Errors: 0, Skipped: 0, Time elapsed: 0.017 sec - in org.apache.qpid.disttest.controller.config.ConnectionConfigTest
Running org.apache.qpid.disttest.controller.config.SessionConfigTest
Tests run: 3, Failures: 0, Errors: 0, Skipped: 0, Time elapsed: 0.038 sec - in org.apache.qpid.disttest.controller.config.SessionConfigTest
Running org.apache.qpid.disttest.controller.config.TestConfigTest
Tests run: 5, Failures: 0, Errors: 0, Skipped: 0, Time elapsed: 0.011 sec - in org.apache.qpid.disttest.controller.config.TestConfigTest
Running org.apache.qpid.disttest.controller.config.ConfigTest
Tests run: 1, Failures: 0, Errors: 0, Skipped: 0, Time elapsed: 0.009 sec - in org.apache.qpid.disttest.controller.config.ConfigTest
Running org.apache.qpid.disttest.controller.config.ProducerConfigTest
Tests run: 5, Failures: 0, Errors: 0, Skipped: 0, Time elapsed: 0.005 sec - in org.apache.qpid.disttest.controller.config.ProducerConfigTest
Running org.apache.qpid.disttest.controller.config.ClientConfigTest
Tests run: 4, Failures: 0, Errors: 0, Skipped: 0, Time elapsed: 0.007 sec - in org.apache.qpid.disttest.controller.config.ClientConfigTest
Running org.apache.qpid.disttest.controller.config.IterationValueTest
Tests run: 3, Failures: 0, Errors: 0, Skipped: 0, Time elapsed: 0.023 sec - in org.apache.qpid.disttest.controller.config.IterationValueTest
Running org.apache.qpid.disttest.controller.config.ConfigReaderTest
Tests run: 5, Failures: 0, Errors: 0, Skipped: 0, Time elapsed: 0.111 sec - in org.apache.qpid.disttest.controller.config.ConfigReaderTest
Running org.apache.qpid.disttest.controller.config.ConsumerConfigTest
Tests run: 2, Failures: 0, Errors: 0, Skipped: 0, Time elapsed: 0.001 sec - in org.apache.qpid.disttest.controller.config.ConsumerConfigTest
Running org.apache.qpid.disttest.controller.config.TestInstanceTest
Tests run: 3, Failures: 0, Errors: 0, Skipped: 0, Time elapsed: 0.008 sec - in org.apache.qpid.disttest.controller.config.TestInstanceTest
Running org.apache.qpid.disttest.controller.config.ParticipantConfigTest
Tests run: 1, Failures: 0, Errors: 0, Skipped: 0, Time elapsed: 0.011 sec - in org.apache.qpid.disttest.controller.config.ParticipantConfigTest
Running org.apache.qpid.disttest.controller.config.JavaScriptConfigEvaluatorTest
Tests run: 2, Failures: 0, Errors: 0, Skipped: 0, Time elapsed: 0.071 sec - in org.apache.qpid.disttest.controller.config.JavaScriptConfigEvaluatorTest
Running org.apache.qpid.disttest.controller.config.MessageProviderConfigTest
Tests run: 2, Failures: 0, Errors: 0, Skipped: 0, Time elapsed: 0.001 sec - in org.apache.qpid.disttest.controller.config.MessageProviderConfigTest
Running org.apache.qpid.disttest.controller.ParticipatingClientsTest
Tests run: 5, Failures: 0, Errors: 0, Skipped: 0, Time elapsed: 0.014 sec - in org.apache.qpid.disttest.controller.ParticipatingClientsTest
Running org.apache.qpid.disttest.controller.ClientRegistryTest
Tests run: 8, Failures: 0, Errors: 0, Skipped: 0, Time elapsed: 2.563 sec - in org.apache.qpid.disttest.controller.ClientRegistryTest
Running org.apache.qpid.disttest.controller.ControllerTest
Tests run: 6, Failures: 0, Errors: 0, Skipped: 0, Time elapsed: 0.043 sec - in org.apache.qpid.disttest.controller.ControllerTest
Running org.apache.qpid.disttest.controller.TestRunnerTest
Tests run: 6, Failures: 0, Errors: 0, Skipped: 0, Time elapsed: 1.129 sec - in org.apache.qpid.disttest.controller.TestRunnerTest
Running org.apache.qpid.disttest.ArgumentParserTest
Tests run: 3, Failures: 0, Errors: 0, Skipped: 0, Time elapsed: 0 sec - in org.apache.qpid.disttest.ArgumentParserTest
Running org.apache.qpid.disttest.jms.JmsMessageAdaptorTest
Tests run: 1, Failures: 0, Errors: 0, Skipped: 0, Time elapsed: 0.003 sec - in org.apache.qpid.disttest.jms.JmsMessageAdaptorTest
Running org.apache.qpid.disttest.VisitorTest
Tests run: 3, Failures: 0, Errors: 0, Skipped: 0, Time elapsed: 0.001 sec - in org.apache.qpid.disttest.VisitorTest

Results :

Tests run: 180, Failures: 0, Errors: 0, Skipped: 0

[INFO] 
[INFO] --- maven-jar-plugin:2.4:jar (default-jar) @ qpid-perftests ---
[INFO] Building jar: <https://builds.apache.org/job/Qpid-Java-Cpp-Test/ws/trunk/qpid/java/perftests/target/qpid-perftests-0.32-SNAPSHOT.jar>
[INFO] 
[INFO] --- maven-site-plugin:3.3:attach-descriptor (attach-descriptor) @ qpid-perftests ---
[INFO] 
[INFO] --- maven-assembly-plugin:2.4:single (make-assembly) @ qpid-perftests ---
[INFO] Reading assembly descriptor: src/main/assembly/qpid-perftests-bin.xml
[INFO] Building tar: <https://builds.apache.org/job/Qpid-Java-Cpp-Test/ws/trunk/qpid/java/perftests/target/qpid-perftests-0.32-SNAPSHOT-bin.tar.gz>
[WARNING] Entry: qpid-perftests/0.32-SNAPSHOT/etc/chartdefs/1302-QueueConsumersWithOverlappingSelectors-Transient.chartdef
longer than 100 characters.
[WARNING] Resulting tar file can only be processed successfully by GNU compatible tar commands
[WARNING] Entry: qpid-perftests/0.32-SNAPSHOT/etc/chartdefs/1300-QueueConsumersWithNonOverlappingSelectors-Transient.chartdef
longer than 100 characters.
[WARNING] Entry: qpid-perftests/0.32-SNAPSHOT/etc/chartdefs/1303-QueueConsumersWithOverlappingSelectors-Persistent.chartdef
longer than 100 characters.
[WARNING] Entry: qpid-perftests/0.32-SNAPSHOT/etc/chartdefs/1050-VaryingNumberOfProducerSessionsSingleConnection.chartdef
longer than 100 characters.
[WARNING] Entry: qpid-perftests/0.32-SNAPSHOT/etc/chartdefs/timeseries/1011-MultipleProducersAndConsumers-Persistent.chartdef
longer than 100 characters.
[WARNING] Entry: qpid-perftests/0.32-SNAPSHOT/etc/chartdefs/1301-QueueConsumersWithNonOverlappingSelectors-Persistent.chartdef
longer than 100 characters.
[INFO] 
[INFO] --- maven-antrun-plugin:1.7:run (create-qbtc-output-dir) @ qpid-perftests ---
[INFO] Executing tasks

main:
    [mkdir] Created dir: <https://builds.apache.org/job/Qpid-Java-Cpp-Test/ws/trunk/qpid/java/perftests/target/qbtc-test-config>
[INFO] Executed tasks
[INFO]                                                                         
[INFO] ------------------------------------------------------------------------
[INFO] Skipping Qpid Performance Test System Tests
[INFO] This project has been banned from the build due to previous failures.
[INFO] ------------------------------------------------------------------------
[INFO]                                                                         
[INFO] ------------------------------------------------------------------------
[INFO] Building Qpid Performance Tests Visualisation JFC 0.32-SNAPSHOT
[INFO] ------------------------------------------------------------------------
[INFO] 
[INFO] --- maven-clean-plugin:2.5:clean (default-clean) @ qpid-perftests-visualisation-jfc
---
[INFO] 
[INFO] --- maven-antrun-plugin:1.7:run (output-test-properties) @ qpid-perftests-visualisation-jfc
---
[INFO] Executing tasks

main:
     [echo] Qpid Test Profile Properties
     [echo] [profile] cpp
     [echo] [profile.broker.language] cpp
     [echo] [profile.broker.type] spawned
     [echo] [profile.broker.command] "<https://builds.apache.org/job/Qpid-Java-Cpp-Test/ws/cpp-build/src/qpidd">
-p @PORT --data-dir "<https://builds.apache.org/job/Qpid-Java-Cpp-Test/ws/trunk/qpid/java/perftests/visualisation-jfc/target/QPID_WORK/@PORT">
-t --auth no --no-module-dir
     [echo] [profile.specific.excludes] CPPPrefetchExcludes CPPTransientExcludes
     [echo] [profile.test.excludes] Excludes CPPExcludes cpp.excludes CPPPrefetchExcludes
CPPTransientExcludes cpp.excludes
     [echo] [profile.broker.version] v0_10
     [echo] [profile.test.amqp_port_protocols] ["AMQP_0_8","AMQP_0_9","AMQP_0_9_1","AMQP_0_10"]
     [echo] [profile.broker.persistent] false
     [echo] [profile.virtualhostnode.type] Memory
     [echo] [profile.virtualhostnode.context.blueprint] ${profile.virtualhostnode.context.blueprint}
[INFO] Executed tasks
[INFO] 
[INFO] --- maven-enforcer-plugin:1.3.1:enforce (enforce-minimum-versions) @ qpid-perftests-visualisation-jfc
---
[INFO] 
[INFO] --- maven-enforcer-plugin:1.3.1:enforce (enforce-versions-standard-properties) @ qpid-perftests-visualisation-jfc
---
[INFO] 
[INFO] --- maven-enforcer-plugin:1.3.1:enforce (enforce-cpp-broker-dir-defined) @ qpid-perftests-visualisation-jfc
---
[INFO] 
[INFO] --- jacoco-maven-plugin:0.7.0.201403182114:prepare-agent (default-prepare-agent) @
qpid-perftests-visualisation-jfc ---
[INFO] argLine set to -javaagent:/home/jenkins/.m2/repository/org/jacoco/org.jacoco.agent/0.7.0.201403182114/org.jacoco.agent-0.7.0.201403182114-runtime.jar=destfile=<https://builds.apache.org/job/Qpid-Java-Cpp-Test/ws/trunk/qpid/java/perftests/visualisation-jfc/target/jacoco.exec>
-Xmx512m
[INFO] 
[INFO] --- maven-remote-resources-plugin:1.5:process (default) @ qpid-perftests-visualisation-jfc
---
[INFO] 
[INFO] --- maven-resources-plugin:2.6:resources (default-resources) @ qpid-perftests-visualisation-jfc
---
[INFO] Using 'UTF-8' encoding to copy filtered resources.
[INFO] skip non existing resourceDirectory <https://builds.apache.org/job/Qpid-Java-Cpp-Test/ws/trunk/qpid/java/perftests/visualisation-jfc/src/main/resources>
[INFO] Copying 0 resource
[INFO] Copying 3 resources
[INFO] 
[INFO] --- maven-compiler-plugin:3.1:compile (default-compile) @ qpid-perftests-visualisation-jfc
---
[INFO] Changes detected - recompiling the module!
[INFO] Compiling 30 source files to <https://builds.apache.org/job/Qpid-Java-Cpp-Test/ws/trunk/qpid/java/perftests/visualisation-jfc/target/classes>
[INFO] 
[INFO] --- maven-resources-plugin:2.6:testResources (default-testResources) @ qpid-perftests-visualisation-jfc
---
[INFO] Using 'UTF-8' encoding to copy filtered resources.
[INFO] Copying 1 resource
[INFO] skip non existing resourceDirectory <https://builds.apache.org/job/Qpid-Java-Cpp-Test/ws/trunk/qpid/java/perftests/visualisation-jfc/src/test/resources>
[INFO] Copying 3 resources
[INFO] 
[INFO] --- maven-compiler-plugin:3.1:testCompile (default-testCompile) @ qpid-perftests-visualisation-jfc
---
[INFO] Changes detected - recompiling the module!
[INFO] Compiling 11 source files to <https://builds.apache.org/job/Qpid-Java-Cpp-Test/ws/trunk/qpid/java/perftests/visualisation-jfc/target/test-classes>
[INFO] 
[INFO] --- maven-surefire-plugin:2.16:test (default-test) @ qpid-perftests-visualisation-jfc
---
[INFO] Surefire report directory: <https://builds.apache.org/job/Qpid-Java-Cpp-Test/ws/trunk/qpid/java/perftests/visualisation-jfc/target/surefire-reports>

-------------------------------------------------------
 T E S T S
-------------------------------------------------------
Running org.apache.qpid.disttest.charting.writer.ChartWriterTest
log4j:WARN No appenders could be found for logger (org.apache.qpid.test.utils.QpidTestCase).
log4j:WARN Please initialize the log4j system properly.
log4j:WARN See http://logging.apache.org/log4j/1.2/faq.html#noconfig for more info.
Tests run: 3, Failures: 0, Errors: 0, Skipped: 0, Time elapsed: 1.663 sec - in org.apache.qpid.disttest.charting.writer.ChartWriterTest
Running org.apache.qpid.disttest.charting.definition.ChartingDefinitionCreatorTest
Tests run: 4, Failures: 0, Errors: 0, Skipped: 0, Time elapsed: 0.04 sec - in org.apache.qpid.disttest.charting.definition.ChartingDefinitionCreatorTest
Running org.apache.qpid.disttest.charting.definition.SeriesDefinitionCreatorTest
Tests run: 4, Failures: 0, Errors: 0, Skipped: 0, Time elapsed: 0.005 sec - in org.apache.qpid.disttest.charting.definition.SeriesDefinitionCreatorTest
Running org.apache.qpid.disttest.charting.chartbuilder.ChartBuilderFactoryTest
Tests run: 6, Failures: 0, Errors: 0, Skipped: 0, Time elapsed: 0.022 sec - in org.apache.qpid.disttest.charting.chartbuilder.ChartBuilderFactoryTest
Running org.apache.qpid.disttest.charting.chartbuilder.ColorFactoryTest
Tests run: 2, Failures: 0, Errors: 0, Skipped: 0, Time elapsed: 0.002 sec - in org.apache.qpid.disttest.charting.chartbuilder.ColorFactoryTest
Running org.apache.qpid.disttest.charting.chartbuilder.ChartProductionTest
Tests run: 8, Failures: 0, Errors: 0, Skipped: 0, Time elapsed: 0.859 sec - in org.apache.qpid.disttest.charting.chartbuilder.ChartProductionTest
Running org.apache.qpid.disttest.charting.chartbuilder.BaseChartBuilderTest
Tests run: 1, Failures: 0, Errors: 0, Skipped: 0, Time elapsed: 0.056 sec - in org.apache.qpid.disttest.charting.chartbuilder.BaseChartBuilderTest
Running org.apache.qpid.disttest.charting.chartbuilder.TimeSeriesBuilderCallbackTest
Tests run: 1, Failures: 0, Errors: 0, Skipped: 0, Time elapsed: 0.003 sec - in org.apache.qpid.disttest.charting.chartbuilder.TimeSeriesBuilderCallbackTest
Running org.apache.qpid.disttest.charting.seriesbuilder.JdbcSeriesBuilderTest
Tests run: 1, Failures: 0, Errors: 0, Skipped: 0, Time elapsed: 0.143 sec - in org.apache.qpid.disttest.charting.seriesbuilder.JdbcSeriesBuilderTest
Running org.apache.qpid.disttest.charting.seriesbuilder.JdbcUrlGeneratorTest
Tests run: 4, Failures: 0, Errors: 0, Skipped: 0, Time elapsed: 0.002 sec - in org.apache.qpid.disttest.charting.seriesbuilder.JdbcUrlGeneratorTest
Running org.apache.qpid.disttest.charting.seriesbuilder.SeriesRowTest
Tests run: 5, Failures: 0, Errors: 0, Skipped: 0, Time elapsed: 0.002 sec - in org.apache.qpid.disttest.charting.seriesbuilder.SeriesRowTest

Results :

Tests run: 39, Failures: 0, Errors: 0, Skipped: 0

[INFO] 
[INFO] --- maven-jar-plugin:2.4:jar (default-jar) @ qpid-perftests-visualisation-jfc ---
[INFO] Building jar: <https://builds.apache.org/job/Qpid-Java-Cpp-Test/ws/trunk/qpid/java/perftests/visualisation-jfc/target/qpid-perftests-visualisation-jfc-0.32-SNAPSHOT.jar>
[INFO] 
[INFO] --- maven-site-plugin:3.3:attach-descriptor (attach-descriptor) @ qpid-perftests-visualisation-jfc
---
[INFO] 
[INFO] --- maven-antrun-plugin:1.7:run (create-qbtc-output-dir) @ qpid-perftests-visualisation-jfc
---
[INFO] Executing tasks

main:
    [mkdir] Created dir: <https://builds.apache.org/job/Qpid-Java-Cpp-Test/ws/trunk/qpid/java/perftests/visualisation-jfc/target/qbtc-test-config>
[INFO] Executed tasks
[INFO]                                                                         
[INFO] ------------------------------------------------------------------------
[INFO] Skipping Qpid BDB Store System Tests
[INFO] This project has been banned from the build due to previous failures.
[INFO] ------------------------------------------------------------------------
[INFO] ------------------------------------------------------------------------
[INFO] Reactor Summary:
[INFO] 
[INFO] Qpid Java Build ................................... SUCCESS [2.252s]
[INFO] Qpid AMQP 1.0 Common .............................. SUCCESS [5.569s]
[INFO] Qpid AMQP 1.0 Client .............................. SUCCESS [0.775s]
[INFO] Qpid AMQP 1.0 Client JMS .......................... SUCCESS [1.785s]
[INFO] Qpid AMQP 1.0 JMS Client Examples ................. SUCCESS [0.212s]
[INFO] Qpid AMQP 1.0 Client WebSocket .................... SUCCESS [0.554s]
[INFO] Qpid Broker Code Generation ....................... SUCCESS [0.579s]
[INFO] Qpid Test Utilities ............................... SUCCESS [0.240s]
[INFO] Qpid Common ....................................... SUCCESS [28.122s]
[INFO] Qpid Management Common ............................ SUCCESS [1.307s]
[INFO] Qpid Java Broker Core ............................. SUCCESS [1:21.993s]
[INFO] Qpid Access Control Broker Plug-in ................ SUCCESS [3.892s]
[INFO] Qpid AMQP 0-8 Protocol Broker Plug-in ............. SUCCESS [20.314s]
[INFO] Qpid AMQP 0-10 Protocol Plug-in ................... SUCCESS [4.244s]
[INFO] Qpid AMQP 1-0 Protocol Broker Plug-in ............. SUCCESS [0.497s]
[INFO] Qpid AMQP 0-8 to 0-10 Message Conversion Broker Plug-in  SUCCESS [0.292s]
[INFO] Qpid AMQP 0-8 to 1-0 Message Conversion Broker Plug-in  SUCCESS [0.274s]
[INFO] Qpid AMQP 0-10 to 1-0 Message Conversion Broker Plug-in  SUCCESS [0.237s]
[INFO] Qpid Derby Message Store .......................... SUCCESS [16.557s]
[INFO] Qpid JDBC Message Store Connection Pooling Plug-in  SUCCESS [0.402s]
[INFO] Qpid JDBC Message Store Broker Plug-in ............ SUCCESS [9.153s]
[INFO] Qpid HTTP Management Broker Plug-in ............... SUCCESS [5.247s]
[INFO] Qpid JMX Management Broker Plug-in ................ SUCCESS [3.185s]
[INFO] Qpid Memory Message Store Broker Plug-in .......... SUCCESS [0.376s]
[INFO] Qpid WebSocket Broker Plug-in ..................... SUCCESS [0.306s]
[INFO] Qpid AMQP 0-x JMS Client .......................... SUCCESS [6.746s]
[INFO] Qpid BDB Message Store ............................ SUCCESS [2:14.049s]
[INFO] Qpid BDB Message Store JMX ........................ SUCCESS [1.983s]
[INFO] Qpid Java Broker .................................. SUCCESS [4.639s]
[INFO] Qpid AMQP Management Protocol Broker Plug-in ...... SUCCESS [0.247s]
[INFO] Qpid AMQP 0-x JMS Client Examples ................. SUCCESS [0.139s]
[INFO] Qpid JCA .......................................... SUCCESS [1.506s]
[INFO] Qpid Resource Adaptor ............................. SUCCESS [0.405s]
[INFO] Qpid Tools ........................................ SUCCESS [0.404s]
[INFO] Qpid Management Examples .......................... SUCCESS [0.161s]
[INFO] Qpid Java System Test Parent ...................... SUCCESS [0.785s]
[INFO] Qpid System Tests ................................. FAILURE [6:00.240s]
[INFO] Qpid Performance Tests ............................ SUCCESS [13.393s]
[INFO] Qpid Performance Test System Tests ................ SKIPPED
[INFO] Qpid Performance Tests Visualisation JFC .......... SUCCESS [3.867s]
[INFO] Qpid BDB Store System Tests ....................... SKIPPED
[INFO] ------------------------------------------------------------------------
[INFO] BUILD FAILURE
[INFO] ------------------------------------------------------------------------
[INFO] Total time: 11:58.111s
[INFO] Finished at: Sat Feb 07 22:42:10 UTC 2015
[INFO] Final Memory: 71M/381M
[INFO] ------------------------------------------------------------------------
[ERROR] Failed to execute goal org.apache.maven.plugins:maven-surefire-plugin:2.16:test (integration-test)
on project qpid-systests: There are test failures.
[ERROR] 
[ERROR] Please refer to <https://builds.apache.org/job/Qpid-Java-Cpp-Test/ws/trunk/qpid/java/systests/target/surefire-reports>
for the individual test results.
[ERROR] -> [Help 1]
[ERROR] 
[ERROR] To see the full stack trace of the errors, re-run Maven with the -e switch.
[ERROR] Re-run Maven using the -X switch to enable full debug logging.
[ERROR] 
[ERROR] For more information about the errors and possible solutions, please read the following
articles:
[ERROR] [Help 1] http://cwiki.apache.org/confluence/display/MAVEN/MojoFailureException
[ERROR] 
[ERROR] After correcting the problems, you can resume the build with the command
[ERROR]   mvn <goals> -rf :qpid-systests
Build step 'Invoke top-level Maven targets' marked build as failure
[locks-and-latches] Releasing all the locks
[locks-and-latches] All the locks released
Recording test results

Mime
View raw message