qpid-notifications mailing list archives

Site index · List index
Message view « Date » · « Thread »
Top « Date » · « Thread »
From Apache Jenkins Server <jenk...@builds.apache.org>
Subject Build failed in Jenkins: Qpid-Java-Cpp-Test #2420
Date Tue, 17 Feb 2015 18:34:11 GMT
See <https://builds.apache.org/job/Qpid-Java-Cpp-Test/2420/changes>

Changes:

[rgodfrey] QPID-6395 : [Java Broker] add support for queue default filters, and filters solely
on arrival time

------------------------------------------
[...truncated 6552 lines...]
	at junit.framework.TestCase.assertTrue(TestCase.java:201)
	at org.apache.qpid.server.store.berkeleydb.replication.MultiNodeTest.setUp(MultiNodeTest.java:81)

testPersistentMessagesAvailableAfterFailover(org.apache.qpid.server.store.berkeleydb.replication.MultiNodeTest)
 Time elapsed: 0.005 sec  <<< FAILURE!
junit.framework.AssertionFailedError: null
	at junit.framework.Assert.fail(Assert.java:55)
	at junit.framework.Assert.assertTrue(Assert.java:22)
	at junit.framework.Assert.assertTrue(Assert.java:31)
	at junit.framework.TestCase.assertTrue(TestCase.java:201)
	at org.apache.qpid.server.store.berkeleydb.replication.MultiNodeTest.setUp(MultiNodeTest.java:81)

Running org.apache.qpid.server.store.berkeleydb.replication.TwoNodeTest
Tests run: 7, Failures: 7, Errors: 0, Skipped: 0, Time elapsed: 0.043 sec <<< FAILURE!
- in org.apache.qpid.server.store.berkeleydb.replication.TwoNodeTest
testMasterDesignatedPrimaryCanBeRestartedWithoutReplica(org.apache.qpid.server.store.berkeleydb.replication.TwoNodeTest)
 Time elapsed: 0.005 sec  <<< FAILURE!
junit.framework.AssertionFailedError: null
	at junit.framework.Assert.fail(Assert.java:55)
	at junit.framework.Assert.assertTrue(Assert.java:22)
	at junit.framework.Assert.assertTrue(Assert.java:31)
	at junit.framework.TestCase.assertTrue(TestCase.java:201)
	at org.apache.qpid.server.store.berkeleydb.replication.TwoNodeTest.setUp(TwoNodeTest.java:55)

testSecondaryDesignatedAsPrimaryAfterOriginalPrimaryStopped(org.apache.qpid.server.store.berkeleydb.replication.TwoNodeTest)
 Time elapsed: 0.006 sec  <<< FAILURE!
junit.framework.AssertionFailedError: null
	at junit.framework.Assert.fail(Assert.java:55)
	at junit.framework.Assert.assertTrue(Assert.java:22)
	at junit.framework.Assert.assertTrue(Assert.java:31)
	at junit.framework.TestCase.assertTrue(TestCase.java:201)
	at org.apache.qpid.server.store.berkeleydb.replication.TwoNodeTest.setUp(TwoNodeTest.java:55)

testClusterRestartWithoutDesignatedPrimary(org.apache.qpid.server.store.berkeleydb.replication.TwoNodeTest)
 Time elapsed: 0.005 sec  <<< FAILURE!
junit.framework.AssertionFailedError: null
	at junit.framework.Assert.fail(Assert.java:55)
	at junit.framework.Assert.assertTrue(Assert.java:22)
	at junit.framework.Assert.assertTrue(Assert.java:31)
	at junit.framework.TestCase.assertTrue(TestCase.java:201)
	at org.apache.qpid.server.store.berkeleydb.replication.TwoNodeTest.setUp(TwoNodeTest.java:55)

testDesignatedPrimaryContinuesAfterSecondaryStopped(org.apache.qpid.server.store.berkeleydb.replication.TwoNodeTest)
 Time elapsed: 0.005 sec  <<< FAILURE!
junit.framework.AssertionFailedError: null
	at junit.framework.Assert.fail(Assert.java:55)
	at junit.framework.Assert.assertTrue(Assert.java:22)
	at junit.framework.Assert.assertTrue(Assert.java:31)
	at junit.framework.TestCase.assertTrue(TestCase.java:201)
	at org.apache.qpid.server.store.berkeleydb.replication.TwoNodeTest.setUp(TwoNodeTest.java:55)

testPersistentOperationsFailOnNonDesignatedPrimaryAfterSecondaryStopped(org.apache.qpid.server.store.berkeleydb.replication.TwoNodeTest)
 Time elapsed: 0.006 sec  <<< FAILURE!
junit.framework.AssertionFailedError: null
	at junit.framework.Assert.fail(Assert.java:55)
	at junit.framework.Assert.assertTrue(Assert.java:22)
	at junit.framework.Assert.assertTrue(Assert.java:31)
	at junit.framework.TestCase.assertTrue(TestCase.java:201)
	at org.apache.qpid.server.store.berkeleydb.replication.TwoNodeTest.setUp(TwoNodeTest.java:55)

testInitialDesignatedPrimaryStateOfNodes(org.apache.qpid.server.store.berkeleydb.replication.TwoNodeTest)
 Time elapsed: 0.005 sec  <<< FAILURE!
junit.framework.AssertionFailedError: null
	at junit.framework.Assert.fail(Assert.java:55)
	at junit.framework.Assert.assertTrue(Assert.java:22)
	at junit.framework.Assert.assertTrue(Assert.java:31)
	at junit.framework.TestCase.assertTrue(TestCase.java:201)
	at org.apache.qpid.server.store.berkeleydb.replication.TwoNodeTest.setUp(TwoNodeTest.java:55)

testSecondaryDoesNotBecomePrimaryWhenDesignatedPrimaryStopped(org.apache.qpid.server.store.berkeleydb.replication.TwoNodeTest)
 Time elapsed: 0.005 sec  <<< FAILURE!
junit.framework.AssertionFailedError: null
	at junit.framework.Assert.fail(Assert.java:55)
	at junit.framework.Assert.assertTrue(Assert.java:22)
	at junit.framework.Assert.assertTrue(Assert.java:31)
	at junit.framework.TestCase.assertTrue(TestCase.java:201)
	at org.apache.qpid.server.store.berkeleydb.replication.TwoNodeTest.setUp(TwoNodeTest.java:55)

Running org.apache.qpid.server.store.berkeleydb.replication.BDBHAVirtualHostRestTest
Tests run: 3, Failures: 0, Errors: 3, Skipped: 0, Time elapsed: 0.098 sec <<< FAILURE!
- in org.apache.qpid.server.store.berkeleydb.replication.BDBHAVirtualHostRestTest
testSetLocalTransactionSynchronizationPolicy(org.apache.qpid.server.store.berkeleydb.replication.BDBHAVirtualHostRestTest)
 Time elapsed: 0.037 sec  <<< ERROR!
java.net.ConnectException: Connection refused
	at java.net.PlainSocketImpl.socketConnect(Native Method)
	at java.net.AbstractPlainSocketImpl.doConnect(AbstractPlainSocketImpl.java:339)
	at java.net.AbstractPlainSocketImpl.connectToAddress(AbstractPlainSocketImpl.java:200)
	at java.net.AbstractPlainSocketImpl.connect(AbstractPlainSocketImpl.java:182)
	at java.net.SocksSocketImpl.connect(SocksSocketImpl.java:392)
	at java.net.Socket.connect(Socket.java:579)
	at sun.net.NetworkClient.doConnect(NetworkClient.java:175)
	at sun.net.www.http.HttpClient.openServer(HttpClient.java:378)
	at sun.net.www.http.HttpClient.openServer(HttpClient.java:473)
	at sun.net.www.http.HttpClient.<init>(HttpClient.java:203)
	at sun.net.www.http.HttpClient.New(HttpClient.java:290)
	at sun.net.www.http.HttpClient.New(HttpClient.java:306)
	at sun.net.www.protocol.http.HttpURLConnection.getNewHttpClient(HttpURLConnection.java:995)
	at sun.net.www.protocol.http.HttpURLConnection.plainConnect(HttpURLConnection.java:931)
	at sun.net.www.protocol.http.HttpURLConnection.connect(HttpURLConnection.java:849)
	at org.apache.qpid.systest.rest.RestTestHelper.getJsonAsList(RestTestHelper.java:290)
	at org.apache.qpid.systest.rest.QpidRestTestCase.waitForAttributeChanged(QpidRestTestCase.java:114)
	at org.apache.qpid.server.store.berkeleydb.replication.BDBHAVirtualHostRestTest.testSetLocalTransactionSynchronizationPolicy(BDBHAVirtualHostRestTest.java:116)

testMutateState(org.apache.qpid.server.store.berkeleydb.replication.BDBHAVirtualHostRestTest)
 Time elapsed: 0.03 sec  <<< ERROR!
java.net.ConnectException: Connection refused
	at java.net.PlainSocketImpl.socketConnect(Native Method)
	at java.net.AbstractPlainSocketImpl.doConnect(AbstractPlainSocketImpl.java:339)
	at java.net.AbstractPlainSocketImpl.connectToAddress(AbstractPlainSocketImpl.java:200)
	at java.net.AbstractPlainSocketImpl.connect(AbstractPlainSocketImpl.java:182)
	at java.net.SocksSocketImpl.connect(SocksSocketImpl.java:392)
	at java.net.Socket.connect(Socket.java:579)
	at sun.net.NetworkClient.doConnect(NetworkClient.java:175)
	at sun.net.www.http.HttpClient.openServer(HttpClient.java:378)
	at sun.net.www.http.HttpClient.openServer(HttpClient.java:473)
	at sun.net.www.http.HttpClient.<init>(HttpClient.java:203)
	at sun.net.www.http.HttpClient.New(HttpClient.java:290)
	at sun.net.www.http.HttpClient.New(HttpClient.java:306)
	at sun.net.www.protocol.http.HttpURLConnection.getNewHttpClient(HttpURLConnection.java:995)
	at sun.net.www.protocol.http.HttpURLConnection.plainConnect(HttpURLConnection.java:931)
	at sun.net.www.protocol.http.HttpURLConnection.connect(HttpURLConnection.java:849)
	at org.apache.qpid.systest.rest.RestTestHelper.getJsonAsList(RestTestHelper.java:290)
	at org.apache.qpid.systest.rest.QpidRestTestCase.waitForAttributeChanged(QpidRestTestCase.java:114)
	at org.apache.qpid.server.store.berkeleydb.replication.BDBHAVirtualHostRestTest.testMutateState(BDBHAVirtualHostRestTest.java:140)

testSetRemoteTransactionSynchronizationPolicy(org.apache.qpid.server.store.berkeleydb.replication.BDBHAVirtualHostRestTest)
 Time elapsed: 0.03 sec  <<< ERROR!
java.net.ConnectException: Connection refused
	at java.net.PlainSocketImpl.socketConnect(Native Method)
	at java.net.AbstractPlainSocketImpl.doConnect(AbstractPlainSocketImpl.java:339)
	at java.net.AbstractPlainSocketImpl.connectToAddress(AbstractPlainSocketImpl.java:200)
	at java.net.AbstractPlainSocketImpl.connect(AbstractPlainSocketImpl.java:182)
	at java.net.SocksSocketImpl.connect(SocksSocketImpl.java:392)
	at java.net.Socket.connect(Socket.java:579)
	at sun.net.NetworkClient.doConnect(NetworkClient.java:175)
	at sun.net.www.http.HttpClient.openServer(HttpClient.java:378)
	at sun.net.www.http.HttpClient.openServer(HttpClient.java:473)
	at sun.net.www.http.HttpClient.<init>(HttpClient.java:203)
	at sun.net.www.http.HttpClient.New(HttpClient.java:290)
	at sun.net.www.http.HttpClient.New(HttpClient.java:306)
	at sun.net.www.protocol.http.HttpURLConnection.getNewHttpClient(HttpURLConnection.java:995)
	at sun.net.www.protocol.http.HttpURLConnection.plainConnect(HttpURLConnection.java:931)
	at sun.net.www.protocol.http.HttpURLConnection.connect(HttpURLConnection.java:849)
	at org.apache.qpid.systest.rest.RestTestHelper.getJsonAsList(RestTestHelper.java:290)
	at org.apache.qpid.systest.rest.QpidRestTestCase.waitForAttributeChanged(QpidRestTestCase.java:114)
	at org.apache.qpid.server.store.berkeleydb.replication.BDBHAVirtualHostRestTest.testSetRemoteTransactionSynchronizationPolicy(BDBHAVirtualHostRestTest.java:128)


Results :

Failed tests: 
  MultiNodeTest>QpidTestCase.run:148->QpidBrokerTestCase.runBare:272->setUp:81 null
  MultiNodeTest>QpidTestCase.run:148->QpidBrokerTestCase.runBare:272->setUp:81 null
  MultiNodeTest>QpidTestCase.run:148->QpidBrokerTestCase.runBare:272->setUp:81 null
  MultiNodeTest>QpidTestCase.run:148->QpidBrokerTestCase.runBare:272->setUp:81 null
  MultiNodeTest>QpidTestCase.run:148->QpidBrokerTestCase.runBare:272->setUp:81 null
  MultiNodeTest>QpidTestCase.run:148->QpidBrokerTestCase.runBare:272->setUp:81 null
  MultiNodeTest>QpidTestCase.run:148->QpidBrokerTestCase.runBare:272->setUp:81 null
  MultiNodeTest>QpidTestCase.run:148->QpidBrokerTestCase.runBare:272->setUp:81 null
  MultiNodeTest>QpidTestCase.run:148->QpidBrokerTestCase.runBare:272->setUp:81 null
  MultiNodeTest>QpidTestCase.run:148->QpidBrokerTestCase.runBare:272->setUp:81 null
  TwoNodeTest>QpidTestCase.run:148->QpidBrokerTestCase.runBare:272->setUp:55 null
  TwoNodeTest>QpidTestCase.run:148->QpidBrokerTestCase.runBare:272->setUp:55 null
  TwoNodeTest>QpidTestCase.run:148->QpidBrokerTestCase.runBare:272->setUp:55 null
  TwoNodeTest>QpidTestCase.run:148->QpidBrokerTestCase.runBare:272->setUp:55 null
  TwoNodeTest>QpidTestCase.run:148->QpidBrokerTestCase.runBare:272->setUp:55 null
  TwoNodeTest>QpidTestCase.run:148->QpidBrokerTestCase.runBare:272->setUp:55 null
  TwoNodeTest>QpidTestCase.run:148->QpidBrokerTestCase.runBare:272->setUp:55 null

Tests in error: 
  BDBHAVirtualHostNodeRestTest>QpidTestCase.run:148->QpidBrokerTestCase.runBare:272->testNewMasterElectedWhenVirtualHostIsStopped:135->createHANode:317
? Connect
  BDBHAVirtualHostNodeRestTest>QpidTestCase.run:148->QpidBrokerTestCase.runBare:272->testMutateStateOfOneNode:103->createHANode:317
? Connect
  BDBHAVirtualHostNodeRestTest>QpidTestCase.run:148->QpidBrokerTestCase.runBare:272->testIntruderProtection:252->createHANode:317
? Connect
  BDBHAVirtualHostNodeRestTest>QpidTestCase.run:148->QpidBrokerTestCase.runBare:272->testDeleteMasterNode:192->createHANode:317
? Connect
  BDBHAVirtualHostNodeRestTest>QpidTestCase.run:148->QpidBrokerTestCase.runBare:272->testCreate3NodeGroup:92->createHANode:317
? Connect
  BDBHAVirtualHostNodeRestTest>QpidTestCase.run:148->QpidBrokerTestCase.runBare:272->testDeleteReplicaNode:166->createHANode:317
? Connect
  BDBHAVirtualHostNodeRestTest>QpidTestCase.run:148->QpidBrokerTestCase.runBare:272->testIntruderBDBHAVHNNotAllowedToConnect:232->createHANode:317
? Connect
  JMXManagementTest>QpidTestCase.run:148->QpidBrokerTestCase.runBare:272->testRemoveRemoteNodeFromGroup:164->getStoreBeanForNodeAtBrokerPort:276
? IO
  JMXManagementTest>QpidTestCase.run:148->QpidBrokerTestCase.runBare:272->testVirtualHostOperationsDeniedForNonMasterNode:187->getManagedBrokerBeanForNodeAtBrokerPort:283
? IO
  JMXManagementTest>QpidTestCase.run:148->QpidBrokerTestCase.runBare:272->testStateOfNonActiveBrokerIsNotMaster:133->getStoreBeanForNodeAtBrokerPort:276
? IO
  JMXManagementTest>QpidTestCase.run:148->QpidBrokerTestCase.runBare:272->testStateOfActiveBrokerIsMaster:125->getStoreBeanForNodeAtBrokerPort:276
? IO
  JMXManagementTest>QpidTestCase.run:148->QpidBrokerTestCase.runBare:272->testVirtualHostMbeanOnMasterTransfer:225->getManagedBrokerBeanForNodeAtBrokerPort:283
? IO
  JMXManagementTest>QpidTestCase.run:148->QpidBrokerTestCase.runBare:272->testGroupMembers:142->getStoreBeanForNodeAtBrokerPort:276
? IO
  JMXManagementTest>QpidTestCase.run:148->QpidBrokerTestCase.runBare:272->testReadonlyMBeanAttributes:111->getStoreBeanForNodeAtBrokerPort:276
? IO
  BDBHAVirtualHostRestTest>QpidTestCase.run:148->QpidBrokerTestCase.runBare:272->testSetLocalTransactionSynchronizationPolicy:116->QpidRestTestCase.waitForAttributeChanged:114
? Connect
  BDBHAVirtualHostRestTest>QpidTestCase.run:148->QpidBrokerTestCase.runBare:272->testMutateState:140->QpidRestTestCase.waitForAttributeChanged:114
? Connect
  BDBHAVirtualHostRestTest>QpidTestCase.run:148->QpidBrokerTestCase.runBare:272->testSetRemoteTransactionSynchronizationPolicy:128->QpidRestTestCase.waitForAttributeChanged:114
? Connect

Tests run: 43, Failures: 17, Errors: 17, Skipped: 0

[INFO] ------------------------------------------------------------------------
[INFO] Reactor Summary:
[INFO] 
[INFO] Qpid Java Build ................................... SUCCESS [2.222s]
[INFO] Qpid AMQP 1.0 Common .............................. SUCCESS [4.702s]
[INFO] Qpid AMQP 1.0 Client .............................. SUCCESS [0.709s]
[INFO] Qpid AMQP 1.0 Client JMS .......................... SUCCESS [1.459s]
[INFO] Qpid AMQP 1.0 JMS Client Examples ................. SUCCESS [0.181s]
[INFO] Qpid AMQP 1.0 Client WebSocket .................... SUCCESS [0.573s]
[INFO] Qpid Broker Code Generation ....................... SUCCESS [0.281s]
[INFO] Qpid Test Utilities ............................... SUCCESS [0.286s]
[INFO] Qpid Common ....................................... SUCCESS [25.183s]
[INFO] Qpid Management Common ............................ SUCCESS [1.124s]
[INFO] Qpid Java Broker Core ............................. SUCCESS [1:21.587s]
[INFO] Qpid Access Control Broker Plug-in ................ SUCCESS [3.544s]
[INFO] Qpid AMQP 0-8 Protocol Broker Plug-in ............. SUCCESS [20.409s]
[INFO] Qpid AMQP 0-10 Protocol Plug-in ................... SUCCESS [3.728s]
[INFO] Qpid AMQP 1-0 Protocol Broker Plug-in ............. SUCCESS [0.547s]
[INFO] Qpid AMQP 0-8 to 0-10 Message Conversion Broker Plug-in  SUCCESS [0.306s]
[INFO] Qpid AMQP 0-8 to 1-0 Message Conversion Broker Plug-in  SUCCESS [0.254s]
[INFO] Qpid AMQP 0-10 to 1-0 Message Conversion Broker Plug-in  SUCCESS [0.252s]
[INFO] Qpid Derby Message Store .......................... SUCCESS [1:51.052s]
[INFO] Qpid JDBC Message Store Connection Pooling Plug-in  SUCCESS [0.403s]
[INFO] Qpid JDBC Message Store Broker Plug-in ............ SUCCESS [8.003s]
[INFO] Qpid HTTP Management Broker Plug-in ............... SUCCESS [6.675s]
[INFO] Qpid JMX Management Broker Plug-in ................ SUCCESS [2.907s]
[INFO] Qpid Memory Message Store Broker Plug-in .......... SUCCESS [0.452s]
[INFO] Qpid WebSocket Broker Plug-in ..................... SUCCESS [0.228s]
[INFO] Qpid AMQP 0-x JMS Client .......................... SUCCESS [6.336s]
[INFO] Qpid BDB Message Store ............................ SUCCESS [2:15.147s]
[INFO] Qpid BDB Message Store JMX ........................ SUCCESS [1.755s]
[INFO] Qpid Java Broker .................................. SUCCESS [4.168s]
[INFO] Qpid AMQP Management Protocol Broker Plug-in ...... SUCCESS [0.219s]
[INFO] Qpid AMQP 0-x JMS Client Examples ................. SUCCESS [0.122s]
[INFO] Qpid JCA .......................................... SUCCESS [1.512s]
[INFO] Qpid Resource Adaptor ............................. SUCCESS [0.360s]
[INFO] Qpid Tools ........................................ SUCCESS [0.400s]
[INFO] Qpid Management Examples .......................... SUCCESS [0.183s]
[INFO] Qpid Java System Test Parent ...................... SUCCESS [0.725s]
[INFO] Qpid System Tests ................................. SUCCESS [5:44.177s]
[INFO] Qpid Performance Tests ............................ SUCCESS [16.276s]
[INFO] Qpid Performance Test System Tests ................ FAILURE [15.565s]
[INFO] Qpid Performance Tests Visualisation JFC .......... SUCCESS [4.283s]
[INFO] Qpid BDB Store System Tests ....................... FAILURE [4.491s]
[INFO] ------------------------------------------------------------------------
[INFO] BUILD FAILURE
[INFO] ------------------------------------------------------------------------
[INFO] Total time: 13:33.935s
[INFO] Finished at: Tue Feb 17 18:34:08 UTC 2015
[INFO] Final Memory: 73M/375M
[INFO] ------------------------------------------------------------------------
[ERROR] Failed to execute goal org.apache.maven.plugins:maven-surefire-plugin:2.16:test (integration-test)
on project qpid-perftests-systests: There are test failures.
[ERROR] 
[ERROR] Please refer to /x1/jenkins/jenkins-slave/workspace/Qpid-Java-Cpp-Test/trunk/qpid/java/qpid-perftests-systests/target/surefire-reports
for the individual test results.
[ERROR] -> [Help 1]
[ERROR] Failed to execute goal org.apache.maven.plugins:maven-surefire-plugin:2.16:test (integration-test)
on project qpid-bdbstore-systests: There are test failures.
[ERROR] 
[ERROR] Please refer to /x1/jenkins/jenkins-slave/workspace/Qpid-Java-Cpp-Test/trunk/qpid/java/bdbstore/systests/target/surefire-reports
for the individual test results.
[ERROR] -> [Help 1]
[ERROR] 
[ERROR] To see the full stack trace of the errors, re-run Maven with the -e switch.
[ERROR] Re-run Maven using the -X switch to enable full debug logging.
[ERROR] 
[ERROR] For more information about the errors and possible solutions, please read the following
articles:
[ERROR] [Help 1] http://cwiki.apache.org/confluence/display/MAVEN/MojoFailureException
[ERROR] 
[ERROR] After correcting the problems, you can resume the build with the command
[ERROR]   mvn <goals> -rf :qpid-perftests-systests
Build step 'Invoke top-level Maven targets' marked build as failure
[locks-and-latches] Releasing all the locks
[locks-and-latches] All the locks released
Recording test results

Mime
View raw message