qpid-notifications mailing list archives

Site index · List index
Message view « Date » · « Thread »
Top « Date » · « Thread »
From Apache Jenkins Server <jenk...@builds.apache.org>
Subject Build failed in Jenkins: Qpid-Java-Cpp-Test #2316
Date Fri, 05 Dec 2014 13:45:15 GMT
See <https://builds.apache.org/job/Qpid-Java-Cpp-Test/2316/changes>

Changes:

[kwall] NO-JIRA: Remove exclusion related to QPID-3605. Looks like this was fixed long ago.

------------------------------------------
[...truncated 24013 lines...]
[INFO] skip non existing resourceDirectory <https://builds.apache.org/job/Qpid-Java-Cpp-Test/ws/trunk/qpid/java/perftests/visualisation-jfc/src/main/resources>
[INFO] Copying 0 resource
[INFO] Copying 3 resources
[INFO] 
[INFO] --- maven-compiler-plugin:3.1:compile (default-compile) @ qpid-perftests-visualisation-jfc
---
[INFO] Changes detected - recompiling the module!
[INFO] Compiling 30 source files to <https://builds.apache.org/job/Qpid-Java-Cpp-Test/ws/trunk/qpid/java/perftests/visualisation-jfc/target/classes>
[INFO] 
[INFO] --- maven-resources-plugin:2.6:testResources (default-testResources) @ qpid-perftests-visualisation-jfc
---
[INFO] Using 'UTF-8' encoding to copy filtered resources.
[INFO] Copying 1 resource
[INFO] skip non existing resourceDirectory <https://builds.apache.org/job/Qpid-Java-Cpp-Test/ws/trunk/qpid/java/perftests/visualisation-jfc/src/test/resources>
[INFO] Copying 3 resources
[INFO] 
[INFO] --- maven-compiler-plugin:3.1:testCompile (default-testCompile) @ qpid-perftests-visualisation-jfc
---
[INFO] Changes detected - recompiling the module!
[INFO] Compiling 11 source files to <https://builds.apache.org/job/Qpid-Java-Cpp-Test/ws/trunk/qpid/java/perftests/visualisation-jfc/target/test-classes>
[INFO] 
[INFO] --- maven-surefire-plugin:2.16:test (default-test) @ qpid-perftests-visualisation-jfc
---
[INFO] Surefire report directory: <https://builds.apache.org/job/Qpid-Java-Cpp-Test/ws/trunk/qpid/java/perftests/visualisation-jfc/target/surefire-reports>

-------------------------------------------------------
 T E S T S
-------------------------------------------------------
Running org.apache.qpid.disttest.charting.chartbuilder.BaseChartBuilderTest
main 2014-12-05 13:44:35,062 INFO [qpid.test.utils.QpidTestCase] Some tests should be excluded,
building the exclude list
main 2014-12-05 13:44:35,063 INFO [qpid.test.utils.QpidTestCase] Specified exclude file does
not exist: <https://builds.apache.org/job/Qpid-Java-Cpp-Test/ws/trunk/qpid/java/perftests/visualisation-jfc/../test-profiles//Excludes>
main 2014-12-05 13:44:35,063 INFO [qpid.test.utils.QpidTestCase] Specified exclude file does
not exist: <https://builds.apache.org/job/Qpid-Java-Cpp-Test/ws/trunk/qpid/java/perftests/visualisation-jfc/../test-profiles//CPPExcludes>
main 2014-12-05 13:44:35,063 INFO [qpid.test.utils.QpidTestCase] Specified exclude file does
not exist: <https://builds.apache.org/job/Qpid-Java-Cpp-Test/ws/trunk/qpid/java/perftests/visualisation-jfc/../test-profiles//cpp.excludes>
main 2014-12-05 13:44:35,063 INFO [qpid.test.utils.QpidTestCase] Specified exclude file does
not exist: <https://builds.apache.org/job/Qpid-Java-Cpp-Test/ws/trunk/qpid/java/perftests/visualisation-jfc/../test-profiles//CPPPrefetchExcludes>
main 2014-12-05 13:44:35,063 INFO [qpid.test.utils.QpidTestCase] Specified exclude file does
not exist: <https://builds.apache.org/job/Qpid-Java-Cpp-Test/ws/trunk/qpid/java/perftests/visualisation-jfc/../test-profiles//CPPTransientExcludes>
main 2014-12-05 13:44:35,063 INFO [qpid.test.utils.QpidTestCase] Specified exclude file does
not exist: <https://builds.apache.org/job/Qpid-Java-Cpp-Test/ws/trunk/qpid/java/perftests/visualisation-jfc/../test-profiles//cpp.excludes>
main 2014-12-05 13:44:35,507 INFO [qpid.test.utils.QpidTestCase] ========== start BaseChartBuilderTest.testBuildChart
==========
main 2014-12-05 13:44:35,787 INFO [qpid.test.utils.QpidTestCase] ========== tearDown BaseChartBuilderTest.testBuildChart
==========
Tests run: 1, Failures: 0, Errors: 0, Skipped: 0, Time elapsed: 1.118 sec - in org.apache.qpid.disttest.charting.chartbuilder.BaseChartBuilderTest
Running org.apache.qpid.disttest.charting.chartbuilder.TimeSeriesBuilderCallbackTest
main 2014-12-05 13:44:35,789 INFO [qpid.test.utils.QpidTestCase] ========== start TimeSeriesBuilderCallbackTest.testAddPointToSeries
==========
main 2014-12-05 13:44:35,852 INFO [qpid.test.utils.QpidTestCase] ========== tearDown TimeSeriesBuilderCallbackTest.testAddPointToSeries
==========
Tests run: 1, Failures: 0, Errors: 0, Skipped: 0, Time elapsed: 0.064 sec - in org.apache.qpid.disttest.charting.chartbuilder.TimeSeriesBuilderCallbackTest
Running org.apache.qpid.disttest.charting.chartbuilder.ChartProductionTest
main 2014-12-05 13:44:35,877 INFO [qpid.test.utils.QpidTestCase] ========== start ChartProductionTest.testLine3DChart
==========
main 2014-12-05 13:44:35,886 INFO [disttest.charting.writer.ChartWriter] Set chart directory:
/tmp/charts-1417787075881
main 2014-12-05 13:44:36,989 INFO [disttest.charting.writer.ChartWriter] Written /tmp/charts-1417787075881/testLine3DChart.png
chart
main 2014-12-05 13:44:36,989 INFO [qpid.test.utils.QpidTestCase] ========== tearDown ChartProductionTest.testLine3DChart
==========
main 2014-12-05 13:44:36,989 INFO [qpid.test.utils.QpidTestCase] ========== start ChartProductionTest.testXYLineChart
==========
main 2014-12-05 13:44:36,990 INFO [disttest.charting.writer.ChartWriter] Set chart directory:
/tmp/charts-1417787076990
main 2014-12-05 13:44:37,123 INFO [disttest.charting.writer.ChartWriter] Written /tmp/charts-1417787076990/testXYLineChart.png
chart
main 2014-12-05 13:44:37,123 INFO [qpid.test.utils.QpidTestCase] ========== tearDown ChartProductionTest.testXYLineChart
==========
main 2014-12-05 13:44:37,124 INFO [qpid.test.utils.QpidTestCase] ========== start ChartProductionTest.testStatisticalBarChart
==========
main 2014-12-05 13:44:37,125 INFO [disttest.charting.writer.ChartWriter] Set chart directory:
/tmp/charts-1417787077124
main 2014-12-05 13:44:37,223 INFO [disttest.charting.writer.ChartWriter] Written /tmp/charts-1417787077124/testStatisticalBarChart.png
chart
main 2014-12-05 13:44:37,223 INFO [qpid.test.utils.QpidTestCase] ========== tearDown ChartProductionTest.testStatisticalBarChart
==========
main 2014-12-05 13:44:37,224 INFO [qpid.test.utils.QpidTestCase] ========== start ChartProductionTest.testLineChart
==========
main 2014-12-05 13:44:37,225 INFO [disttest.charting.writer.ChartWriter] Set chart directory:
/tmp/charts-1417787077224
main 2014-12-05 13:44:37,302 INFO [disttest.charting.writer.ChartWriter] Written /tmp/charts-1417787077224/testLineChart.png
chart
main 2014-12-05 13:44:37,302 INFO [qpid.test.utils.QpidTestCase] ========== tearDown ChartProductionTest.testLineChart
==========
main 2014-12-05 13:44:37,303 INFO [qpid.test.utils.QpidTestCase] ========== start ChartProductionTest.testBarChart
==========
main 2014-12-05 13:44:37,304 INFO [disttest.charting.writer.ChartWriter] Set chart directory:
/tmp/charts-1417787077304
main 2014-12-05 13:44:37,382 INFO [disttest.charting.writer.ChartWriter] Written /tmp/charts-1417787077304/testBarChart.png
chart
main 2014-12-05 13:44:37,382 INFO [qpid.test.utils.QpidTestCase] ========== tearDown ChartProductionTest.testBarChart
==========
main 2014-12-05 13:44:37,383 INFO [qpid.test.utils.QpidTestCase] ========== start ChartProductionTest.testBar3DChart
==========
main 2014-12-05 13:44:37,384 INFO [disttest.charting.writer.ChartWriter] Set chart directory:
/tmp/charts-1417787077384
main 2014-12-05 13:44:37,460 INFO [disttest.charting.writer.ChartWriter] Written /tmp/charts-1417787077384/testBar3DChart.png
chart
main 2014-12-05 13:44:37,460 INFO [qpid.test.utils.QpidTestCase] ========== tearDown ChartProductionTest.testBar3DChart
==========
main 2014-12-05 13:44:37,461 INFO [qpid.test.utils.QpidTestCase] ========== start ChartProductionTest.testTimeSeriesLineChart
==========
main 2014-12-05 13:44:37,462 INFO [disttest.charting.writer.ChartWriter] Set chart directory:
/tmp/charts-1417787077462
main 2014-12-05 13:44:37,559 INFO [disttest.charting.writer.ChartWriter] Written /tmp/charts-1417787077462/testTimeSeriesLineChart.png
chart
main 2014-12-05 13:44:37,559 INFO [qpid.test.utils.QpidTestCase] ========== tearDown ChartProductionTest.testTimeSeriesLineChart
==========
main 2014-12-05 13:44:37,559 INFO [qpid.test.utils.QpidTestCase] ========== start ChartProductionTest.testXYLineChartWithColourAndWidth
==========
main 2014-12-05 13:44:37,560 INFO [disttest.charting.writer.ChartWriter] Set chart directory:
/tmp/charts-1417787077560
main 2014-12-05 13:44:37,645 INFO [disttest.charting.writer.ChartWriter] Written /tmp/charts-1417787077560/testXYLineChartWithColourAndWidth.png
chart
main 2014-12-05 13:44:37,646 INFO [qpid.test.utils.QpidTestCase] ========== tearDown ChartProductionTest.testXYLineChartWithColourAndWidth
==========
Tests run: 8, Failures: 0, Errors: 0, Skipped: 0, Time elapsed: 1.793 sec - in org.apache.qpid.disttest.charting.chartbuilder.ChartProductionTest
Running org.apache.qpid.disttest.charting.chartbuilder.ChartBuilderFactoryTest
main 2014-12-05 13:44:37,648 INFO [qpid.test.utils.QpidTestCase] ========== start ChartBuilderFactoryTest.testXYLineChart
==========
main 2014-12-05 13:44:37,648 INFO [qpid.test.utils.QpidTestCase] ========== tearDown ChartBuilderFactoryTest.testXYLineChart
==========
main 2014-12-05 13:44:37,648 INFO [qpid.test.utils.QpidTestCase] ========== start ChartBuilderFactoryTest.testLineChart
==========
main 2014-12-05 13:44:37,648 INFO [qpid.test.utils.QpidTestCase] ========== tearDown ChartBuilderFactoryTest.testLineChart
==========
main 2014-12-05 13:44:37,649 INFO [qpid.test.utils.QpidTestCase] ========== start ChartBuilderFactoryTest.testBarChart
==========
main 2014-12-05 13:44:37,649 INFO [qpid.test.utils.QpidTestCase] ========== tearDown ChartBuilderFactoryTest.testBarChart
==========
main 2014-12-05 13:44:37,649 INFO [qpid.test.utils.QpidTestCase] ========== start ChartBuilderFactoryTest.testTimeSeriesLineChart
==========
main 2014-12-05 13:44:37,649 INFO [qpid.test.utils.QpidTestCase] ========== tearDown ChartBuilderFactoryTest.testTimeSeriesLineChart
==========
main 2014-12-05 13:44:37,650 INFO [qpid.test.utils.QpidTestCase] ========== start ChartBuilderFactoryTest.testLineChart3D
==========
main 2014-12-05 13:44:37,650 INFO [qpid.test.utils.QpidTestCase] ========== tearDown ChartBuilderFactoryTest.testLineChart3D
==========
main 2014-12-05 13:44:37,650 INFO [qpid.test.utils.QpidTestCase] ========== start ChartBuilderFactoryTest.testBarChart3D
==========
main 2014-12-05 13:44:37,650 INFO [qpid.test.utils.QpidTestCase] ========== tearDown ChartBuilderFactoryTest.testBarChart3D
==========
Tests run: 6, Failures: 0, Errors: 0, Skipped: 0, Time elapsed: 0.004 sec - in org.apache.qpid.disttest.charting.chartbuilder.ChartBuilderFactoryTest
Running org.apache.qpid.disttest.charting.chartbuilder.ColorFactoryTest
main 2014-12-05 13:44:37,652 INFO [qpid.test.utils.QpidTestCase] ========== start ColorFactoryTest.testDarkBlue
==========
main 2014-12-05 13:44:37,653 INFO [qpid.test.utils.QpidTestCase] ========== tearDown ColorFactoryTest.testDarkBlue
==========
main 2014-12-05 13:44:37,653 INFO [qpid.test.utils.QpidTestCase] ========== start ColorFactoryTest.testBlue
==========
main 2014-12-05 13:44:37,653 INFO [qpid.test.utils.QpidTestCase] ========== tearDown ColorFactoryTest.testBlue
==========
Tests run: 2, Failures: 0, Errors: 0, Skipped: 0, Time elapsed: 0.002 sec - in org.apache.qpid.disttest.charting.chartbuilder.ColorFactoryTest
Running org.apache.qpid.disttest.charting.writer.ChartWriterTest
main 2014-12-05 13:44:37,670 INFO [disttest.charting.writer.ChartWriter] Set chart directory:
/tmp/TestFileUtils-testDir-1417787077670
main 2014-12-05 13:44:37,743 INFO [disttest.charting.writer.ChartWriter] Written /tmp/TestFileUtils-testDir-1417787077670/chart1.png
chart
main 2014-12-05 13:44:37,743 INFO [disttest.charting.writer.ChartWriter] Only 1 chart image(s)
have been written so no HTML summary file will be produced
main 2014-12-05 13:44:37,743 INFO [qpid.test.utils.QpidTestCase] ========== tearDown null
==========
main 2014-12-05 13:44:37,745 INFO [disttest.charting.writer.ChartWriter] Set chart directory:
/tmp/TestFileUtils-testDir-1417787077744
main 2014-12-05 13:44:37,809 INFO [disttest.charting.writer.ChartWriter] Written /tmp/TestFileUtils-testDir-1417787077744/chart1.png
chart
main 2014-12-05 13:44:37,809 INFO [qpid.test.utils.QpidTestCase] ========== tearDown null
==========
main 2014-12-05 13:44:37,810 INFO [disttest.charting.writer.ChartWriter] Set chart directory:
/tmp/TestFileUtils-testDir-1417787077810
main 2014-12-05 13:44:37,876 INFO [disttest.charting.writer.ChartWriter] Written /tmp/TestFileUtils-testDir-1417787077810/chart2.png
chart
main 2014-12-05 13:44:37,940 INFO [disttest.charting.writer.ChartWriter] Written /tmp/TestFileUtils-testDir-1417787077810/chart1.png
chart
main 2014-12-05 13:44:37,941 DEBUG [disttest.charting.writer.ChartWriter] About to produce
HTML summary file /tmp/TestFileUtils-testDir-1417787077810/chart-summary.html from charts
{/tmp/TestFileUtils-testDir-1417787077810/chart1.png=Mock for ChartingDefinition, hashCode:
775280, /tmp/TestFileUtils-testDir-1417787077810/chart2.png=Mock for ChartingDefinition, hashCode:
11013976}
main 2014-12-05 13:44:37,951 INFO [qpid.test.utils.QpidTestCase] ========== tearDown null
==========
Tests run: 3, Failures: 0, Errors: 0, Skipped: 0, Time elapsed: 0.297 sec - in org.apache.qpid.disttest.charting.writer.ChartWriterTest
Running org.apache.qpid.disttest.charting.seriesbuilder.SeriesRowTest
main 2014-12-05 13:44:37,952 INFO [qpid.test.utils.QpidTestCase] ========== start SeriesRowTest.testValidSeriesRowThrowsExceptionIfArrayTooSmall
==========
main 2014-12-05 13:44:37,953 INFO [qpid.test.utils.QpidTestCase] ========== tearDown SeriesRowTest.testValidSeriesRowThrowsExceptionIfArrayTooSmall
==========
main 2014-12-05 13:44:37,953 INFO [qpid.test.utils.QpidTestCase] ========== start SeriesRowTest.testDimension
==========
main 2014-12-05 13:44:37,953 INFO [qpid.test.utils.QpidTestCase] ========== tearDown SeriesRowTest.testDimension
==========
main 2014-12-05 13:44:37,953 INFO [qpid.test.utils.QpidTestCase] ========== start SeriesRowTest.testDimensionAsDouble
==========
main 2014-12-05 13:44:37,953 INFO [qpid.test.utils.QpidTestCase] ========== tearDown SeriesRowTest.testDimensionAsDouble
==========
main 2014-12-05 13:44:37,954 INFO [qpid.test.utils.QpidTestCase] ========== start SeriesRowTest.testDimensionAsString
==========
main 2014-12-05 13:44:37,954 INFO [qpid.test.utils.QpidTestCase] ========== tearDown SeriesRowTest.testDimensionAsString
==========
main 2014-12-05 13:44:37,954 INFO [qpid.test.utils.QpidTestCase] ========== start SeriesRowTest.testValidSeriesRow
==========
main 2014-12-05 13:44:37,954 INFO [qpid.test.utils.QpidTestCase] ========== tearDown SeriesRowTest.testValidSeriesRow
==========
Tests run: 5, Failures: 0, Errors: 0, Skipped: 0, Time elapsed: 0.003 sec - in org.apache.qpid.disttest.charting.seriesbuilder.SeriesRowTest
Running org.apache.qpid.disttest.charting.seriesbuilder.JdbcUrlGeneratorTest
main 2014-12-05 13:44:37,956 INFO [qpid.test.utils.QpidTestCase] ========== start JdbcUrlGeneratorTest.testGetJdbcUrlWithoutProvidingAUrlReturnsCsvUrlWithCorrectDirectory
==========
main 2014-12-05 13:44:37,969 INFO [qpid.test.utils.QpidTestCase] ========== tearDown JdbcUrlGeneratorTest.testGetJdbcUrlWithoutProvidingAUrlReturnsCsvUrlWithCorrectDirectory
==========
main 2014-12-05 13:44:37,970 INFO [qpid.test.utils.QpidTestCase] ========== start JdbcUrlGeneratorTest.testGetJdbcUrlThrowsExceptionWithoutAProvidedUrlOrSeriesDirectory
==========
main 2014-12-05 13:44:37,970 INFO [qpid.test.utils.QpidTestCase] ========== tearDown JdbcUrlGeneratorTest.testGetJdbcUrlThrowsExceptionWithoutAProvidedUrlOrSeriesDirectory
==========
main 2014-12-05 13:44:37,970 INFO [qpid.test.utils.QpidTestCase] ========== start JdbcUrlGeneratorTest.testGetJdbcUrlThrowsExceptionIfUrlProvidedAndSeriesDirectorySpecified
==========
main 2014-12-05 13:44:37,971 INFO [qpid.test.utils.QpidTestCase] ========== tearDown JdbcUrlGeneratorTest.testGetJdbcUrlThrowsExceptionIfUrlProvidedAndSeriesDirectorySpecified
==========
main 2014-12-05 13:44:37,971 INFO [qpid.test.utils.QpidTestCase] ========== start JdbcUrlGeneratorTest.testGetJdbcUrlReturnsProvidedUrl
==========
main 2014-12-05 13:44:37,971 INFO [qpid.test.utils.QpidTestCase] ========== tearDown JdbcUrlGeneratorTest.testGetJdbcUrlReturnsProvidedUrl
==========
Tests run: 4, Failures: 0, Errors: 0, Skipped: 0, Time elapsed: 0.017 sec - in org.apache.qpid.disttest.charting.seriesbuilder.JdbcUrlGeneratorTest
Running org.apache.qpid.disttest.charting.seriesbuilder.JdbcSeriesBuilderTest
main 2014-12-05 13:44:37,973 INFO [qpid.test.utils.QpidTestCase] ========== start JdbcSeriesBuilderTest.testBuildOneSeries
==========
main 2014-12-05 13:44:38,031 INFO [disttest.charting.seriesbuilder.JdbcSeriesBuilder] Loaded
JDBC driver class org.relique.jdbc.csv.CsvDriver
main 2014-12-05 13:44:38,059 INFO [disttest.charting.seriesbuilder.JdbcSeriesBuilder] Created:
JdbcSeriesBuilder[jdbcUrlGenerator=JdbcUrlGenerator[providedJdbdUrl=<null>]]
main 2014-12-05 13:44:38,130 INFO [qpid.test.utils.QpidTestCase] ========== tearDown JdbcSeriesBuilderTest.testBuildOneSeries
==========
Tests run: 1, Failures: 0, Errors: 0, Skipped: 0, Time elapsed: 0.159 sec - in org.apache.qpid.disttest.charting.seriesbuilder.JdbcSeriesBuilderTest
Running org.apache.qpid.disttest.charting.definition.ChartingDefinitionCreatorTest
main 2014-12-05 13:44:38,134 INFO [qpid.test.utils.QpidTestCase] ========== start ChartingDefinitionCreatorTest.testLoadTwoDefinitionsFromDirectory
==========
main 2014-12-05 13:44:38,148 INFO [qpid.test.utils.QpidTestCase] ========== tearDown ChartingDefinitionCreatorTest.testLoadTwoDefinitionsFromDirectory
==========
main 2014-12-05 13:44:38,149 INFO [qpid.test.utils.QpidTestCase] ========== start ChartingDefinitionCreatorTest.testLoadOneDefinitionFromFile
==========
main 2014-12-05 13:44:38,150 INFO [qpid.test.utils.QpidTestCase] ========== tearDown ChartingDefinitionCreatorTest.testLoadOneDefinitionFromFile
==========
main 2014-12-05 13:44:38,150 INFO [qpid.test.utils.QpidTestCase] ========== start ChartingDefinitionCreatorTest.testDefinitionsProperties
==========
main 2014-12-05 13:44:38,150 INFO [qpid.test.utils.QpidTestCase] Set system property "ChartingDefinitionSysProp"
to: "propValue"
main 2014-12-05 13:44:38,152 INFO [qpid.test.utils.QpidTestCase] ========== tearDown ChartingDefinitionCreatorTest.testDefinitionsProperties
==========
main 2014-12-05 13:44:38,152 DEBUG [qpid.test.utils.QpidTestCase] reverting 1 test properties
main 2014-12-05 13:44:38,152 INFO [qpid.test.utils.QpidTestCase] ========== start ChartingDefinitionCreatorTest.testDefinitionFileNotFound
==========
main 2014-12-05 13:44:38,153 INFO [qpid.test.utils.QpidTestCase] ========== tearDown ChartingDefinitionCreatorTest.testDefinitionFileNotFound
==========
Tests run: 4, Failures: 0, Errors: 0, Skipped: 0, Time elapsed: 0.022 sec - in org.apache.qpid.disttest.charting.definition.ChartingDefinitionCreatorTest
Running org.apache.qpid.disttest.charting.definition.SeriesDefinitionCreatorTest
main 2014-12-05 13:44:38,154 INFO [qpid.test.utils.QpidTestCase] ========== start SeriesDefinitionCreatorTest.testSeriesDirectoryAndNameSubstitution
==========
main 2014-12-05 13:44:38,155 INFO [qpid.test.utils.QpidTestCase] Set system property "SeriesDefinitionProp"
to: "propValue"
main 2014-12-05 13:44:38,155 INFO [qpid.test.utils.QpidTestCase] ========== tearDown SeriesDefinitionCreatorTest.testSeriesDirectoryAndNameSubstitution
==========
main 2014-12-05 13:44:38,155 DEBUG [qpid.test.utils.QpidTestCase] reverting 1 test properties
main 2014-12-05 13:44:38,156 INFO [qpid.test.utils.QpidTestCase] ========== start SeriesDefinitionCreatorTest.testTwoSeriesDefinitions
==========
main 2014-12-05 13:44:38,157 INFO [qpid.test.utils.QpidTestCase] ========== tearDown SeriesDefinitionCreatorTest.testTwoSeriesDefinitions
==========
main 2014-12-05 13:44:38,157 INFO [qpid.test.utils.QpidTestCase] ========== start SeriesDefinitionCreatorTest.testOneSeriesDefinition
==========
main 2014-12-05 13:44:38,158 INFO [qpid.test.utils.QpidTestCase] ========== tearDown SeriesDefinitionCreatorTest.testOneSeriesDefinition
==========
main 2014-12-05 13:44:38,158 INFO [qpid.test.utils.QpidTestCase] ========== start SeriesDefinitionCreatorTest.testNonSequentialSeriesDefinitionsIgnored
==========
main 2014-12-05 13:44:38,159 INFO [qpid.test.utils.QpidTestCase] ========== tearDown SeriesDefinitionCreatorTest.testNonSequentialSeriesDefinitionsIgnored
==========
Tests run: 4, Failures: 0, Errors: 0, Skipped: 0, Time elapsed: 0.005 sec - in org.apache.qpid.disttest.charting.definition.SeriesDefinitionCreatorTest

Results :

Tests run: 39, Failures: 0, Errors: 0, Skipped: 0

[INFO] 
[INFO] --- maven-jar-plugin:2.4:jar (default-jar) @ qpid-perftests-visualisation-jfc ---
[INFO] Building jar: <https://builds.apache.org/job/Qpid-Java-Cpp-Test/ws/trunk/qpid/java/perftests/visualisation-jfc/target/qpid-perftests-visualisation-jfc-0.32-SNAPSHOT.jar>
[INFO] 
[INFO] --- maven-site-plugin:3.3:attach-descriptor (attach-descriptor) @ qpid-perftests-visualisation-jfc
---
[INFO] 
[INFO] --- maven-antrun-plugin:1.7:run (create-qbtc-output-dir) @ qpid-perftests-visualisation-jfc
---
[INFO] Executing tasks

main:
    [mkdir] Created dir: <https://builds.apache.org/job/Qpid-Java-Cpp-Test/ws/trunk/qpid/java/perftests/visualisation-jfc/target/qbtc-output>
[INFO] Executed tasks
[INFO]                                                                         
[INFO] ------------------------------------------------------------------------
[INFO] Skipping Qpid BDB Store System Tests
[INFO] This project has been banned from the build due to previous failures.
[INFO] ------------------------------------------------------------------------
[INFO] ------------------------------------------------------------------------
[INFO] Reactor Summary:
[INFO] 
[INFO] Qpid Java Build ................................... SUCCESS [2.941s]
[INFO] Qpid AMQP 1.0 Common .............................. SUCCESS [5.588s]
[INFO] Qpid AMQP 1.0 Client .............................. SUCCESS [0.682s]
[INFO] Qpid AMQP 1.0 Client JMS .......................... SUCCESS [1.916s]
[INFO] Qpid AMQP 1.0 JMS Client Examples ................. SUCCESS [0.207s]
[INFO] Qpid AMQP 1.0 Client WebSocket .................... SUCCESS [0.644s]
[INFO] Qpid Broker Code Generation ....................... SUCCESS [0.291s]
[INFO] Qpid Test Utilities ............................... SUCCESS [0.317s]
[INFO] Qpid Common ....................................... SUCCESS [29.469s]
[INFO] Qpid Management Common ............................ SUCCESS [1.257s]
[INFO] Qpid Java Broker Core ............................. SUCCESS [1:23.273s]
[INFO] Qpid Access Control Broker Plug-in ................ SUCCESS [4.108s]
[INFO] Qpid AMQP 0-8 Protocol Broker Plug-in ............. SUCCESS [20.525s]
[INFO] Qpid AMQP 0-10 Protocol Plug-in ................... SUCCESS [4.399s]
[INFO] Qpid AMQP 1-0 Protocol Broker Plug-in ............. SUCCESS [0.495s]
[INFO] Qpid AMQP 0-8 to 0-10 Message Conversion Broker Plug-in  SUCCESS [0.400s]
[INFO] Qpid AMQP 0-8 to 1-0 Message Conversion Broker Plug-in  SUCCESS [0.311s]
[INFO] Qpid AMQP 0-10 to 1-0 Message Conversion Broker Plug-in  SUCCESS [0.279s]
[INFO] Qpid Derby Message Store .......................... SUCCESS [17.468s]
[INFO] Qpid JDBC Message Store Connection Pooling Plug-in  SUCCESS [0.388s]
[INFO] Qpid JDBC Message Store Broker Plug-in ............ SUCCESS [9.315s]
[INFO] Qpid HTTP Management Broker Plug-in ............... SUCCESS [5.259s]
[INFO] Qpid JMX Management Broker Plug-in ................ SUCCESS [3.486s]
[INFO] Qpid Memory Message Store Broker Plug-in .......... SUCCESS [0.468s]
[INFO] Qpid WebSocket Broker Plug-in ..................... SUCCESS [0.264s]
[INFO] Qpid AMQP 0-x JMS Client .......................... SUCCESS [6.921s]
[INFO] Qpid BDB Message Store ............................ SUCCESS [2:09.987s]
[INFO] Qpid BDB Message Store JMX ........................ SUCCESS [2.056s]
[INFO] Qpid Java Broker .................................. SUCCESS [4.802s]
[INFO] Qpid AMQP Management Protocol Broker Plug-in ...... SUCCESS [0.291s]
[INFO] Qpid AMQP 0-x JMS Client Examples ................. SUCCESS [0.140s]
[INFO] Qpid JCA .......................................... SUCCESS [1.643s]
[INFO] Qpid Resource Adaptor ............................. SUCCESS [0.450s]
[INFO] Qpid Tools ........................................ SUCCESS [0.362s]
[INFO] Qpid Management Examples .......................... SUCCESS [0.200s]
[INFO] Qpid Java System Test Parent ...................... SUCCESS [0.801s]
[INFO] Qpid System Tests ................................. FAILURE [1:00.695s]
[INFO] Qpid Performance Tests ............................ SUCCESS [13.304s]
[INFO] Qpid Performance Test System Tests ................ SKIPPED
[INFO] Qpid Performance Tests Visualisation JFC .......... SUCCESS [4.673s]
[INFO] Qpid BDB Store System Tests ....................... SKIPPED
[INFO] ------------------------------------------------------------------------
[INFO] BUILD FAILURE
[INFO] ------------------------------------------------------------------------
[INFO] Total time: 7:01.230s
[INFO] Finished at: Fri Dec 05 13:44:38 UTC 2014
[INFO] Final Memory: 71M/395M
[INFO] ------------------------------------------------------------------------
[ERROR] Failed to execute goal org.apache.maven.plugins:maven-surefire-plugin:2.16:test (integration-test)
on project qpid-systests: There are test failures.
[ERROR] 
[ERROR] Please refer to <https://builds.apache.org/job/Qpid-Java-Cpp-Test/ws/trunk/qpid/java/systests/target/surefire-reports>
for the individual test results.
[ERROR] -> [Help 1]
[ERROR] 
[ERROR] To see the full stack trace of the errors, re-run Maven with the -e switch.
[ERROR] Re-run Maven using the -X switch to enable full debug logging.
[ERROR] 
[ERROR] For more information about the errors and possible solutions, please read the following
articles:
[ERROR] [Help 1] http://cwiki.apache.org/confluence/display/MAVEN/MojoFailureException
[ERROR] 
[ERROR] After correcting the problems, you can resume the build with the command
[ERROR]   mvn <goals> -rf :qpid-systests
Build step 'Invoke top-level Maven targets' marked build as failure
[locks-and-latches] Releasing all the locks
[locks-and-latches] All the locks released
Recording test results

Mime
View raw message