qpid-notifications mailing list archives

Site index · List index
Message view « Date » · « Thread »
Top « Date » · « Thread »
From Apache Jenkins Server <jenk...@builds.apache.org>
Subject Build failed in Jenkins: Qpid-Java-Cpp-Test #2319
Date Sun, 07 Dec 2014 11:49:57 GMT
See <https://builds.apache.org/job/Qpid-Java-Cpp-Test/2319/changes>

Changes:

[rgodfrey] QPID-6263 : [Java Broker] Remove knowledge of BrokerOptions from SystemConfig and
simply use attributes instead

------------------------------------------
[...truncated 17679 lines...]
	at sun.net.www.http.HttpClient.openServer(HttpClient.java:378)
	at sun.net.www.http.HttpClient.openServer(HttpClient.java:473)
	at sun.net.www.http.HttpClient.<init>(HttpClient.java:203)
	at sun.net.www.http.HttpClient.New(HttpClient.java:290)
	at sun.net.www.http.HttpClient.New(HttpClient.java:306)
	at sun.net.www.protocol.http.HttpURLConnection.getNewHttpClient(HttpURLConnection.java:995)
	at sun.net.www.protocol.http.HttpURLConnection.plainConnect(HttpURLConnection.java:931)
	at sun.net.www.protocol.http.HttpURLConnection.connect(HttpURLConnection.java:849)
	at sun.net.www.protocol.http.HttpURLConnection.getOutputStream(HttpURLConnection.java:1090)
	at org.apache.qpid.systest.rest.RestTestHelper.writeJsonRequest(RestTestHelper.java:234)
	at org.apache.qpid.systest.rest.RestTestHelper.submitRequest(RestTestHelper.java:508)
	at org.apache.qpid.systest.rest.RestTestHelper.submitRequest(RestTestHelper.java:522)
	at org.apache.qpid.server.store.berkeleydb.replication.BDBHAVirtualHostNodeRestTest.createHANode(BDBHAVirtualHostNodeRestTest.java:317)
	at org.apache.qpid.server.store.berkeleydb.replication.BDBHAVirtualHostNodeRestTest.testMutateStateOfOneNode(BDBHAVirtualHostNodeRestTest.java:103)

testIntruderProtection(org.apache.qpid.server.store.berkeleydb.replication.BDBHAVirtualHostNodeRestTest)
 Time elapsed: 0.034 sec  <<< ERROR!
java.net.ConnectException: Connection refused
	at java.net.PlainSocketImpl.socketConnect(Native Method)
	at java.net.AbstractPlainSocketImpl.doConnect(AbstractPlainSocketImpl.java:339)
	at java.net.AbstractPlainSocketImpl.connectToAddress(AbstractPlainSocketImpl.java:200)
	at java.net.AbstractPlainSocketImpl.connect(AbstractPlainSocketImpl.java:182)
	at java.net.SocksSocketImpl.connect(SocksSocketImpl.java:392)
	at java.net.Socket.connect(Socket.java:579)
	at sun.net.NetworkClient.doConnect(NetworkClient.java:175)
	at sun.net.www.http.HttpClient.openServer(HttpClient.java:378)
	at sun.net.www.http.HttpClient.openServer(HttpClient.java:473)
	at sun.net.www.http.HttpClient.<init>(HttpClient.java:203)
	at sun.net.www.http.HttpClient.New(HttpClient.java:290)
	at sun.net.www.http.HttpClient.New(HttpClient.java:306)
	at sun.net.www.protocol.http.HttpURLConnection.getNewHttpClient(HttpURLConnection.java:995)
	at sun.net.www.protocol.http.HttpURLConnection.plainConnect(HttpURLConnection.java:931)
	at sun.net.www.protocol.http.HttpURLConnection.connect(HttpURLConnection.java:849)
	at sun.net.www.protocol.http.HttpURLConnection.getOutputStream(HttpURLConnection.java:1090)
	at org.apache.qpid.systest.rest.RestTestHelper.writeJsonRequest(RestTestHelper.java:234)
	at org.apache.qpid.systest.rest.RestTestHelper.submitRequest(RestTestHelper.java:508)
	at org.apache.qpid.systest.rest.RestTestHelper.submitRequest(RestTestHelper.java:522)
	at org.apache.qpid.server.store.berkeleydb.replication.BDBHAVirtualHostNodeRestTest.createHANode(BDBHAVirtualHostNodeRestTest.java:317)
	at org.apache.qpid.server.store.berkeleydb.replication.BDBHAVirtualHostNodeRestTest.testIntruderProtection(BDBHAVirtualHostNodeRestTest.java:252)

testDeleteMasterNode(org.apache.qpid.server.store.berkeleydb.replication.BDBHAVirtualHostNodeRestTest)
 Time elapsed: 0.032 sec  <<< ERROR!
java.net.ConnectException: Connection refused
	at java.net.PlainSocketImpl.socketConnect(Native Method)
	at java.net.AbstractPlainSocketImpl.doConnect(AbstractPlainSocketImpl.java:339)
	at java.net.AbstractPlainSocketImpl.connectToAddress(AbstractPlainSocketImpl.java:200)
	at java.net.AbstractPlainSocketImpl.connect(AbstractPlainSocketImpl.java:182)
	at java.net.SocksSocketImpl.connect(SocksSocketImpl.java:392)
	at java.net.Socket.connect(Socket.java:579)
	at sun.net.NetworkClient.doConnect(NetworkClient.java:175)
	at sun.net.www.http.HttpClient.openServer(HttpClient.java:378)
	at sun.net.www.http.HttpClient.openServer(HttpClient.java:473)
	at sun.net.www.http.HttpClient.<init>(HttpClient.java:203)
	at sun.net.www.http.HttpClient.New(HttpClient.java:290)
	at sun.net.www.http.HttpClient.New(HttpClient.java:306)
	at sun.net.www.protocol.http.HttpURLConnection.getNewHttpClient(HttpURLConnection.java:995)
	at sun.net.www.protocol.http.HttpURLConnection.plainConnect(HttpURLConnection.java:931)
	at sun.net.www.protocol.http.HttpURLConnection.connect(HttpURLConnection.java:849)
	at sun.net.www.protocol.http.HttpURLConnection.getOutputStream(HttpURLConnection.java:1090)
	at org.apache.qpid.systest.rest.RestTestHelper.writeJsonRequest(RestTestHelper.java:234)
	at org.apache.qpid.systest.rest.RestTestHelper.submitRequest(RestTestHelper.java:508)
	at org.apache.qpid.systest.rest.RestTestHelper.submitRequest(RestTestHelper.java:522)
	at org.apache.qpid.server.store.berkeleydb.replication.BDBHAVirtualHostNodeRestTest.createHANode(BDBHAVirtualHostNodeRestTest.java:317)
	at org.apache.qpid.server.store.berkeleydb.replication.BDBHAVirtualHostNodeRestTest.testDeleteMasterNode(BDBHAVirtualHostNodeRestTest.java:192)

testCreate3NodeGroup(org.apache.qpid.server.store.berkeleydb.replication.BDBHAVirtualHostNodeRestTest)
 Time elapsed: 0.031 sec  <<< ERROR!
java.net.ConnectException: Connection refused
	at java.net.PlainSocketImpl.socketConnect(Native Method)
	at java.net.AbstractPlainSocketImpl.doConnect(AbstractPlainSocketImpl.java:339)
	at java.net.AbstractPlainSocketImpl.connectToAddress(AbstractPlainSocketImpl.java:200)
	at java.net.AbstractPlainSocketImpl.connect(AbstractPlainSocketImpl.java:182)
	at java.net.SocksSocketImpl.connect(SocksSocketImpl.java:392)
	at java.net.Socket.connect(Socket.java:579)
	at sun.net.NetworkClient.doConnect(NetworkClient.java:175)
	at sun.net.www.http.HttpClient.openServer(HttpClient.java:378)
	at sun.net.www.http.HttpClient.openServer(HttpClient.java:473)
	at sun.net.www.http.HttpClient.<init>(HttpClient.java:203)
	at sun.net.www.http.HttpClient.New(HttpClient.java:290)
	at sun.net.www.http.HttpClient.New(HttpClient.java:306)
	at sun.net.www.protocol.http.HttpURLConnection.getNewHttpClient(HttpURLConnection.java:995)
	at sun.net.www.protocol.http.HttpURLConnection.plainConnect(HttpURLConnection.java:931)
	at sun.net.www.protocol.http.HttpURLConnection.connect(HttpURLConnection.java:849)
	at sun.net.www.protocol.http.HttpURLConnection.getOutputStream(HttpURLConnection.java:1090)
	at org.apache.qpid.systest.rest.RestTestHelper.writeJsonRequest(RestTestHelper.java:234)
	at org.apache.qpid.systest.rest.RestTestHelper.submitRequest(RestTestHelper.java:508)
	at org.apache.qpid.systest.rest.RestTestHelper.submitRequest(RestTestHelper.java:522)
	at org.apache.qpid.server.store.berkeleydb.replication.BDBHAVirtualHostNodeRestTest.createHANode(BDBHAVirtualHostNodeRestTest.java:317)
	at org.apache.qpid.server.store.berkeleydb.replication.BDBHAVirtualHostNodeRestTest.testCreate3NodeGroup(BDBHAVirtualHostNodeRestTest.java:92)

testDeleteReplicaNode(org.apache.qpid.server.store.berkeleydb.replication.BDBHAVirtualHostNodeRestTest)
 Time elapsed: 0.033 sec  <<< ERROR!
java.net.ConnectException: Connection refused
	at java.net.PlainSocketImpl.socketConnect(Native Method)
	at java.net.AbstractPlainSocketImpl.doConnect(AbstractPlainSocketImpl.java:339)
	at java.net.AbstractPlainSocketImpl.connectToAddress(AbstractPlainSocketImpl.java:200)
	at java.net.AbstractPlainSocketImpl.connect(AbstractPlainSocketImpl.java:182)
	at java.net.SocksSocketImpl.connect(SocksSocketImpl.java:392)
	at java.net.Socket.connect(Socket.java:579)
	at sun.net.NetworkClient.doConnect(NetworkClient.java:175)
	at sun.net.www.http.HttpClient.openServer(HttpClient.java:378)
	at sun.net.www.http.HttpClient.openServer(HttpClient.java:473)
	at sun.net.www.http.HttpClient.<init>(HttpClient.java:203)
	at sun.net.www.http.HttpClient.New(HttpClient.java:290)
	at sun.net.www.http.HttpClient.New(HttpClient.java:306)
	at sun.net.www.protocol.http.HttpURLConnection.getNewHttpClient(HttpURLConnection.java:995)
	at sun.net.www.protocol.http.HttpURLConnection.plainConnect(HttpURLConnection.java:931)
	at sun.net.www.protocol.http.HttpURLConnection.connect(HttpURLConnection.java:849)
	at sun.net.www.protocol.http.HttpURLConnection.getOutputStream(HttpURLConnection.java:1090)
	at org.apache.qpid.systest.rest.RestTestHelper.writeJsonRequest(RestTestHelper.java:234)
	at org.apache.qpid.systest.rest.RestTestHelper.submitRequest(RestTestHelper.java:508)
	at org.apache.qpid.systest.rest.RestTestHelper.submitRequest(RestTestHelper.java:522)
	at org.apache.qpid.server.store.berkeleydb.replication.BDBHAVirtualHostNodeRestTest.createHANode(BDBHAVirtualHostNodeRestTest.java:317)
	at org.apache.qpid.server.store.berkeleydb.replication.BDBHAVirtualHostNodeRestTest.testDeleteReplicaNode(BDBHAVirtualHostNodeRestTest.java:166)

testIntruderBDBHAVHNNotAllowedToConnect(org.apache.qpid.server.store.berkeleydb.replication.BDBHAVirtualHostNodeRestTest)
 Time elapsed: 0.033 sec  <<< ERROR!
java.net.ConnectException: Connection refused
	at java.net.PlainSocketImpl.socketConnect(Native Method)
	at java.net.AbstractPlainSocketImpl.doConnect(AbstractPlainSocketImpl.java:339)
	at java.net.AbstractPlainSocketImpl.connectToAddress(AbstractPlainSocketImpl.java:200)
	at java.net.AbstractPlainSocketImpl.connect(AbstractPlainSocketImpl.java:182)
	at java.net.SocksSocketImpl.connect(SocksSocketImpl.java:392)
	at java.net.Socket.connect(Socket.java:579)
	at sun.net.NetworkClient.doConnect(NetworkClient.java:175)
	at sun.net.www.http.HttpClient.openServer(HttpClient.java:378)
	at sun.net.www.http.HttpClient.openServer(HttpClient.java:473)
	at sun.net.www.http.HttpClient.<init>(HttpClient.java:203)
	at sun.net.www.http.HttpClient.New(HttpClient.java:290)
	at sun.net.www.http.HttpClient.New(HttpClient.java:306)
	at sun.net.www.protocol.http.HttpURLConnection.getNewHttpClient(HttpURLConnection.java:995)
	at sun.net.www.protocol.http.HttpURLConnection.plainConnect(HttpURLConnection.java:931)
	at sun.net.www.protocol.http.HttpURLConnection.connect(HttpURLConnection.java:849)
	at sun.net.www.protocol.http.HttpURLConnection.getOutputStream(HttpURLConnection.java:1090)
	at org.apache.qpid.systest.rest.RestTestHelper.writeJsonRequest(RestTestHelper.java:234)
	at org.apache.qpid.systest.rest.RestTestHelper.submitRequest(RestTestHelper.java:508)
	at org.apache.qpid.systest.rest.RestTestHelper.submitRequest(RestTestHelper.java:522)
	at org.apache.qpid.server.store.berkeleydb.replication.BDBHAVirtualHostNodeRestTest.createHANode(BDBHAVirtualHostNodeRestTest.java:317)
	at org.apache.qpid.server.store.berkeleydb.replication.BDBHAVirtualHostNodeRestTest.testIntruderBDBHAVHNNotAllowedToConnect(BDBHAVirtualHostNodeRestTest.java:232)

Running org.apache.qpid.server.store.berkeleydb.BDBBackupTest
main 2014-12-07 11:49:19,803 INFO [qpid.test.utils.QpidTestCase] Test: testBackupAndRestoreMaintainsMessages
is excluded
Tests run: 0, Failures: 0, Errors: 0, Skipped: 0, Time elapsed: 0.001 sec - in org.apache.qpid.server.store.berkeleydb.BDBBackupTest

Results :

Failed tests: 
  TwoNodeTest>QpidTestCase.run:148->QpidBrokerTestCase.runBare:312->setUp:54 null
  TwoNodeTest>QpidTestCase.run:148->QpidBrokerTestCase.runBare:312->setUp:54 null
  TwoNodeTest>QpidTestCase.run:148->QpidBrokerTestCase.runBare:312->setUp:54 null
  TwoNodeTest>QpidTestCase.run:148->QpidBrokerTestCase.runBare:312->setUp:54 null
  TwoNodeTest>QpidTestCase.run:148->QpidBrokerTestCase.runBare:312->setUp:54 null
  TwoNodeTest>QpidTestCase.run:148->QpidBrokerTestCase.runBare:312->setUp:54 null
  TwoNodeTest>QpidTestCase.run:148->QpidBrokerTestCase.runBare:312->setUp:54 null
  MultiNodeTest>QpidTestCase.run:148->QpidBrokerTestCase.runBare:312->setUp:80 null
  MultiNodeTest>QpidTestCase.run:148->QpidBrokerTestCase.runBare:312->setUp:80 null
  MultiNodeTest>QpidTestCase.run:148->QpidBrokerTestCase.runBare:312->setUp:80 null
  MultiNodeTest>QpidTestCase.run:148->QpidBrokerTestCase.runBare:312->setUp:80 null
  MultiNodeTest>QpidTestCase.run:148->QpidBrokerTestCase.runBare:312->setUp:80 null
  MultiNodeTest>QpidTestCase.run:148->QpidBrokerTestCase.runBare:312->setUp:80 null
  MultiNodeTest>QpidTestCase.run:148->QpidBrokerTestCase.runBare:312->setUp:80 null
  MultiNodeTest>QpidTestCase.run:148->QpidBrokerTestCase.runBare:312->setUp:80 null
  MultiNodeTest>QpidTestCase.run:148->QpidBrokerTestCase.runBare:312->setUp:80 null
  MultiNodeTest>QpidTestCase.run:148->QpidBrokerTestCase.runBare:312->setUp:80 null

Tests in error: 
  JMXManagementTest>QpidTestCase.run:148->QpidBrokerTestCase.runBare:312->testRemoveRemoteNodeFromGroup:163->getStoreBeanForNodeAtBrokerPort:275
» IO
  JMXManagementTest>QpidTestCase.run:148->QpidBrokerTestCase.runBare:312->testVirtualHostOperationsDeniedForNonMasterNode:186->getManagedBrokerBeanForNodeAtBrokerPort:282
» IO
  JMXManagementTest>QpidTestCase.run:148->QpidBrokerTestCase.runBare:312->testStateOfNonActiveBrokerIsNotMaster:132->getStoreBeanForNodeAtBrokerPort:275
» IO
  JMXManagementTest>QpidTestCase.run:148->QpidBrokerTestCase.runBare:312->testStateOfActiveBrokerIsMaster:124->getStoreBeanForNodeAtBrokerPort:275
» IO
  JMXManagementTest>QpidTestCase.run:148->QpidBrokerTestCase.runBare:312->testVirtualHostMbeanOnMasterTransfer:224->getManagedBrokerBeanForNodeAtBrokerPort:282
» IO
  JMXManagementTest>QpidTestCase.run:148->QpidBrokerTestCase.runBare:312->testGroupMembers:141->getStoreBeanForNodeAtBrokerPort:275
» IO
  JMXManagementTest>QpidTestCase.run:148->QpidBrokerTestCase.runBare:312->testReadonlyMBeanAttributes:110->getStoreBeanForNodeAtBrokerPort:275
» IO
  BDBHAVirtualHostRestTest>QpidTestCase.run:148->QpidBrokerTestCase.runBare:312->testSetLocalTransactionSynchronizationPolicy:116->QpidRestTestCase.waitForAttributeChanged:114
» Connect
  BDBHAVirtualHostRestTest>QpidTestCase.run:148->QpidBrokerTestCase.runBare:312->testMutateState:140->QpidRestTestCase.waitForAttributeChanged:114
» Connect
  BDBHAVirtualHostRestTest>QpidTestCase.run:148->QpidBrokerTestCase.runBare:312->testSetRemoteTransactionSynchronizationPolicy:128->QpidRestTestCase.waitForAttributeChanged:114
» Connect
  BDBHAVirtualHostNodeRestTest>QpidTestCase.run:148->QpidBrokerTestCase.runBare:312->testNewMasterElectedWhenVirtualHostIsStopped:135->createHANode:317
» Connect
  BDBHAVirtualHostNodeRestTest>QpidTestCase.run:148->QpidBrokerTestCase.runBare:312->testMutateStateOfOneNode:103->createHANode:317
» Connect
  BDBHAVirtualHostNodeRestTest>QpidTestCase.run:148->QpidBrokerTestCase.runBare:312->testIntruderProtection:252->createHANode:317
» Connect
  BDBHAVirtualHostNodeRestTest>QpidTestCase.run:148->QpidBrokerTestCase.runBare:312->testDeleteMasterNode:192->createHANode:317
» Connect
  BDBHAVirtualHostNodeRestTest>QpidTestCase.run:148->QpidBrokerTestCase.runBare:312->testCreate3NodeGroup:92->createHANode:317
» Connect
  BDBHAVirtualHostNodeRestTest>QpidTestCase.run:148->QpidBrokerTestCase.runBare:312->testDeleteReplicaNode:166->createHANode:317
» Connect
  BDBHAVirtualHostNodeRestTest>QpidTestCase.run:148->QpidBrokerTestCase.runBare:312->testIntruderBDBHAVHNNotAllowedToConnect:232->createHANode:317
» Connect

Tests run: 42, Failures: 17, Errors: 17, Skipped: 0

[INFO] ------------------------------------------------------------------------
[INFO] Reactor Summary:
[INFO] 
[INFO] Qpid Java Build ................................... SUCCESS [2.229s]
[INFO] Qpid AMQP 1.0 Common .............................. SUCCESS [4.652s]
[INFO] Qpid AMQP 1.0 Client .............................. SUCCESS [0.633s]
[INFO] Qpid AMQP 1.0 Client JMS .......................... SUCCESS [1.380s]
[INFO] Qpid AMQP 1.0 JMS Client Examples ................. SUCCESS [0.206s]
[INFO] Qpid AMQP 1.0 Client WebSocket .................... SUCCESS [0.513s]
[INFO] Qpid Broker Code Generation ....................... SUCCESS [0.276s]
[INFO] Qpid Test Utilities ............................... SUCCESS [0.210s]
[INFO] Qpid Common ....................................... SUCCESS [27.881s]
[INFO] Qpid Management Common ............................ SUCCESS [1.040s]
[INFO] Qpid Java Broker Core ............................. SUCCESS [1:20.772s]
[INFO] Qpid Access Control Broker Plug-in ................ SUCCESS [3.899s]
[INFO] Qpid AMQP 0-8 Protocol Broker Plug-in ............. SUCCESS [20.811s]
[INFO] Qpid AMQP 0-10 Protocol Plug-in ................... SUCCESS [3.919s]
[INFO] Qpid AMQP 1-0 Protocol Broker Plug-in ............. SUCCESS [0.406s]
[INFO] Qpid AMQP 0-8 to 0-10 Message Conversion Broker Plug-in  SUCCESS [0.254s]
[INFO] Qpid AMQP 0-8 to 1-0 Message Conversion Broker Plug-in  SUCCESS [0.219s]
[INFO] Qpid AMQP 0-10 to 1-0 Message Conversion Broker Plug-in  SUCCESS [0.195s]
[INFO] Qpid Derby Message Store .......................... SUCCESS [16.463s]
[INFO] Qpid JDBC Message Store Connection Pooling Plug-in  SUCCESS [0.231s]
[INFO] Qpid JDBC Message Store Broker Plug-in ............ SUCCESS [8.920s]
[INFO] Qpid HTTP Management Broker Plug-in ............... SUCCESS [4.720s]
[INFO] Qpid JMX Management Broker Plug-in ................ SUCCESS [3.116s]
[INFO] Qpid Memory Message Store Broker Plug-in .......... SUCCESS [0.294s]
[INFO] Qpid WebSocket Broker Plug-in ..................... SUCCESS [0.241s]
[INFO] Qpid AMQP 0-x JMS Client .......................... SUCCESS [5.953s]
[INFO] Qpid BDB Message Store ............................ SUCCESS [2:14.439s]
[INFO] Qpid BDB Message Store JMX ........................ SUCCESS [1.910s]
[INFO] Qpid Java Broker .................................. SUCCESS [4.542s]
[INFO] Qpid AMQP Management Protocol Broker Plug-in ...... SUCCESS [0.226s]
[INFO] Qpid AMQP 0-x JMS Client Examples ................. SUCCESS [0.135s]
[INFO] Qpid JCA .......................................... SUCCESS [1.598s]
[INFO] Qpid Resource Adaptor ............................. SUCCESS [0.359s]
[INFO] Qpid Tools ........................................ SUCCESS [0.314s]
[INFO] Qpid Management Examples .......................... SUCCESS [0.131s]
[INFO] Qpid Java System Test Parent ...................... SUCCESS [0.721s]
[INFO] Qpid System Tests ................................. SUCCESS [7:26.739s]
[INFO] Qpid Performance Tests ............................ SUCCESS [12.406s]
[INFO] Qpid Performance Test System Tests ................ SUCCESS [16.006s]
[INFO] Qpid Performance Tests Visualisation JFC .......... SUCCESS [3.951s]
[INFO] Qpid BDB Store System Tests ....................... FAILURE [4.926s]
[INFO] ------------------------------------------------------------------------
[INFO] BUILD FAILURE
[INFO] ------------------------------------------------------------------------
[INFO] Total time: 13:38.890s
[INFO] Finished at: Sun Dec 07 11:49:19 UTC 2014
[INFO] Final Memory: 73M/391M
[INFO] ------------------------------------------------------------------------
[ERROR] Failed to execute goal org.apache.maven.plugins:maven-surefire-plugin:2.16:test (integration-test)
on project qpid-bdbstore-systests: There are test failures.
[ERROR] 
[ERROR] Please refer to <https://builds.apache.org/job/Qpid-Java-Cpp-Test/ws/trunk/qpid/java/bdbstore/systests/target/surefire-reports>
for the individual test results.
[ERROR] -> [Help 1]
[ERROR] 
[ERROR] To see the full stack trace of the errors, re-run Maven with the -e switch.
[ERROR] Re-run Maven using the -X switch to enable full debug logging.
[ERROR] 
[ERROR] For more information about the errors and possible solutions, please read the following
articles:
[ERROR] [Help 1] http://cwiki.apache.org/confluence/display/MAVEN/MojoFailureException
[ERROR] 
[ERROR] After correcting the problems, you can resume the build with the command
[ERROR]   mvn <goals> -rf :qpid-bdbstore-systests
Build step 'Invoke top-level Maven targets' marked build as failure
[locks-and-latches] Releasing all the locks
[locks-and-latches] All the locks released
Recording test results

Mime
View raw message