qpid-notifications mailing list archives

Site index · List index
Message view « Date » · « Thread »
Top « Date » · « Thread »
From Apache Jenkins Server <jenk...@builds.apache.org>
Subject Build failed in Jenkins: Qpid-Java-Java-Test-IBMJDK1.7 #942
Date Sun, 28 Dec 2014 02:31:45 GMT
See <https://builds.apache.org/job/Qpid-Java-Java-Test-IBMJDK1.7/942/changes>

Changes:

[kwall] QPID-6289: [Java Broker] Extend Java Broker model to encapsulate permitted child types

Work of Robert Godfrey <rgodfrey@apache.org>

------------------------------------------
[...truncated 7208 lines...]
22252/22646 KB   
22256/22646 KB   
22260/22646 KB   
22264/22646 KB   
22268/22646 KB   
22272/22646 KB   
22276/22646 KB   
22280/22646 KB   
22284/22646 KB   
22288/22646 KB   
22292/22646 KB   
22296/22646 KB   
22300/22646 KB   
22304/22646 KB   
22308/22646 KB   
22312/22646 KB   
22316/22646 KB   
22320/22646 KB   
22324/22646 KB   
22328/22646 KB   
22332/22646 KB   
22336/22646 KB   
22340/22646 KB   
22344/22646 KB   
22348/22646 KB   
22352/22646 KB   
22356/22646 KB   
22360/22646 KB   
22364/22646 KB   
22368/22646 KB   
22372/22646 KB   
22376/22646 KB   
22380/22646 KB   
22384/22646 KB   
22388/22646 KB   
22392/22646 KB   
22396/22646 KB   
22400/22646 KB   
22404/22646 KB   
22408/22646 KB   
22412/22646 KB   
22416/22646 KB   
22420/22646 KB   
22424/22646 KB   
22428/22646 KB   
22432/22646 KB   
22436/22646 KB   
22440/22646 KB   
22444/22646 KB   
22448/22646 KB   
22452/22646 KB   
22456/22646 KB   
22460/22646 KB   
22464/22646 KB   
22468/22646 KB   
22472/22646 KB   
22476/22646 KB   
22480/22646 KB   
22484/22646 KB   
22488/22646 KB   
22492/22646 KB   
22496/22646 KB   
22500/22646 KB   
22504/22646 KB   
22508/22646 KB   
22512/22646 KB   
22516/22646 KB   
22520/22646 KB   
22524/22646 KB   
22528/22646 KB   
22532/22646 KB   
22536/22646 KB   
22540/22646 KB   
22544/22646 KB   
22548/22646 KB   
22552/22646 KB   
22556/22646 KB   
22560/22646 KB   
22564/22646 KB   
22568/22646 KB   
22572/22646 KB   
22576/22646 KB   
22580/22646 KB   
22584/22646 KB   
22588/22646 KB   
22592/22646 KB   
22596/22646 KB   
22600/22646 KB   
22604/22646 KB   
22608/22646 KB   
22612/22646 KB   
22616/22646 KB   
22620/22646 KB   
22624/22646 KB   
22628/22646 KB   
22632/22646 KB   
22636/22646 KB   
22640/22646 KB   
22644/22646 KB   
22646/22646 KB   
                 
Downloaded: http://repository.apache.org/snapshots/org/apache/qpid/qpid-broker/0.32-SNAPSHOT/qpid-broker-0.32-20141227.233414-132-bin.tar.gz
(22646 KB at 3679.3 KB/sec)
[INFO] Unpacking /home/jenkins/.m2/repository/org/apache/qpid/qpid-broker/0.32-SNAPSHOT/qpid-broker-0.32-SNAPSHOT-bin.tar.gz
to <https://builds.apache.org/job/Qpid-Java-Java-Test-IBMJDK1.7/ws/trunk/qpid/java/qpid-systests-parent/target>
with includes "" and excludes ""
[INFO] Expanding: /home/jenkins/.m2/repository/org/apache/qpid/qpid-broker/0.32-SNAPSHOT/qpid-broker-0.32-SNAPSHOT-bin.tar.gz
into <https://builds.apache.org/job/Qpid-Java-Java-Test-IBMJDK1.7/ws/trunk/qpid/java/qpid-systests-parent/target>
[INFO] 
[INFO] --- maven-dependency-plugin:2.8:copy (copy-sleepycat-jar-for-bdb-tests) @ qpid-systests-parent
---
[INFO] Configured Artifact: com.sleepycat:je:5.0.97:jar
[INFO] Copying je-5.0.97.jar to <https://builds.apache.org/job/Qpid-Java-Java-Test-IBMJDK1.7/ws/trunk/qpid/java/qpid-systests-parent/target/qpid-broker/0.32-SNAPSHOT/lib/je-5.0.97.jar>
[INFO] 
[INFO] --- maven-surefire-plugin:2.16:test (integration-test) @ qpid-systests-parent ---
[INFO] No tests to run.
[INFO] 
[INFO] --- maven-site-plugin:3.3:site (default-site) @ qpid-systests-parent ---
[INFO] configuring report plugin org.apache.maven.plugins:maven-project-info-reports-plugin:2.7
[INFO] configuring report plugin org.codehaus.mojo:license-maven-plugin:1.6
[INFO] configuring report plugin org.apache.maven.plugins:maven-surefire-report-plugin:2.16
[INFO] configuring report plugin org.apache.maven.plugins:maven-jxr-plugin:2.3
[INFO] configuring report plugin org.jacoco:jacoco-maven-plugin:0.7.0.201403182114
[INFO] Skipping JaCoCo execution because property jacoco.skip is set.
[INFO] Skipping JaCoCo execution because property jacoco.skip is set.
[INFO] configuring report plugin org.apache.rat:apache-rat-plugin:0.10
[INFO] Parent project loaded from repository: org.apache.qpid:qpid-parent:pom:1.0
[INFO] Parent project loaded from repository: org.apache:apache:pom:14
[INFO] Relativizing decoration links with respect to project URL: http://qpid.apache.org/qpid-java-build/qpid-systests-parent
[INFO] Rendering site with org.apache.maven.skins:maven-default-skin:jar:1.0 skin.
[INFO] Generating "About" report    --- maven-project-info-reports-plugin:2.7
[INFO] Generating "Plugin Management" report    --- maven-project-info-reports-plugin:2.7
[INFO] Generating "Distribution Management" report    --- maven-project-info-reports-plugin:2.7
[INFO] Generating "Dependency Information" report    --- maven-project-info-reports-plugin:2.7
[INFO] Generating "Dependency Convergence" report    --- maven-project-info-reports-plugin:2.7
[INFO] Generating "Source Repository" report    --- maven-project-info-reports-plugin:2.7
[INFO] Generating "Mailing Lists" report    --- maven-project-info-reports-plugin:2.7
[INFO] Generating "Issue Tracking" report    --- maven-project-info-reports-plugin:2.7
[INFO] Generating "Continuous Integration" report    --- maven-project-info-reports-plugin:2.7
[INFO] Generating "Project Plugins" report    --- maven-project-info-reports-plugin:2.7
[INFO] Generating "Project License" report    --- maven-project-info-reports-plugin:2.7
[INFO] Generating "Dependency Management" report    --- maven-project-info-reports-plugin:2.7
[INFO] Generating "Project Team" report    --- maven-project-info-reports-plugin:2.7
[INFO] Generating "Project Summary" report    --- maven-project-info-reports-plugin:2.7
[INFO] Generating "Dependencies" report    --- maven-project-info-reports-plugin:2.7
[INFO] Generating "Third Parties" report    --- license-maven-plugin:1.6
[INFO] Generating "Rat Report" report    --- apache-rat-plugin:0.10
[INFO] 51 implicit excludes (use -debug for more details).
[INFO] Exclude: build/**
[INFO] Exclude: lib/**
[INFO] Exclude: test-profiles/test_resources/ssl/**
[INFO] 1 resources included (use -debug for more details)
[INFO] 
[INFO] --- maven-site-plugin:3.3:stage (default-cli) @ qpid-systests-parent ---
[INFO] Using this base directory for staging: <https://builds.apache.org/job/Qpid-Java-Java-Test-IBMJDK1.7/ws/trunk/qpid/java/target/staging>
[INFO] Parent project loaded from repository: org.apache.qpid:qpid-parent:pom:1.0
file://<https://builds.apache.org/job/Qpid-Java-Java-Test-IBMJDK1.7/ws/trunk/qpid/java/target/staging/>
- Session: Opened  
[INFO] Pushing <https://builds.apache.org/job/Qpid-Java-Java-Test-IBMJDK1.7/ws/trunk/qpid/java/qpid-systests-parent/target/site>
[INFO]    >>> to file://<https://builds.apache.org/job/Qpid-Java-Java-Test-IBMJDK1.7/ws/trunk/qpid/java/target/staging/qpid-systests-parent/qpid-systests-parent>
file://<https://builds.apache.org/job/Qpid-Java-Java-Test-IBMJDK1.7/ws/trunk/qpid/java/target/staging/>
- Session: Disconnecting  
file://<https://builds.apache.org/job/Qpid-Java-Java-Test-IBMJDK1.7/ws/trunk/qpid/java/target/staging/>
- Session: Disconnected
[INFO]                                                                         
[INFO] ------------------------------------------------------------------------
[INFO] Skipping Qpid System Tests
[INFO] This project has been banned from the build due to previous failures.
[INFO] ------------------------------------------------------------------------
[INFO]                                                                         
[INFO] ------------------------------------------------------------------------
[INFO] Skipping Qpid Performance Tests
[INFO] This project has been banned from the build due to previous failures.
[INFO] ------------------------------------------------------------------------
[INFO]                                                                         
[INFO] ------------------------------------------------------------------------
[INFO] Skipping Qpid Performance Test System Tests
[INFO] This project has been banned from the build due to previous failures.
[INFO] ------------------------------------------------------------------------
[INFO]                                                                         
[INFO] ------------------------------------------------------------------------
[INFO] Skipping Qpid Performance Tests Visualisation JFC
[INFO] This project has been banned from the build due to previous failures.
[INFO] ------------------------------------------------------------------------
[INFO]                                                                         
[INFO] ------------------------------------------------------------------------
[INFO] Skipping Qpid BDB Store System Tests
[INFO] This project has been banned from the build due to previous failures.
[INFO] ------------------------------------------------------------------------
[INFO] ------------------------------------------------------------------------
[INFO] Reactor Summary:
[INFO] 
[INFO] Qpid Java Build ................................... SUCCESS [25.723s]
[INFO] Qpid AMQP 1.0 Common .............................. SUCCESS [8.161s]
[INFO] Qpid AMQP 1.0 Client .............................. SUCCESS [2.690s]
[INFO] Qpid AMQP 1.0 Client JMS .......................... SUCCESS [4.512s]
[INFO] Qpid AMQP 1.0 JMS Client Examples ................. SUCCESS [2.330s]
[INFO] Qpid AMQP 1.0 Client WebSocket .................... SUCCESS [2.654s]
[INFO] Qpid Broker Code Generation ....................... SUCCESS [2.207s]
[INFO] Qpid Test Utilities ............................... SUCCESS [2.299s]
[INFO] Qpid Common ....................................... FAILURE [24.051s]
[INFO] Qpid Management Common ............................ SUCCESS [4.203s]
[INFO] Qpid Java Broker Core ............................. SKIPPED
[INFO] Qpid Access Control Broker Plug-in ................ SKIPPED
[INFO] Qpid AMQP 0-8 Protocol Broker Plug-in ............. SKIPPED
[INFO] Qpid AMQP 0-10 Protocol Plug-in ................... SKIPPED
[INFO] Qpid AMQP 1-0 Protocol Broker Plug-in ............. SKIPPED
[INFO] Qpid AMQP 0-8 to 0-10 Message Conversion Broker Plug-in  SKIPPED
[INFO] Qpid AMQP 0-8 to 1-0 Message Conversion Broker Plug-in  SKIPPED
[INFO] Qpid AMQP 0-10 to 1-0 Message Conversion Broker Plug-in  SKIPPED
[INFO] Qpid Derby Message Store .......................... SKIPPED
[INFO] Qpid JDBC Message Store Connection Pooling Plug-in  SKIPPED
[INFO] Qpid JDBC Message Store Broker Plug-in ............ SKIPPED
[INFO] Qpid HTTP Management Broker Plug-in ............... SKIPPED
[INFO] Qpid JMX Management Broker Plug-in ................ SKIPPED
[INFO] Qpid Memory Message Store Broker Plug-in .......... SKIPPED
[INFO] Qpid WebSocket Broker Plug-in ..................... SKIPPED
[INFO] Qpid AMQP 0-x JMS Client .......................... SKIPPED
[INFO] Qpid BDB Message Store ............................ SKIPPED
[INFO] Qpid BDB Message Store JMX ........................ SKIPPED
[INFO] Qpid Java Broker .................................. SKIPPED
[INFO] Qpid AMQP Management Protocol Broker Plug-in ...... SKIPPED
[INFO] Qpid AMQP 0-x JMS Client Examples ................. SKIPPED
[INFO] Qpid JCA .......................................... SKIPPED
[INFO] Qpid Resource Adaptor ............................. SKIPPED
[INFO] Qpid Tools ........................................ SKIPPED
[INFO] Qpid Management Examples .......................... SUCCESS [2.056s]
[INFO] Qpid Java System Test Parent ...................... SUCCESS [11.763s]
[INFO] Qpid System Tests ................................. SKIPPED
[INFO] Qpid Performance Tests ............................ SKIPPED
[INFO] Qpid Performance Test System Tests ................ SKIPPED
[INFO] Qpid Performance Tests Visualisation JFC .......... SKIPPED
[INFO] Qpid BDB Store System Tests ....................... SKIPPED
[INFO] ------------------------------------------------------------------------
[INFO] BUILD FAILURE
[INFO] ------------------------------------------------------------------------
[INFO] Total time: 1:33.749s
[INFO] Finished at: Sun Dec 28 02:31:43 UTC 2014
[INFO] Final Memory: 58M/177M
[INFO] ------------------------------------------------------------------------
[ERROR] Failed to execute goal org.apache.maven.plugins:maven-surefire-plugin:2.16:test (default-test)
on project qpid-common: There are test failures.
[ERROR] 
[ERROR] Please refer to <https://builds.apache.org/job/Qpid-Java-Java-Test-IBMJDK1.7/ws/trunk/qpid/java/common/target/surefire-reports>
for the individual test results.
[ERROR] -> [Help 1]
[ERROR] 
[ERROR] To see the full stack trace of the errors, re-run Maven with the -e switch.
[ERROR] Re-run Maven using the -X switch to enable full debug logging.
[ERROR] 
[ERROR] For more information about the errors and possible solutions, please read the following
articles:
[ERROR] [Help 1] http://cwiki.apache.org/confluence/display/MAVEN/MojoFailureException
[ERROR] 
[ERROR] After correcting the problems, you can resume the build with the command
[ERROR]   mvn <goals> -rf :qpid-common
Build step 'Invoke top-level Maven targets' marked build as failure
[locks-and-latches] Releasing all the locks
[locks-and-latches] All the locks released
Recording test results

Mime
View raw message