qpid-notifications mailing list archives

Site index · List index
Message view « Date » · « Thread »
Top « Date » · « Thread »
From Apache Jenkins Server <jenk...@builds.apache.org>
Subject Build failed in Jenkins: Qpid-Java-Cpp-Test #2301
Date Wed, 26 Nov 2014 14:06:56 GMT
See <https://builds.apache.org/job/Qpid-Java-Cpp-Test/2301/changes>

Changes:

[rgodfrey] QPID-6165 : Add documentation for port connection limits

------------------------------------------
[...truncated 23945 lines...]
[INFO] skip non existing resourceDirectory <https://builds.apache.org/job/Qpid-Java-Cpp-Test/ws/trunk/qpid/java/perftests/visualisation-jfc/src/main/resources>
[INFO] Copying 0 resource
[INFO] Copying 3 resources
[INFO] 
[INFO] --- maven-compiler-plugin:3.1:compile (default-compile) @ qpid-perftests-visualisation-jfc
---
[INFO] Changes detected - recompiling the module!
[INFO] Compiling 30 source files to <https://builds.apache.org/job/Qpid-Java-Cpp-Test/ws/trunk/qpid/java/perftests/visualisation-jfc/target/classes>
[INFO] 
[INFO] --- maven-resources-plugin:2.6:testResources (default-testResources) @ qpid-perftests-visualisation-jfc
---
[INFO] Using 'UTF-8' encoding to copy filtered resources.
[INFO] Copying 1 resource
[INFO] skip non existing resourceDirectory <https://builds.apache.org/job/Qpid-Java-Cpp-Test/ws/trunk/qpid/java/perftests/visualisation-jfc/src/test/resources>
[INFO] Copying 3 resources
[INFO] 
[INFO] --- maven-compiler-plugin:3.1:testCompile (default-testCompile) @ qpid-perftests-visualisation-jfc
---
[INFO] Changes detected - recompiling the module!
[INFO] Compiling 11 source files to <https://builds.apache.org/job/Qpid-Java-Cpp-Test/ws/trunk/qpid/java/perftests/visualisation-jfc/target/test-classes>
[INFO] 
[INFO] --- maven-surefire-plugin:2.16:test (default-test) @ qpid-perftests-visualisation-jfc
---
[INFO] Surefire report directory: <https://builds.apache.org/job/Qpid-Java-Cpp-Test/ws/trunk/qpid/java/perftests/visualisation-jfc/target/surefire-reports>

-------------------------------------------------------
 T E S T S
-------------------------------------------------------
Running org.apache.qpid.disttest.charting.chartbuilder.BaseChartBuilderTest
main 2014-11-26 14:06:16,243 INFO [qpid.test.utils.QpidTestCase] Some tests should be excluded,
building the exclude list
main 2014-11-26 14:06:16,244 INFO [qpid.test.utils.QpidTestCase] Specified exclude file does
not exist: <https://builds.apache.org/job/Qpid-Java-Cpp-Test/ws/trunk/qpid/java/perftests/visualisation-jfc/../test-profiles//Excludes>
main 2014-11-26 14:06:16,244 INFO [qpid.test.utils.QpidTestCase] Specified exclude file does
not exist: <https://builds.apache.org/job/Qpid-Java-Cpp-Test/ws/trunk/qpid/java/perftests/visualisation-jfc/../test-profiles//CPPExcludes>
main 2014-11-26 14:06:16,245 INFO [qpid.test.utils.QpidTestCase] Specified exclude file does
not exist: <https://builds.apache.org/job/Qpid-Java-Cpp-Test/ws/trunk/qpid/java/perftests/visualisation-jfc/../test-profiles//cpp.excludes>
main 2014-11-26 14:06:16,245 INFO [qpid.test.utils.QpidTestCase] Specified exclude file does
not exist: <https://builds.apache.org/job/Qpid-Java-Cpp-Test/ws/trunk/qpid/java/perftests/visualisation-jfc/../test-profiles//CPPPrefetchExcludes>
main 2014-11-26 14:06:16,245 INFO [qpid.test.utils.QpidTestCase] Specified exclude file does
not exist: <https://builds.apache.org/job/Qpid-Java-Cpp-Test/ws/trunk/qpid/java/perftests/visualisation-jfc/../test-profiles//CPPTransientExcludes>
main 2014-11-26 14:06:16,246 INFO [qpid.test.utils.QpidTestCase] Specified exclude file does
not exist: <https://builds.apache.org/job/Qpid-Java-Cpp-Test/ws/trunk/qpid/java/perftests/visualisation-jfc/../test-profiles//cpp.excludes>
main 2014-11-26 14:06:16,680 INFO [qpid.test.utils.QpidTestCase] ========== start BaseChartBuilderTest.testBuildChart
==========
main 2014-11-26 14:06:16,900 INFO [qpid.test.utils.QpidTestCase] ========== tearDown BaseChartBuilderTest.testBuildChart
==========
Tests run: 1, Failures: 0, Errors: 0, Skipped: 0, Time elapsed: 1.025 sec - in org.apache.qpid.disttest.charting.chartbuilder.BaseChartBuilderTest
Running org.apache.qpid.disttest.charting.chartbuilder.TimeSeriesBuilderCallbackTest
main 2014-11-26 14:06:16,903 INFO [qpid.test.utils.QpidTestCase] ========== start TimeSeriesBuilderCallbackTest.testAddPointToSeries
==========
main 2014-11-26 14:06:16,962 INFO [qpid.test.utils.QpidTestCase] ========== tearDown TimeSeriesBuilderCallbackTest.testAddPointToSeries
==========
Tests run: 1, Failures: 0, Errors: 0, Skipped: 0, Time elapsed: 0.06 sec - in org.apache.qpid.disttest.charting.chartbuilder.TimeSeriesBuilderCallbackTest
Running org.apache.qpid.disttest.charting.chartbuilder.ChartProductionTest
main 2014-11-26 14:06:16,987 INFO [qpid.test.utils.QpidTestCase] ========== start ChartProductionTest.testLine3DChart
==========
main 2014-11-26 14:06:16,996 INFO [disttest.charting.writer.ChartWriter] Set chart directory:
/tmp/charts-1417010776991
main 2014-11-26 14:06:17,564 INFO [disttest.charting.writer.ChartWriter] Written /tmp/charts-1417010776991/testLine3DChart.png
chart
main 2014-11-26 14:06:17,565 INFO [qpid.test.utils.QpidTestCase] ========== tearDown ChartProductionTest.testLine3DChart
==========
main 2014-11-26 14:06:17,565 INFO [qpid.test.utils.QpidTestCase] ========== start ChartProductionTest.testXYLineChart
==========
main 2014-11-26 14:06:17,566 INFO [disttest.charting.writer.ChartWriter] Set chart directory:
/tmp/charts-1417010777566
main 2014-11-26 14:06:17,696 INFO [disttest.charting.writer.ChartWriter] Written /tmp/charts-1417010777566/testXYLineChart.png
chart
main 2014-11-26 14:06:17,696 INFO [qpid.test.utils.QpidTestCase] ========== tearDown ChartProductionTest.testXYLineChart
==========
main 2014-11-26 14:06:17,697 INFO [qpid.test.utils.QpidTestCase] ========== start ChartProductionTest.testStatisticalBarChart
==========
main 2014-11-26 14:06:17,698 INFO [disttest.charting.writer.ChartWriter] Set chart directory:
/tmp/charts-1417010777697
main 2014-11-26 14:06:17,799 INFO [disttest.charting.writer.ChartWriter] Written /tmp/charts-1417010777697/testStatisticalBarChart.png
chart
main 2014-11-26 14:06:17,799 INFO [qpid.test.utils.QpidTestCase] ========== tearDown ChartProductionTest.testStatisticalBarChart
==========
main 2014-11-26 14:06:17,800 INFO [qpid.test.utils.QpidTestCase] ========== start ChartProductionTest.testLineChart
==========
main 2014-11-26 14:06:17,801 INFO [disttest.charting.writer.ChartWriter] Set chart directory:
/tmp/charts-1417010777801
main 2014-11-26 14:06:17,879 INFO [disttest.charting.writer.ChartWriter] Written /tmp/charts-1417010777801/testLineChart.png
chart
main 2014-11-26 14:06:17,879 INFO [qpid.test.utils.QpidTestCase] ========== tearDown ChartProductionTest.testLineChart
==========
main 2014-11-26 14:06:17,879 INFO [qpid.test.utils.QpidTestCase] ========== start ChartProductionTest.testBarChart
==========
main 2014-11-26 14:06:17,880 INFO [disttest.charting.writer.ChartWriter] Set chart directory:
/tmp/charts-1417010777880
main 2014-11-26 14:06:17,958 INFO [disttest.charting.writer.ChartWriter] Written /tmp/charts-1417010777880/testBarChart.png
chart
main 2014-11-26 14:06:17,958 INFO [qpid.test.utils.QpidTestCase] ========== tearDown ChartProductionTest.testBarChart
==========
main 2014-11-26 14:06:17,959 INFO [qpid.test.utils.QpidTestCase] ========== start ChartProductionTest.testBar3DChart
==========
main 2014-11-26 14:06:17,959 INFO [disttest.charting.writer.ChartWriter] Set chart directory:
/tmp/charts-1417010777959
main 2014-11-26 14:06:18,047 INFO [disttest.charting.writer.ChartWriter] Written /tmp/charts-1417010777959/testBar3DChart.png
chart
main 2014-11-26 14:06:18,047 INFO [qpid.test.utils.QpidTestCase] ========== tearDown ChartProductionTest.testBar3DChart
==========
main 2014-11-26 14:06:18,048 INFO [qpid.test.utils.QpidTestCase] ========== start ChartProductionTest.testTimeSeriesLineChart
==========
main 2014-11-26 14:06:18,049 INFO [disttest.charting.writer.ChartWriter] Set chart directory:
/tmp/charts-1417010778048
main 2014-11-26 14:06:18,147 INFO [disttest.charting.writer.ChartWriter] Written /tmp/charts-1417010778048/testTimeSeriesLineChart.png
chart
main 2014-11-26 14:06:18,147 INFO [qpid.test.utils.QpidTestCase] ========== tearDown ChartProductionTest.testTimeSeriesLineChart
==========
main 2014-11-26 14:06:18,147 INFO [qpid.test.utils.QpidTestCase] ========== start ChartProductionTest.testXYLineChartWithColourAndWidth
==========
main 2014-11-26 14:06:18,148 INFO [disttest.charting.writer.ChartWriter] Set chart directory:
/tmp/charts-1417010778148
main 2014-11-26 14:06:18,233 INFO [disttest.charting.writer.ChartWriter] Written /tmp/charts-1417010778148/testXYLineChartWithColourAndWidth.png
chart
main 2014-11-26 14:06:18,233 INFO [qpid.test.utils.QpidTestCase] ========== tearDown ChartProductionTest.testXYLineChartWithColourAndWidth
==========
Tests run: 8, Failures: 0, Errors: 0, Skipped: 0, Time elapsed: 1.271 sec - in org.apache.qpid.disttest.charting.chartbuilder.ChartProductionTest
Running org.apache.qpid.disttest.charting.chartbuilder.ChartBuilderFactoryTest
main 2014-11-26 14:06:18,236 INFO [qpid.test.utils.QpidTestCase] ========== start ChartBuilderFactoryTest.testXYLineChart
==========
main 2014-11-26 14:06:18,236 INFO [qpid.test.utils.QpidTestCase] ========== tearDown ChartBuilderFactoryTest.testXYLineChart
==========
main 2014-11-26 14:06:18,236 INFO [qpid.test.utils.QpidTestCase] ========== start ChartBuilderFactoryTest.testLineChart
==========
main 2014-11-26 14:06:18,236 INFO [qpid.test.utils.QpidTestCase] ========== tearDown ChartBuilderFactoryTest.testLineChart
==========
main 2014-11-26 14:06:18,237 INFO [qpid.test.utils.QpidTestCase] ========== start ChartBuilderFactoryTest.testBarChart
==========
main 2014-11-26 14:06:18,237 INFO [qpid.test.utils.QpidTestCase] ========== tearDown ChartBuilderFactoryTest.testBarChart
==========
main 2014-11-26 14:06:18,237 INFO [qpid.test.utils.QpidTestCase] ========== start ChartBuilderFactoryTest.testTimeSeriesLineChart
==========
main 2014-11-26 14:06:18,237 INFO [qpid.test.utils.QpidTestCase] ========== tearDown ChartBuilderFactoryTest.testTimeSeriesLineChart
==========
main 2014-11-26 14:06:18,237 INFO [qpid.test.utils.QpidTestCase] ========== start ChartBuilderFactoryTest.testLineChart3D
==========
main 2014-11-26 14:06:18,237 INFO [qpid.test.utils.QpidTestCase] ========== tearDown ChartBuilderFactoryTest.testLineChart3D
==========
main 2014-11-26 14:06:18,238 INFO [qpid.test.utils.QpidTestCase] ========== start ChartBuilderFactoryTest.testBarChart3D
==========
main 2014-11-26 14:06:18,238 INFO [qpid.test.utils.QpidTestCase] ========== tearDown ChartBuilderFactoryTest.testBarChart3D
==========
Tests run: 6, Failures: 0, Errors: 0, Skipped: 0, Time elapsed: 0.003 sec - in org.apache.qpid.disttest.charting.chartbuilder.ChartBuilderFactoryTest
Running org.apache.qpid.disttest.charting.chartbuilder.ColorFactoryTest
main 2014-11-26 14:06:18,239 INFO [qpid.test.utils.QpidTestCase] ========== start ColorFactoryTest.testDarkBlue
==========
main 2014-11-26 14:06:18,240 INFO [qpid.test.utils.QpidTestCase] ========== tearDown ColorFactoryTest.testDarkBlue
==========
main 2014-11-26 14:06:18,240 INFO [qpid.test.utils.QpidTestCase] ========== start ColorFactoryTest.testBlue
==========
main 2014-11-26 14:06:18,240 INFO [qpid.test.utils.QpidTestCase] ========== tearDown ColorFactoryTest.testBlue
==========
Tests run: 2, Failures: 0, Errors: 0, Skipped: 0, Time elapsed: 0.001 sec - in org.apache.qpid.disttest.charting.chartbuilder.ColorFactoryTest
Running org.apache.qpid.disttest.charting.writer.ChartWriterTest
main 2014-11-26 14:06:18,266 INFO [disttest.charting.writer.ChartWriter] Set chart directory:
/tmp/TestFileUtils-testDir-1417010778266
main 2014-11-26 14:06:18,365 INFO [disttest.charting.writer.ChartWriter] Written /tmp/TestFileUtils-testDir-1417010778266/chart1.png
chart
main 2014-11-26 14:06:18,365 INFO [disttest.charting.writer.ChartWriter] Only 1 chart image(s)
have been written so no HTML summary file will be produced
main 2014-11-26 14:06:18,365 INFO [qpid.test.utils.QpidTestCase] ========== tearDown null
==========
main 2014-11-26 14:06:18,366 INFO [disttest.charting.writer.ChartWriter] Set chart directory:
/tmp/TestFileUtils-testDir-1417010778366
main 2014-11-26 14:06:18,432 INFO [disttest.charting.writer.ChartWriter] Written /tmp/TestFileUtils-testDir-1417010778366/chart1.png
chart
main 2014-11-26 14:06:18,432 INFO [qpid.test.utils.QpidTestCase] ========== tearDown null
==========
main 2014-11-26 14:06:18,433 INFO [disttest.charting.writer.ChartWriter] Set chart directory:
/tmp/TestFileUtils-testDir-1417010778433
main 2014-11-26 14:06:18,500 INFO [disttest.charting.writer.ChartWriter] Written /tmp/TestFileUtils-testDir-1417010778433/chart2.png
chart
main 2014-11-26 14:06:18,564 INFO [disttest.charting.writer.ChartWriter] Written /tmp/TestFileUtils-testDir-1417010778433/chart1.png
chart
main 2014-11-26 14:06:18,566 DEBUG [disttest.charting.writer.ChartWriter] About to produce
HTML summary file /tmp/TestFileUtils-testDir-1417010778433/chart-summary.html from charts
{/tmp/TestFileUtils-testDir-1417010778433/chart1.png=Mock for ChartingDefinition, hashCode:
25650432, /tmp/TestFileUtils-testDir-1417010778433/chart2.png=Mock for ChartingDefinition,
hashCode: 33027647}
main 2014-11-26 14:06:18,575 INFO [qpid.test.utils.QpidTestCase] ========== tearDown null
==========
Tests run: 3, Failures: 0, Errors: 0, Skipped: 0, Time elapsed: 0.334 sec - in org.apache.qpid.disttest.charting.writer.ChartWriterTest
Running org.apache.qpid.disttest.charting.seriesbuilder.SeriesRowTest
main 2014-11-26 14:06:18,577 INFO [qpid.test.utils.QpidTestCase] ========== start SeriesRowTest.testValidSeriesRowThrowsExceptionIfArrayTooSmall
==========
main 2014-11-26 14:06:18,577 INFO [qpid.test.utils.QpidTestCase] ========== tearDown SeriesRowTest.testValidSeriesRowThrowsExceptionIfArrayTooSmall
==========
main 2014-11-26 14:06:18,577 INFO [qpid.test.utils.QpidTestCase] ========== start SeriesRowTest.testDimension
==========
main 2014-11-26 14:06:18,577 INFO [qpid.test.utils.QpidTestCase] ========== tearDown SeriesRowTest.testDimension
==========
main 2014-11-26 14:06:18,578 INFO [qpid.test.utils.QpidTestCase] ========== start SeriesRowTest.testDimensionAsDouble
==========
main 2014-11-26 14:06:18,578 INFO [qpid.test.utils.QpidTestCase] ========== tearDown SeriesRowTest.testDimensionAsDouble
==========
main 2014-11-26 14:06:18,578 INFO [qpid.test.utils.QpidTestCase] ========== start SeriesRowTest.testDimensionAsString
==========
main 2014-11-26 14:06:18,578 INFO [qpid.test.utils.QpidTestCase] ========== tearDown SeriesRowTest.testDimensionAsString
==========
main 2014-11-26 14:06:18,578 INFO [qpid.test.utils.QpidTestCase] ========== start SeriesRowTest.testValidSeriesRow
==========
main 2014-11-26 14:06:18,579 INFO [qpid.test.utils.QpidTestCase] ========== tearDown SeriesRowTest.testValidSeriesRow
==========
Tests run: 5, Failures: 0, Errors: 0, Skipped: 0, Time elapsed: 0.003 sec - in org.apache.qpid.disttest.charting.seriesbuilder.SeriesRowTest
Running org.apache.qpid.disttest.charting.seriesbuilder.JdbcUrlGeneratorTest
main 2014-11-26 14:06:18,580 INFO [qpid.test.utils.QpidTestCase] ========== start JdbcUrlGeneratorTest.testGetJdbcUrlWithoutProvidingAUrlReturnsCsvUrlWithCorrectDirectory
==========
main 2014-11-26 14:06:18,593 INFO [qpid.test.utils.QpidTestCase] ========== tearDown JdbcUrlGeneratorTest.testGetJdbcUrlWithoutProvidingAUrlReturnsCsvUrlWithCorrectDirectory
==========
main 2014-11-26 14:06:18,594 INFO [qpid.test.utils.QpidTestCase] ========== start JdbcUrlGeneratorTest.testGetJdbcUrlThrowsExceptionWithoutAProvidedUrlOrSeriesDirectory
==========
main 2014-11-26 14:06:18,594 INFO [qpid.test.utils.QpidTestCase] ========== tearDown JdbcUrlGeneratorTest.testGetJdbcUrlThrowsExceptionWithoutAProvidedUrlOrSeriesDirectory
==========
main 2014-11-26 14:06:18,594 INFO [qpid.test.utils.QpidTestCase] ========== start JdbcUrlGeneratorTest.testGetJdbcUrlThrowsExceptionIfUrlProvidedAndSeriesDirectorySpecified
==========
main 2014-11-26 14:06:18,595 INFO [qpid.test.utils.QpidTestCase] ========== tearDown JdbcUrlGeneratorTest.testGetJdbcUrlThrowsExceptionIfUrlProvidedAndSeriesDirectorySpecified
==========
main 2014-11-26 14:06:18,595 INFO [qpid.test.utils.QpidTestCase] ========== start JdbcUrlGeneratorTest.testGetJdbcUrlReturnsProvidedUrl
==========
main 2014-11-26 14:06:18,596 INFO [qpid.test.utils.QpidTestCase] ========== tearDown JdbcUrlGeneratorTest.testGetJdbcUrlReturnsProvidedUrl
==========
Tests run: 4, Failures: 0, Errors: 0, Skipped: 0, Time elapsed: 0.017 sec - in org.apache.qpid.disttest.charting.seriesbuilder.JdbcUrlGeneratorTest
Running org.apache.qpid.disttest.charting.seriesbuilder.JdbcSeriesBuilderTest
main 2014-11-26 14:06:18,597 INFO [qpid.test.utils.QpidTestCase] ========== start JdbcSeriesBuilderTest.testBuildOneSeries
==========
main 2014-11-26 14:06:18,638 INFO [disttest.charting.seriesbuilder.JdbcSeriesBuilder] Loaded
JDBC driver class org.relique.jdbc.csv.CsvDriver
main 2014-11-26 14:06:18,668 INFO [disttest.charting.seriesbuilder.JdbcSeriesBuilder] Created:
JdbcSeriesBuilder[jdbcUrlGenerator=JdbcUrlGenerator[providedJdbdUrl=<null>]]
main 2014-11-26 14:06:18,740 INFO [qpid.test.utils.QpidTestCase] ========== tearDown JdbcSeriesBuilderTest.testBuildOneSeries
==========
Tests run: 1, Failures: 0, Errors: 0, Skipped: 0, Time elapsed: 0.143 sec - in org.apache.qpid.disttest.charting.seriesbuilder.JdbcSeriesBuilderTest
Running org.apache.qpid.disttest.charting.definition.ChartingDefinitionCreatorTest
main 2014-11-26 14:06:18,744 INFO [qpid.test.utils.QpidTestCase] ========== start ChartingDefinitionCreatorTest.testLoadTwoDefinitionsFromDirectory
==========
main 2014-11-26 14:06:18,758 INFO [qpid.test.utils.QpidTestCase] ========== tearDown ChartingDefinitionCreatorTest.testLoadTwoDefinitionsFromDirectory
==========
main 2014-11-26 14:06:18,759 INFO [qpid.test.utils.QpidTestCase] ========== start ChartingDefinitionCreatorTest.testLoadOneDefinitionFromFile
==========
main 2014-11-26 14:06:18,760 INFO [qpid.test.utils.QpidTestCase] ========== tearDown ChartingDefinitionCreatorTest.testLoadOneDefinitionFromFile
==========
main 2014-11-26 14:06:18,761 INFO [qpid.test.utils.QpidTestCase] ========== start ChartingDefinitionCreatorTest.testDefinitionsProperties
==========
main 2014-11-26 14:06:18,761 INFO [qpid.test.utils.QpidTestCase] Set system property "ChartingDefinitionSysProp"
to: "propValue"
main 2014-11-26 14:06:18,762 INFO [qpid.test.utils.QpidTestCase] ========== tearDown ChartingDefinitionCreatorTest.testDefinitionsProperties
==========
main 2014-11-26 14:06:18,763 DEBUG [qpid.test.utils.QpidTestCase] reverting 1 test properties
main 2014-11-26 14:06:18,763 INFO [qpid.test.utils.QpidTestCase] ========== start ChartingDefinitionCreatorTest.testDefinitionFileNotFound
==========
main 2014-11-26 14:06:18,764 INFO [qpid.test.utils.QpidTestCase] ========== tearDown ChartingDefinitionCreatorTest.testDefinitionFileNotFound
==========
Tests run: 4, Failures: 0, Errors: 0, Skipped: 0, Time elapsed: 0.023 sec - in org.apache.qpid.disttest.charting.definition.ChartingDefinitionCreatorTest
Running org.apache.qpid.disttest.charting.definition.SeriesDefinitionCreatorTest
main 2014-11-26 14:06:18,766 INFO [qpid.test.utils.QpidTestCase] ========== start SeriesDefinitionCreatorTest.testSeriesDirectoryAndNameSubstitution
==========
main 2014-11-26 14:06:18,766 INFO [qpid.test.utils.QpidTestCase] Set system property "SeriesDefinitionProp"
to: "propValue"
main 2014-11-26 14:06:18,767 INFO [qpid.test.utils.QpidTestCase] ========== tearDown SeriesDefinitionCreatorTest.testSeriesDirectoryAndNameSubstitution
==========
main 2014-11-26 14:06:18,767 DEBUG [qpid.test.utils.QpidTestCase] reverting 1 test properties
main 2014-11-26 14:06:18,767 INFO [qpid.test.utils.QpidTestCase] ========== start SeriesDefinitionCreatorTest.testTwoSeriesDefinitions
==========
main 2014-11-26 14:06:18,768 INFO [qpid.test.utils.QpidTestCase] ========== tearDown SeriesDefinitionCreatorTest.testTwoSeriesDefinitions
==========
main 2014-11-26 14:06:18,769 INFO [qpid.test.utils.QpidTestCase] ========== start SeriesDefinitionCreatorTest.testOneSeriesDefinition
==========
main 2014-11-26 14:06:18,770 INFO [qpid.test.utils.QpidTestCase] ========== tearDown SeriesDefinitionCreatorTest.testOneSeriesDefinition
==========
main 2014-11-26 14:06:18,770 INFO [qpid.test.utils.QpidTestCase] ========== start SeriesDefinitionCreatorTest.testNonSequentialSeriesDefinitionsIgnored
==========
main 2014-11-26 14:06:18,771 INFO [qpid.test.utils.QpidTestCase] ========== tearDown SeriesDefinitionCreatorTest.testNonSequentialSeriesDefinitionsIgnored
==========
Tests run: 4, Failures: 0, Errors: 0, Skipped: 0, Time elapsed: 0.007 sec - in org.apache.qpid.disttest.charting.definition.SeriesDefinitionCreatorTest

Results :

Tests run: 39, Failures: 0, Errors: 0, Skipped: 0

[INFO] 
[INFO] --- maven-jar-plugin:2.4:jar (default-jar) @ qpid-perftests-visualisation-jfc ---
[INFO] Building jar: <https://builds.apache.org/job/Qpid-Java-Cpp-Test/ws/trunk/qpid/java/perftests/visualisation-jfc/target/qpid-perftests-visualisation-jfc-0.32-SNAPSHOT.jar>
[INFO] 
[INFO] --- maven-site-plugin:3.3:attach-descriptor (attach-descriptor) @ qpid-perftests-visualisation-jfc
---
[INFO] 
[INFO] --- maven-antrun-plugin:1.7:run (create-qbtc-output-dir) @ qpid-perftests-visualisation-jfc
---
[INFO] Executing tasks

main:
    [mkdir] Created dir: <https://builds.apache.org/job/Qpid-Java-Cpp-Test/ws/trunk/qpid/java/perftests/visualisation-jfc/target/qbtc-output>
[INFO] Executed tasks
[INFO]                                                                         
[INFO] ------------------------------------------------------------------------
[INFO] Skipping Qpid BDB Store System Tests
[INFO] This project has been banned from the build due to previous failures.
[INFO] ------------------------------------------------------------------------
[INFO] ------------------------------------------------------------------------
[INFO] Reactor Summary:
[INFO] 
[INFO] Qpid Java Build ................................... SUCCESS [2.141s]
[INFO] Qpid AMQP 1.0 Common .............................. SUCCESS [5.239s]
[INFO] Qpid AMQP 1.0 Client .............................. SUCCESS [0.713s]
[INFO] Qpid AMQP 1.0 Client JMS .......................... SUCCESS [1.639s]
[INFO] Qpid AMQP 1.0 JMS Client Examples ................. SUCCESS [0.227s]
[INFO] Qpid AMQP 1.0 Client WebSocket .................... SUCCESS [0.485s]
[INFO] Qpid Broker Code Generation ....................... SUCCESS [0.196s]
[INFO] Qpid Test Utilities ............................... SUCCESS [0.202s]
[INFO] Qpid Common ....................................... SUCCESS [29.861s]
[INFO] Qpid Management Common ............................ SUCCESS [1.000s]
[INFO] Qpid Java Broker Core ............................. SUCCESS [1:27.781s]
[INFO] Qpid Access Control Broker Plug-in ................ SUCCESS [3.860s]
[INFO] Qpid AMQP 0-8 Protocol Broker Plug-in ............. SUCCESS [20.273s]
[INFO] Qpid AMQP 0-10 Protocol Plug-in ................... SUCCESS [3.940s]
[INFO] Qpid AMQP 1-0 Protocol Broker Plug-in ............. SUCCESS [0.411s]
[INFO] Qpid AMQP 0-8 to 0-10 Message Conversion Broker Plug-in  SUCCESS [0.222s]
[INFO] Qpid AMQP 0-8 to 1-0 Message Conversion Broker Plug-in  SUCCESS [0.216s]
[INFO] Qpid AMQP 0-10 to 1-0 Message Conversion Broker Plug-in  SUCCESS [0.195s]
[INFO] Qpid Derby Message Store .......................... SUCCESS [16.666s]
[INFO] Qpid JDBC Message Store Connection Pooling Plug-in  SUCCESS [0.203s]
[INFO] Qpid JDBC Message Store Broker Plug-in ............ SUCCESS [9.067s]
[INFO] Qpid HTTP Management Broker Plug-in ............... SUCCESS [4.199s]
[INFO] Qpid JMX Management Broker Plug-in ................ SUCCESS [3.226s]
[INFO] Qpid Memory Message Store Broker Plug-in .......... SUCCESS [0.239s]
[INFO] Qpid WebSocket Broker Plug-in ..................... SUCCESS [0.221s]
[INFO] Qpid AMQP 0-x JMS Client .......................... SUCCESS [6.154s]
[INFO] Qpid BDB Message Store ............................ SUCCESS [2:12.557s]
[INFO] Qpid BDB Message Store JMX ........................ SUCCESS [1.996s]
[INFO] Qpid Java Broker .................................. SUCCESS [4.381s]
[INFO] Qpid AMQP Management Protocol Broker Plug-in ...... SUCCESS [0.206s]
[INFO] Qpid AMQP 0-x JMS Client Examples ................. SUCCESS [0.159s]
[INFO] Qpid JCA .......................................... SUCCESS [1.458s]
[INFO] Qpid Resource Adaptor ............................. SUCCESS [0.365s]
[INFO] Qpid Tools ........................................ SUCCESS [0.280s]
[INFO] Qpid Management Examples .......................... SUCCESS [0.107s]
[INFO] Qpid Java System Test Parent ...................... SUCCESS [0.722s]
[INFO] Qpid System Tests ................................. FAILURE [1:00.367s]
[INFO] Qpid Performance Tests ............................ SUCCESS [12.624s]
[INFO] Qpid Performance Test System Tests ................ SKIPPED
[INFO] Qpid Performance Tests Visualisation JFC .......... SUCCESS [3.935s]
[INFO] Qpid BDB Store System Tests ....................... SKIPPED
[INFO] ------------------------------------------------------------------------
[INFO] BUILD FAILURE
[INFO] ------------------------------------------------------------------------
[INFO] Total time: 6:58.759s
[INFO] Finished at: Wed Nov 26 14:06:18 UTC 2014
[INFO] Final Memory: 71M/363M
[INFO] ------------------------------------------------------------------------
[ERROR] Failed to execute goal org.apache.maven.plugins:maven-surefire-plugin:2.16:test (integration-test)
on project qpid-systests: There are test failures.
[ERROR] 
[ERROR] Please refer to <https://builds.apache.org/job/Qpid-Java-Cpp-Test/ws/trunk/qpid/java/systests/target/surefire-reports>
for the individual test results.
[ERROR] -> [Help 1]
[ERROR] 
[ERROR] To see the full stack trace of the errors, re-run Maven with the -e switch.
[ERROR] Re-run Maven using the -X switch to enable full debug logging.
[ERROR] 
[ERROR] For more information about the errors and possible solutions, please read the following
articles:
[ERROR] [Help 1] http://cwiki.apache.org/confluence/display/MAVEN/MojoFailureException
[ERROR] 
[ERROR] After correcting the problems, you can resume the build with the command
[ERROR]   mvn <goals> -rf :qpid-systests
Build step 'Invoke top-level Maven targets' marked build as failure
[locks-and-latches] Releasing all the locks
[locks-and-latches] All the locks released
Recording test results

Mime
View raw message