qpid-notifications mailing list archives

Site index · List index
Message view « Date » · « Thread »
Top « Date » · « Thread »
From Apache Jenkins Server <jenk...@builds.apache.org>
Subject Build failed in Jenkins: Qpid-Java-Cpp-Test #2294
Date Sat, 22 Nov 2014 03:29:25 GMT
See <https://builds.apache.org/job/Qpid-Java-Cpp-Test/2294/changes>

Changes:

[aconway] NO-JIRA: Fix qpid-cpp-benchmark to work with activemq broker.

The activemq broker appears not to respect the AMQP drain flag, so calling fetch() on
an empty queue hangs. Use get() with a timeout instead to drain the queues.

------------------------------------------
[...truncated 17666 lines...]
	at sun.net.www.http.HttpClient.openServer(HttpClient.java:378)
	at sun.net.www.http.HttpClient.openServer(HttpClient.java:473)
	at sun.net.www.http.HttpClient.<init>(HttpClient.java:203)
	at sun.net.www.http.HttpClient.New(HttpClient.java:290)
	at sun.net.www.http.HttpClient.New(HttpClient.java:306)
	at sun.net.www.protocol.http.HttpURLConnection.getNewHttpClient(HttpURLConnection.java:995)
	at sun.net.www.protocol.http.HttpURLConnection.plainConnect(HttpURLConnection.java:931)
	at sun.net.www.protocol.http.HttpURLConnection.connect(HttpURLConnection.java:849)
	at sun.net.www.protocol.http.HttpURLConnection.getOutputStream(HttpURLConnection.java:1090)
	at org.apache.qpid.systest.rest.RestTestHelper.writeJsonRequest(RestTestHelper.java:234)
	at org.apache.qpid.systest.rest.RestTestHelper.submitRequest(RestTestHelper.java:508)
	at org.apache.qpid.systest.rest.RestTestHelper.submitRequest(RestTestHelper.java:522)
	at org.apache.qpid.server.store.berkeleydb.replication.BDBHAVirtualHostNodeRestTest.createHANode(BDBHAVirtualHostNodeRestTest.java:317)
	at org.apache.qpid.server.store.berkeleydb.replication.BDBHAVirtualHostNodeRestTest.testMutateStateOfOneNode(BDBHAVirtualHostNodeRestTest.java:103)

testIntruderProtection(org.apache.qpid.server.store.berkeleydb.replication.BDBHAVirtualHostNodeRestTest)
 Time elapsed: 0.037 sec  <<< ERROR!
java.net.ConnectException: Connection refused
	at java.net.PlainSocketImpl.socketConnect(Native Method)
	at java.net.AbstractPlainSocketImpl.doConnect(AbstractPlainSocketImpl.java:339)
	at java.net.AbstractPlainSocketImpl.connectToAddress(AbstractPlainSocketImpl.java:200)
	at java.net.AbstractPlainSocketImpl.connect(AbstractPlainSocketImpl.java:182)
	at java.net.SocksSocketImpl.connect(SocksSocketImpl.java:392)
	at java.net.Socket.connect(Socket.java:579)
	at sun.net.NetworkClient.doConnect(NetworkClient.java:175)
	at sun.net.www.http.HttpClient.openServer(HttpClient.java:378)
	at sun.net.www.http.HttpClient.openServer(HttpClient.java:473)
	at sun.net.www.http.HttpClient.<init>(HttpClient.java:203)
	at sun.net.www.http.HttpClient.New(HttpClient.java:290)
	at sun.net.www.http.HttpClient.New(HttpClient.java:306)
	at sun.net.www.protocol.http.HttpURLConnection.getNewHttpClient(HttpURLConnection.java:995)
	at sun.net.www.protocol.http.HttpURLConnection.plainConnect(HttpURLConnection.java:931)
	at sun.net.www.protocol.http.HttpURLConnection.connect(HttpURLConnection.java:849)
	at sun.net.www.protocol.http.HttpURLConnection.getOutputStream(HttpURLConnection.java:1090)
	at org.apache.qpid.systest.rest.RestTestHelper.writeJsonRequest(RestTestHelper.java:234)
	at org.apache.qpid.systest.rest.RestTestHelper.submitRequest(RestTestHelper.java:508)
	at org.apache.qpid.systest.rest.RestTestHelper.submitRequest(RestTestHelper.java:522)
	at org.apache.qpid.server.store.berkeleydb.replication.BDBHAVirtualHostNodeRestTest.createHANode(BDBHAVirtualHostNodeRestTest.java:317)
	at org.apache.qpid.server.store.berkeleydb.replication.BDBHAVirtualHostNodeRestTest.testIntruderProtection(BDBHAVirtualHostNodeRestTest.java:252)

testDeleteMasterNode(org.apache.qpid.server.store.berkeleydb.replication.BDBHAVirtualHostNodeRestTest)
 Time elapsed: 0.035 sec  <<< ERROR!
java.net.ConnectException: Connection refused
	at java.net.PlainSocketImpl.socketConnect(Native Method)
	at java.net.AbstractPlainSocketImpl.doConnect(AbstractPlainSocketImpl.java:339)
	at java.net.AbstractPlainSocketImpl.connectToAddress(AbstractPlainSocketImpl.java:200)
	at java.net.AbstractPlainSocketImpl.connect(AbstractPlainSocketImpl.java:182)
	at java.net.SocksSocketImpl.connect(SocksSocketImpl.java:392)
	at java.net.Socket.connect(Socket.java:579)
	at sun.net.NetworkClient.doConnect(NetworkClient.java:175)
	at sun.net.www.http.HttpClient.openServer(HttpClient.java:378)
	at sun.net.www.http.HttpClient.openServer(HttpClient.java:473)
	at sun.net.www.http.HttpClient.<init>(HttpClient.java:203)
	at sun.net.www.http.HttpClient.New(HttpClient.java:290)
	at sun.net.www.http.HttpClient.New(HttpClient.java:306)
	at sun.net.www.protocol.http.HttpURLConnection.getNewHttpClient(HttpURLConnection.java:995)
	at sun.net.www.protocol.http.HttpURLConnection.plainConnect(HttpURLConnection.java:931)
	at sun.net.www.protocol.http.HttpURLConnection.connect(HttpURLConnection.java:849)
	at sun.net.www.protocol.http.HttpURLConnection.getOutputStream(HttpURLConnection.java:1090)
	at org.apache.qpid.systest.rest.RestTestHelper.writeJsonRequest(RestTestHelper.java:234)
	at org.apache.qpid.systest.rest.RestTestHelper.submitRequest(RestTestHelper.java:508)
	at org.apache.qpid.systest.rest.RestTestHelper.submitRequest(RestTestHelper.java:522)
	at org.apache.qpid.server.store.berkeleydb.replication.BDBHAVirtualHostNodeRestTest.createHANode(BDBHAVirtualHostNodeRestTest.java:317)
	at org.apache.qpid.server.store.berkeleydb.replication.BDBHAVirtualHostNodeRestTest.testDeleteMasterNode(BDBHAVirtualHostNodeRestTest.java:192)

testCreate3NodeGroup(org.apache.qpid.server.store.berkeleydb.replication.BDBHAVirtualHostNodeRestTest)
 Time elapsed: 0.035 sec  <<< ERROR!
java.net.ConnectException: Connection refused
	at java.net.PlainSocketImpl.socketConnect(Native Method)
	at java.net.AbstractPlainSocketImpl.doConnect(AbstractPlainSocketImpl.java:339)
	at java.net.AbstractPlainSocketImpl.connectToAddress(AbstractPlainSocketImpl.java:200)
	at java.net.AbstractPlainSocketImpl.connect(AbstractPlainSocketImpl.java:182)
	at java.net.SocksSocketImpl.connect(SocksSocketImpl.java:392)
	at java.net.Socket.connect(Socket.java:579)
	at sun.net.NetworkClient.doConnect(NetworkClient.java:175)
	at sun.net.www.http.HttpClient.openServer(HttpClient.java:378)
	at sun.net.www.http.HttpClient.openServer(HttpClient.java:473)
	at sun.net.www.http.HttpClient.<init>(HttpClient.java:203)
	at sun.net.www.http.HttpClient.New(HttpClient.java:290)
	at sun.net.www.http.HttpClient.New(HttpClient.java:306)
	at sun.net.www.protocol.http.HttpURLConnection.getNewHttpClient(HttpURLConnection.java:995)
	at sun.net.www.protocol.http.HttpURLConnection.plainConnect(HttpURLConnection.java:931)
	at sun.net.www.protocol.http.HttpURLConnection.connect(HttpURLConnection.java:849)
	at sun.net.www.protocol.http.HttpURLConnection.getOutputStream(HttpURLConnection.java:1090)
	at org.apache.qpid.systest.rest.RestTestHelper.writeJsonRequest(RestTestHelper.java:234)
	at org.apache.qpid.systest.rest.RestTestHelper.submitRequest(RestTestHelper.java:508)
	at org.apache.qpid.systest.rest.RestTestHelper.submitRequest(RestTestHelper.java:522)
	at org.apache.qpid.server.store.berkeleydb.replication.BDBHAVirtualHostNodeRestTest.createHANode(BDBHAVirtualHostNodeRestTest.java:317)
	at org.apache.qpid.server.store.berkeleydb.replication.BDBHAVirtualHostNodeRestTest.testCreate3NodeGroup(BDBHAVirtualHostNodeRestTest.java:92)

testDeleteReplicaNode(org.apache.qpid.server.store.berkeleydb.replication.BDBHAVirtualHostNodeRestTest)
 Time elapsed: 0.032 sec  <<< ERROR!
java.net.ConnectException: Connection refused
	at java.net.PlainSocketImpl.socketConnect(Native Method)
	at java.net.AbstractPlainSocketImpl.doConnect(AbstractPlainSocketImpl.java:339)
	at java.net.AbstractPlainSocketImpl.connectToAddress(AbstractPlainSocketImpl.java:200)
	at java.net.AbstractPlainSocketImpl.connect(AbstractPlainSocketImpl.java:182)
	at java.net.SocksSocketImpl.connect(SocksSocketImpl.java:392)
	at java.net.Socket.connect(Socket.java:579)
	at sun.net.NetworkClient.doConnect(NetworkClient.java:175)
	at sun.net.www.http.HttpClient.openServer(HttpClient.java:378)
	at sun.net.www.http.HttpClient.openServer(HttpClient.java:473)
	at sun.net.www.http.HttpClient.<init>(HttpClient.java:203)
	at sun.net.www.http.HttpClient.New(HttpClient.java:290)
	at sun.net.www.http.HttpClient.New(HttpClient.java:306)
	at sun.net.www.protocol.http.HttpURLConnection.getNewHttpClient(HttpURLConnection.java:995)
	at sun.net.www.protocol.http.HttpURLConnection.plainConnect(HttpURLConnection.java:931)
	at sun.net.www.protocol.http.HttpURLConnection.connect(HttpURLConnection.java:849)
	at sun.net.www.protocol.http.HttpURLConnection.getOutputStream(HttpURLConnection.java:1090)
	at org.apache.qpid.systest.rest.RestTestHelper.writeJsonRequest(RestTestHelper.java:234)
	at org.apache.qpid.systest.rest.RestTestHelper.submitRequest(RestTestHelper.java:508)
	at org.apache.qpid.systest.rest.RestTestHelper.submitRequest(RestTestHelper.java:522)
	at org.apache.qpid.server.store.berkeleydb.replication.BDBHAVirtualHostNodeRestTest.createHANode(BDBHAVirtualHostNodeRestTest.java:317)
	at org.apache.qpid.server.store.berkeleydb.replication.BDBHAVirtualHostNodeRestTest.testDeleteReplicaNode(BDBHAVirtualHostNodeRestTest.java:166)

testIntruderBDBHAVHNNotAllowedToConnect(org.apache.qpid.server.store.berkeleydb.replication.BDBHAVirtualHostNodeRestTest)
 Time elapsed: 0.037 sec  <<< ERROR!
java.net.ConnectException: Connection refused
	at java.net.PlainSocketImpl.socketConnect(Native Method)
	at java.net.AbstractPlainSocketImpl.doConnect(AbstractPlainSocketImpl.java:339)
	at java.net.AbstractPlainSocketImpl.connectToAddress(AbstractPlainSocketImpl.java:200)
	at java.net.AbstractPlainSocketImpl.connect(AbstractPlainSocketImpl.java:182)
	at java.net.SocksSocketImpl.connect(SocksSocketImpl.java:392)
	at java.net.Socket.connect(Socket.java:579)
	at sun.net.NetworkClient.doConnect(NetworkClient.java:175)
	at sun.net.www.http.HttpClient.openServer(HttpClient.java:378)
	at sun.net.www.http.HttpClient.openServer(HttpClient.java:473)
	at sun.net.www.http.HttpClient.<init>(HttpClient.java:203)
	at sun.net.www.http.HttpClient.New(HttpClient.java:290)
	at sun.net.www.http.HttpClient.New(HttpClient.java:306)
	at sun.net.www.protocol.http.HttpURLConnection.getNewHttpClient(HttpURLConnection.java:995)
	at sun.net.www.protocol.http.HttpURLConnection.plainConnect(HttpURLConnection.java:931)
	at sun.net.www.protocol.http.HttpURLConnection.connect(HttpURLConnection.java:849)
	at sun.net.www.protocol.http.HttpURLConnection.getOutputStream(HttpURLConnection.java:1090)
	at org.apache.qpid.systest.rest.RestTestHelper.writeJsonRequest(RestTestHelper.java:234)
	at org.apache.qpid.systest.rest.RestTestHelper.submitRequest(RestTestHelper.java:508)
	at org.apache.qpid.systest.rest.RestTestHelper.submitRequest(RestTestHelper.java:522)
	at org.apache.qpid.server.store.berkeleydb.replication.BDBHAVirtualHostNodeRestTest.createHANode(BDBHAVirtualHostNodeRestTest.java:317)
	at org.apache.qpid.server.store.berkeleydb.replication.BDBHAVirtualHostNodeRestTest.testIntruderBDBHAVHNNotAllowedToConnect(BDBHAVirtualHostNodeRestTest.java:232)

Running org.apache.qpid.server.store.berkeleydb.BDBBackupTest
main 2014-11-22 03:28:39,998 INFO [qpid.test.utils.QpidTestCase] Test: testBackupAndRestoreMaintainsMessages
is excluded
Tests run: 0, Failures: 0, Errors: 0, Skipped: 0, Time elapsed: 0.001 sec - in org.apache.qpid.server.store.berkeleydb.BDBBackupTest

Results :

Failed tests: 
  TwoNodeTest>QpidTestCase.run:148->QpidBrokerTestCase.runBare:312->setUp:54 null
  TwoNodeTest>QpidTestCase.run:148->QpidBrokerTestCase.runBare:312->setUp:54 null
  TwoNodeTest>QpidTestCase.run:148->QpidBrokerTestCase.runBare:312->setUp:54 null
  TwoNodeTest>QpidTestCase.run:148->QpidBrokerTestCase.runBare:312->setUp:54 null
  TwoNodeTest>QpidTestCase.run:148->QpidBrokerTestCase.runBare:312->setUp:54 null
  TwoNodeTest>QpidTestCase.run:148->QpidBrokerTestCase.runBare:312->setUp:54 null
  TwoNodeTest>QpidTestCase.run:148->QpidBrokerTestCase.runBare:312->setUp:54 null
  MultiNodeTest>QpidTestCase.run:148->QpidBrokerTestCase.runBare:312->setUp:80 null
  MultiNodeTest>QpidTestCase.run:148->QpidBrokerTestCase.runBare:312->setUp:80 null
  MultiNodeTest>QpidTestCase.run:148->QpidBrokerTestCase.runBare:312->setUp:80 null
  MultiNodeTest>QpidTestCase.run:148->QpidBrokerTestCase.runBare:312->setUp:80 null
  MultiNodeTest>QpidTestCase.run:148->QpidBrokerTestCase.runBare:312->setUp:80 null
  MultiNodeTest>QpidTestCase.run:148->QpidBrokerTestCase.runBare:312->setUp:80 null
  MultiNodeTest>QpidTestCase.run:148->QpidBrokerTestCase.runBare:312->setUp:80 null
  MultiNodeTest>QpidTestCase.run:148->QpidBrokerTestCase.runBare:312->setUp:80 null
  MultiNodeTest>QpidTestCase.run:148->QpidBrokerTestCase.runBare:312->setUp:80 null
  MultiNodeTest>QpidTestCase.run:148->QpidBrokerTestCase.runBare:312->setUp:80 null

Tests in error: 
  JMXManagementTest>QpidTestCase.run:148->QpidBrokerTestCase.runBare:312->testRemoveRemoteNodeFromGroup:163->getStoreBeanForNodeAtBrokerPort:275
» IO
  JMXManagementTest>QpidTestCase.run:148->QpidBrokerTestCase.runBare:312->testVirtualHostOperationsDeniedForNonMasterNode:186->getManagedBrokerBeanForNodeAtBrokerPort:282
» IO
  JMXManagementTest>QpidTestCase.run:148->QpidBrokerTestCase.runBare:312->testStateOfNonActiveBrokerIsNotMaster:132->getStoreBeanForNodeAtBrokerPort:275
» IO
  JMXManagementTest>QpidTestCase.run:148->QpidBrokerTestCase.runBare:312->testStateOfActiveBrokerIsMaster:124->getStoreBeanForNodeAtBrokerPort:275
» IO
  JMXManagementTest>QpidTestCase.run:148->QpidBrokerTestCase.runBare:312->testVirtualHostMbeanOnMasterTransfer:224->getManagedBrokerBeanForNodeAtBrokerPort:282
» IO
  JMXManagementTest>QpidTestCase.run:148->QpidBrokerTestCase.runBare:312->testGroupMembers:141->getStoreBeanForNodeAtBrokerPort:275
» IO
  JMXManagementTest>QpidTestCase.run:148->QpidBrokerTestCase.runBare:312->testReadonlyMBeanAttributes:110->getStoreBeanForNodeAtBrokerPort:275
» IO
  BDBHAVirtualHostRestTest>QpidTestCase.run:148->QpidBrokerTestCase.runBare:312->testSetLocalTransactionSynchronizationPolicy:116->QpidRestTestCase.waitForAttributeChanged:114
» Connect
  BDBHAVirtualHostRestTest>QpidTestCase.run:148->QpidBrokerTestCase.runBare:312->testMutateState:140->QpidRestTestCase.waitForAttributeChanged:114
» Connect
  BDBHAVirtualHostRestTest>QpidTestCase.run:148->QpidBrokerTestCase.runBare:312->testSetRemoteTransactionSynchronizationPolicy:128->QpidRestTestCase.waitForAttributeChanged:114
» Connect
  BDBHAVirtualHostNodeRestTest>QpidTestCase.run:148->QpidBrokerTestCase.runBare:312->testNewMasterElectedWhenVirtualHostIsStopped:135->createHANode:317
» Connect
  BDBHAVirtualHostNodeRestTest>QpidTestCase.run:148->QpidBrokerTestCase.runBare:312->testMutateStateOfOneNode:103->createHANode:317
» Connect
  BDBHAVirtualHostNodeRestTest>QpidTestCase.run:148->QpidBrokerTestCase.runBare:312->testIntruderProtection:252->createHANode:317
» Connect
  BDBHAVirtualHostNodeRestTest>QpidTestCase.run:148->QpidBrokerTestCase.runBare:312->testDeleteMasterNode:192->createHANode:317
» Connect
  BDBHAVirtualHostNodeRestTest>QpidTestCase.run:148->QpidBrokerTestCase.runBare:312->testCreate3NodeGroup:92->createHANode:317
» Connect
  BDBHAVirtualHostNodeRestTest>QpidTestCase.run:148->QpidBrokerTestCase.runBare:312->testDeleteReplicaNode:166->createHANode:317
» Connect
  BDBHAVirtualHostNodeRestTest>QpidTestCase.run:148->QpidBrokerTestCase.runBare:312->testIntruderBDBHAVHNNotAllowedToConnect:232->createHANode:317
» Connect

Tests run: 42, Failures: 17, Errors: 17, Skipped: 0

[INFO] ------------------------------------------------------------------------
[INFO] Reactor Summary:
[INFO] 
[INFO] Qpid Java Build ................................... SUCCESS [2.201s]
[INFO] Qpid AMQP 1.0 Common .............................. SUCCESS [5.059s]
[INFO] Qpid AMQP 1.0 Client .............................. SUCCESS [0.741s]
[INFO] Qpid AMQP 1.0 Client JMS .......................... SUCCESS [1.523s]
[INFO] Qpid AMQP 1.0 JMS Client Examples ................. SUCCESS [0.213s]
[INFO] Qpid AMQP 1.0 Client WebSocket .................... SUCCESS [0.529s]
[INFO] Qpid Broker Code Generation ....................... SUCCESS [0.292s]
[INFO] Qpid Test Utilities ............................... SUCCESS [0.230s]
[INFO] Qpid Common ....................................... SUCCESS [27.594s]
[INFO] Qpid Management Common ............................ SUCCESS [1.096s]
[INFO] Qpid Java Broker Core ............................. SUCCESS [1:20.566s]
[INFO] Qpid Access Control Broker Plug-in ................ SUCCESS [4.125s]
[INFO] Qpid AMQP 0-8 Protocol Broker Plug-in ............. SUCCESS [20.499s]
[INFO] Qpid AMQP 0-10 Protocol Plug-in ................... SUCCESS [4.268s]
[INFO] Qpid AMQP 1-0 Protocol Broker Plug-in ............. SUCCESS [0.491s]
[INFO] Qpid AMQP 0-8 to 0-10 Message Conversion Broker Plug-in  SUCCESS [0.235s]
[INFO] Qpid AMQP 0-8 to 1-0 Message Conversion Broker Plug-in  SUCCESS [0.218s]
[INFO] Qpid AMQP 0-10 to 1-0 Message Conversion Broker Plug-in  SUCCESS [0.243s]
[INFO] Qpid Derby Message Store .......................... SUCCESS [15.693s]
[INFO] Qpid JDBC Message Store Connection Pooling Plug-in  SUCCESS [0.537s]
[INFO] Qpid JDBC Message Store Broker Plug-in ............ SUCCESS [8.895s]
[INFO] Qpid HTTP Management Broker Plug-in ............... SUCCESS [4.711s]
[INFO] Qpid JMX Management Broker Plug-in ................ SUCCESS [3.215s]
[INFO] Qpid Memory Message Store Broker Plug-in .......... SUCCESS [0.394s]
[INFO] Qpid WebSocket Broker Plug-in ..................... SUCCESS [0.249s]
[INFO] Qpid AMQP 0-x JMS Client .......................... SUCCESS [6.167s]
[INFO] Qpid BDB Message Store ............................ SUCCESS [2:15.050s]
[INFO] Qpid BDB Message Store JMX ........................ SUCCESS [1.983s]
[INFO] Qpid Java Broker .................................. SUCCESS [4.986s]
[INFO] Qpid AMQP Management Protocol Broker Plug-in ...... SUCCESS [0.248s]
[INFO] Qpid AMQP 0-x JMS Client Examples ................. SUCCESS [0.148s]
[INFO] Qpid JCA .......................................... SUCCESS [1.544s]
[INFO] Qpid Resource Adaptor ............................. SUCCESS [0.370s]
[INFO] Qpid Tools ........................................ SUCCESS [0.343s]
[INFO] Qpid Management Examples .......................... SUCCESS [0.140s]
[INFO] Qpid Java System Test Parent ...................... SUCCESS [0.711s]
[INFO] Qpid System Tests ................................. SUCCESS [7:54.827s]
[INFO] Qpid Performance Tests ............................ SUCCESS [12.979s]
[INFO] Qpid Performance Test System Tests ................ SUCCESS [16.233s]
[INFO] Qpid Performance Tests Visualisation JFC .......... SUCCESS [3.841s]
[INFO] Qpid BDB Store System Tests ....................... FAILURE [5.293s]
[INFO] ------------------------------------------------------------------------
[INFO] BUILD FAILURE
[INFO] ------------------------------------------------------------------------
[INFO] Total time: 14:09.726s
[INFO] Finished at: Sat Nov 22 03:28:40 UTC 2014
[INFO] Final Memory: 73M/319M
[INFO] ------------------------------------------------------------------------
[ERROR] Failed to execute goal org.apache.maven.plugins:maven-surefire-plugin:2.16:test (integration-test)
on project qpid-bdbstore-systests: There are test failures.
[ERROR] 
[ERROR] Please refer to <https://builds.apache.org/job/Qpid-Java-Cpp-Test/ws/trunk/qpid/java/bdbstore/systests/target/surefire-reports>
for the individual test results.
[ERROR] -> [Help 1]
[ERROR] 
[ERROR] To see the full stack trace of the errors, re-run Maven with the -e switch.
[ERROR] Re-run Maven using the -X switch to enable full debug logging.
[ERROR] 
[ERROR] For more information about the errors and possible solutions, please read the following
articles:
[ERROR] [Help 1] http://cwiki.apache.org/confluence/display/MAVEN/MojoFailureException
[ERROR] 
[ERROR] After correcting the problems, you can resume the build with the command
[ERROR]   mvn <goals> -rf :qpid-bdbstore-systests
Build step 'Invoke top-level Maven targets' marked build as failure
[locks-and-latches] Releasing all the locks
[locks-and-latches] All the locks released
Recording test results

Mime
View raw message