qpid-notifications mailing list archives

Site index · List index
Message view « Date » · « Thread »
Top « Date » · « Thread »
From Apache Jenkins Server <jenk...@builds.apache.org>
Subject Build failed in Jenkins: Qpid-Java-Cpp-Test #2271
Date Thu, 06 Nov 2014 15:20:06 GMT
See <https://builds.apache.org/job/Qpid-Java-Cpp-Test/2271/changes>

Changes:

[jross] QPID-6203: Prevent broker startup when invalid directory is passed to --sasl-config;
this is a patch from Ernie Allen

[kwall] NO-JIRA: [Java Tests] MultiNodeTest - restore thread name after starting a JE ReplicationEnvironment
to avoid confusing thread names on subsequent tests

[kwall] QPID-6125: [Java Broker] Partial revert so that closeConnection will once again await
for an already closing connection to become closed

[kwall] QPID-6216: [Java Broker] HA: On conditions causing environment restart, notify the
BDBHAVHN as early as possible that it is no longer master

------------------------------------------
[...truncated 16172 lines...]
[INFO] skip non existing resourceDirectory <https://builds.apache.org/job/Qpid-Java-Cpp-Test/ws/trunk/qpid/java/perftests/visualisation-jfc/src/main/resources>
[INFO] Copying 0 resource
[INFO] Copying 3 resources
[INFO] 
[INFO] --- maven-compiler-plugin:3.1:compile (default-compile) @ qpid-perftests-visualisation-jfc
---
[INFO] Changes detected - recompiling the module!
[INFO] Compiling 30 source files to <https://builds.apache.org/job/Qpid-Java-Cpp-Test/ws/trunk/qpid/java/perftests/visualisation-jfc/target/classes>
[INFO] 
[INFO] --- maven-resources-plugin:2.6:testResources (default-testResources) @ qpid-perftests-visualisation-jfc
---
[INFO] Using 'UTF-8' encoding to copy filtered resources.
[INFO] Copying 1 resource
[INFO] skip non existing resourceDirectory <https://builds.apache.org/job/Qpid-Java-Cpp-Test/ws/trunk/qpid/java/perftests/visualisation-jfc/src/test/resources>
[INFO] Copying 3 resources
[INFO] 
[INFO] --- maven-compiler-plugin:3.1:testCompile (default-testCompile) @ qpid-perftests-visualisation-jfc
---
[INFO] Changes detected - recompiling the module!
[INFO] Compiling 11 source files to <https://builds.apache.org/job/Qpid-Java-Cpp-Test/ws/trunk/qpid/java/perftests/visualisation-jfc/target/test-classes>
[INFO] 
[INFO] --- maven-surefire-plugin:2.16:test (default-test) @ qpid-perftests-visualisation-jfc
---
[INFO] Surefire report directory: <https://builds.apache.org/job/Qpid-Java-Cpp-Test/ws/trunk/qpid/java/perftests/visualisation-jfc/target/surefire-reports>

-------------------------------------------------------
 T E S T S
-------------------------------------------------------
Running org.apache.qpid.disttest.charting.chartbuilder.TimeSeriesBuilderCallbackTest
main 2014-11-06 15:19:28,053 INFO [qpid.test.utils.QpidTestCase] Some tests should be excluded,
building the exclude list
main 2014-11-06 15:19:28,055 INFO [qpid.test.utils.QpidTestCase] Specified exclude file does
not exist: <https://builds.apache.org/job/Qpid-Java-Cpp-Test/ws/trunk/qpid/java/perftests/visualisation-jfc/../test-profiles//Excludes>
main 2014-11-06 15:19:28,055 INFO [qpid.test.utils.QpidTestCase] Specified exclude file does
not exist: <https://builds.apache.org/job/Qpid-Java-Cpp-Test/ws/trunk/qpid/java/perftests/visualisation-jfc/../test-profiles//CPPExcludes>
main 2014-11-06 15:19:28,055 INFO [qpid.test.utils.QpidTestCase] Specified exclude file does
not exist: <https://builds.apache.org/job/Qpid-Java-Cpp-Test/ws/trunk/qpid/java/perftests/visualisation-jfc/../test-profiles//cpp.excludes>
main 2014-11-06 15:19:28,055 INFO [qpid.test.utils.QpidTestCase] Specified exclude file does
not exist: <https://builds.apache.org/job/Qpid-Java-Cpp-Test/ws/trunk/qpid/java/perftests/visualisation-jfc/../test-profiles//CPPPrefetchExcludes>
main 2014-11-06 15:19:28,055 INFO [qpid.test.utils.QpidTestCase] Specified exclude file does
not exist: <https://builds.apache.org/job/Qpid-Java-Cpp-Test/ws/trunk/qpid/java/perftests/visualisation-jfc/../test-profiles//CPPTransientExcludes>
main 2014-11-06 15:19:28,055 INFO [qpid.test.utils.QpidTestCase] Specified exclude file does
not exist: <https://builds.apache.org/job/Qpid-Java-Cpp-Test/ws/trunk/qpid/java/perftests/visualisation-jfc/../test-profiles//cpp.excludes>
main 2014-11-06 15:19:28,068 INFO [qpid.test.utils.QpidTestCase] ========== start TimeSeriesBuilderCallbackTest.testAddPointToSeries
==========
main 2014-11-06 15:19:28,480 INFO [qpid.test.utils.QpidTestCase] ========== tearDown TimeSeriesBuilderCallbackTest.testAddPointToSeries
==========
Tests run: 1, Failures: 0, Errors: 0, Skipped: 0, Time elapsed: 0.715 sec - in org.apache.qpid.disttest.charting.chartbuilder.TimeSeriesBuilderCallbackTest
Running org.apache.qpid.disttest.charting.chartbuilder.ChartProductionTest
main 2014-11-06 15:19:28,525 INFO [qpid.test.utils.QpidTestCase] ========== start ChartProductionTest.testLine3DChart
==========
main 2014-11-06 15:19:28,534 INFO [disttest.charting.writer.ChartWriter] Set chart directory:
/tmp/charts-1415287168529
main 2014-11-06 15:19:29,757 INFO [disttest.charting.writer.ChartWriter] Written /tmp/charts-1415287168529/testLine3DChart.png
chart
main 2014-11-06 15:19:29,757 INFO [qpid.test.utils.QpidTestCase] ========== tearDown ChartProductionTest.testLine3DChart
==========
main 2014-11-06 15:19:29,757 INFO [qpid.test.utils.QpidTestCase] ========== start ChartProductionTest.testXYLineChart
==========
main 2014-11-06 15:19:29,758 INFO [disttest.charting.writer.ChartWriter] Set chart directory:
/tmp/charts-1415287169758
main 2014-11-06 15:19:29,887 INFO [disttest.charting.writer.ChartWriter] Written /tmp/charts-1415287169758/testXYLineChart.png
chart
main 2014-11-06 15:19:29,887 INFO [qpid.test.utils.QpidTestCase] ========== tearDown ChartProductionTest.testXYLineChart
==========
main 2014-11-06 15:19:29,888 INFO [qpid.test.utils.QpidTestCase] ========== start ChartProductionTest.testStatisticalBarChart
==========
main 2014-11-06 15:19:29,888 INFO [disttest.charting.writer.ChartWriter] Set chart directory:
/tmp/charts-1415287169888
main 2014-11-06 15:19:29,989 INFO [disttest.charting.writer.ChartWriter] Written /tmp/charts-1415287169888/testStatisticalBarChart.png
chart
main 2014-11-06 15:19:29,989 INFO [qpid.test.utils.QpidTestCase] ========== tearDown ChartProductionTest.testStatisticalBarChart
==========
main 2014-11-06 15:19:29,990 INFO [qpid.test.utils.QpidTestCase] ========== start ChartProductionTest.testLineChart
==========
main 2014-11-06 15:19:29,991 INFO [disttest.charting.writer.ChartWriter] Set chart directory:
/tmp/charts-1415287169990
main 2014-11-06 15:19:30,068 INFO [disttest.charting.writer.ChartWriter] Written /tmp/charts-1415287169990/testLineChart.png
chart
main 2014-11-06 15:19:30,068 INFO [qpid.test.utils.QpidTestCase] ========== tearDown ChartProductionTest.testLineChart
==========
main 2014-11-06 15:19:30,069 INFO [qpid.test.utils.QpidTestCase] ========== start ChartProductionTest.testBarChart
==========
main 2014-11-06 15:19:30,070 INFO [disttest.charting.writer.ChartWriter] Set chart directory:
/tmp/charts-1415287170069
main 2014-11-06 15:19:30,148 INFO [disttest.charting.writer.ChartWriter] Written /tmp/charts-1415287170069/testBarChart.png
chart
main 2014-11-06 15:19:30,148 INFO [qpid.test.utils.QpidTestCase] ========== tearDown ChartProductionTest.testBarChart
==========
main 2014-11-06 15:19:30,148 INFO [qpid.test.utils.QpidTestCase] ========== start ChartProductionTest.testBar3DChart
==========
main 2014-11-06 15:19:30,149 INFO [disttest.charting.writer.ChartWriter] Set chart directory:
/tmp/charts-1415287170149
main 2014-11-06 15:19:30,225 INFO [disttest.charting.writer.ChartWriter] Written /tmp/charts-1415287170149/testBar3DChart.png
chart
main 2014-11-06 15:19:30,225 INFO [qpid.test.utils.QpidTestCase] ========== tearDown ChartProductionTest.testBar3DChart
==========
main 2014-11-06 15:19:30,226 INFO [qpid.test.utils.QpidTestCase] ========== start ChartProductionTest.testTimeSeriesLineChart
==========
main 2014-11-06 15:19:30,226 INFO [disttest.charting.writer.ChartWriter] Set chart directory:
/tmp/charts-1415287170226
main 2014-11-06 15:19:30,327 INFO [disttest.charting.writer.ChartWriter] Written /tmp/charts-1415287170226/testTimeSeriesLineChart.png
chart
main 2014-11-06 15:19:30,327 INFO [qpid.test.utils.QpidTestCase] ========== tearDown ChartProductionTest.testTimeSeriesLineChart
==========
main 2014-11-06 15:19:30,327 INFO [qpid.test.utils.QpidTestCase] ========== start ChartProductionTest.testXYLineChartWithColourAndWidth
==========
main 2014-11-06 15:19:30,328 INFO [disttest.charting.writer.ChartWriter] Set chart directory:
/tmp/charts-1415287170328
main 2014-11-06 15:19:30,419 INFO [disttest.charting.writer.ChartWriter] Written /tmp/charts-1415287170328/testXYLineChartWithColourAndWidth.png
chart
main 2014-11-06 15:19:30,419 INFO [qpid.test.utils.QpidTestCase] ========== tearDown ChartProductionTest.testXYLineChartWithColourAndWidth
==========
Tests run: 8, Failures: 0, Errors: 0, Skipped: 0, Time elapsed: 1.937 sec - in org.apache.qpid.disttest.charting.chartbuilder.ChartProductionTest
Running org.apache.qpid.disttest.charting.chartbuilder.ChartBuilderFactoryTest
main 2014-11-06 15:19:30,429 INFO [qpid.test.utils.QpidTestCase] ========== start ChartBuilderFactoryTest.testXYLineChart
==========
main 2014-11-06 15:19:30,429 INFO [qpid.test.utils.QpidTestCase] ========== tearDown ChartBuilderFactoryTest.testXYLineChart
==========
main 2014-11-06 15:19:30,430 INFO [qpid.test.utils.QpidTestCase] ========== start ChartBuilderFactoryTest.testLineChart
==========
main 2014-11-06 15:19:30,430 INFO [qpid.test.utils.QpidTestCase] ========== tearDown ChartBuilderFactoryTest.testLineChart
==========
main 2014-11-06 15:19:30,430 INFO [qpid.test.utils.QpidTestCase] ========== start ChartBuilderFactoryTest.testBarChart
==========
main 2014-11-06 15:19:30,430 INFO [qpid.test.utils.QpidTestCase] ========== tearDown ChartBuilderFactoryTest.testBarChart
==========
main 2014-11-06 15:19:30,431 INFO [qpid.test.utils.QpidTestCase] ========== start ChartBuilderFactoryTest.testTimeSeriesLineChart
==========
main 2014-11-06 15:19:30,431 INFO [qpid.test.utils.QpidTestCase] ========== tearDown ChartBuilderFactoryTest.testTimeSeriesLineChart
==========
main 2014-11-06 15:19:30,431 INFO [qpid.test.utils.QpidTestCase] ========== start ChartBuilderFactoryTest.testLineChart3D
==========
main 2014-11-06 15:19:30,431 INFO [qpid.test.utils.QpidTestCase] ========== tearDown ChartBuilderFactoryTest.testLineChart3D
==========
main 2014-11-06 15:19:30,431 INFO [qpid.test.utils.QpidTestCase] ========== start ChartBuilderFactoryTest.testBarChart3D
==========
main 2014-11-06 15:19:30,431 INFO [qpid.test.utils.QpidTestCase] ========== tearDown ChartBuilderFactoryTest.testBarChart3D
==========
Tests run: 6, Failures: 0, Errors: 0, Skipped: 0, Time elapsed: 0.012 sec - in org.apache.qpid.disttest.charting.chartbuilder.ChartBuilderFactoryTest
Running org.apache.qpid.disttest.charting.chartbuilder.BaseChartBuilderTest
main 2014-11-06 15:19:30,475 INFO [qpid.test.utils.QpidTestCase] ========== start BaseChartBuilderTest.testBuildChart
==========
main 2014-11-06 15:19:30,490 INFO [qpid.test.utils.QpidTestCase] ========== tearDown BaseChartBuilderTest.testBuildChart
==========
Tests run: 1, Failures: 0, Errors: 0, Skipped: 0, Time elapsed: 0.057 sec - in org.apache.qpid.disttest.charting.chartbuilder.BaseChartBuilderTest
Running org.apache.qpid.disttest.charting.chartbuilder.ColorFactoryTest
main 2014-11-06 15:19:30,491 INFO [qpid.test.utils.QpidTestCase] ========== start ColorFactoryTest.testDarkBlue
==========
main 2014-11-06 15:19:30,492 INFO [qpid.test.utils.QpidTestCase] ========== tearDown ColorFactoryTest.testDarkBlue
==========
main 2014-11-06 15:19:30,492 INFO [qpid.test.utils.QpidTestCase] ========== start ColorFactoryTest.testBlue
==========
main 2014-11-06 15:19:30,492 INFO [qpid.test.utils.QpidTestCase] ========== tearDown ColorFactoryTest.testBlue
==========
Tests run: 2, Failures: 0, Errors: 0, Skipped: 0, Time elapsed: 0.001 sec - in org.apache.qpid.disttest.charting.chartbuilder.ColorFactoryTest
Running org.apache.qpid.disttest.charting.writer.ChartWriterTest
main 2014-11-06 15:19:30,511 INFO [disttest.charting.writer.ChartWriter] Set chart directory:
/tmp/TestFileUtils-testDir-1415287170511
main 2014-11-06 15:19:30,588 INFO [disttest.charting.writer.ChartWriter] Written /tmp/TestFileUtils-testDir-1415287170511/chart1.png
chart
main 2014-11-06 15:19:30,588 INFO [disttest.charting.writer.ChartWriter] Only 1 chart image(s)
have been written so no HTML summary file will be produced
main 2014-11-06 15:19:30,588 INFO [qpid.test.utils.QpidTestCase] ========== tearDown null
==========
main 2014-11-06 15:19:30,590 INFO [disttest.charting.writer.ChartWriter] Set chart directory:
/tmp/TestFileUtils-testDir-1415287170590
main 2014-11-06 15:19:30,657 INFO [disttest.charting.writer.ChartWriter] Written /tmp/TestFileUtils-testDir-1415287170590/chart1.png
chart
main 2014-11-06 15:19:30,658 INFO [qpid.test.utils.QpidTestCase] ========== tearDown null
==========
main 2014-11-06 15:19:30,659 INFO [disttest.charting.writer.ChartWriter] Set chart directory:
/tmp/TestFileUtils-testDir-1415287170658
main 2014-11-06 15:19:30,727 INFO [disttest.charting.writer.ChartWriter] Written /tmp/TestFileUtils-testDir-1415287170658/chart2.png
chart
main 2014-11-06 15:19:30,794 INFO [disttest.charting.writer.ChartWriter] Written /tmp/TestFileUtils-testDir-1415287170658/chart1.png
chart
main 2014-11-06 15:19:30,796 DEBUG [disttest.charting.writer.ChartWriter] About to produce
HTML summary file /tmp/TestFileUtils-testDir-1415287170658/chart-summary.html from charts
{/tmp/TestFileUtils-testDir-1415287170658/chart1.png=Mock for ChartingDefinition, hashCode:
16054967, /tmp/TestFileUtils-testDir-1415287170658/chart2.png=Mock for ChartingDefinition,
hashCode: 24654337}
main 2014-11-06 15:19:30,805 INFO [qpid.test.utils.QpidTestCase] ========== tearDown null
==========
Tests run: 3, Failures: 0, Errors: 0, Skipped: 0, Time elapsed: 0.312 sec - in org.apache.qpid.disttest.charting.writer.ChartWriterTest
Running org.apache.qpid.disttest.charting.seriesbuilder.JdbcSeriesBuilderTest
main 2014-11-06 15:19:30,807 INFO [qpid.test.utils.QpidTestCase] ========== start JdbcSeriesBuilderTest.testBuildOneSeries
==========
main 2014-11-06 15:19:30,848 INFO [disttest.charting.seriesbuilder.JdbcSeriesBuilder] Loaded
JDBC driver class org.relique.jdbc.csv.CsvDriver
main 2014-11-06 15:19:31,054 INFO [disttest.charting.seriesbuilder.JdbcSeriesBuilder] Created:
JdbcSeriesBuilder[jdbcUrlGenerator=JdbcUrlGenerator[providedJdbdUrl=<null>]]
main 2014-11-06 15:19:31,123 INFO [qpid.test.utils.QpidTestCase] ========== tearDown JdbcSeriesBuilderTest.testBuildOneSeries
==========
Tests run: 1, Failures: 0, Errors: 0, Skipped: 0, Time elapsed: 0.317 sec - in org.apache.qpid.disttest.charting.seriesbuilder.JdbcSeriesBuilderTest
Running org.apache.qpid.disttest.charting.seriesbuilder.SeriesRowTest
main 2014-11-06 15:19:31,124 INFO [qpid.test.utils.QpidTestCase] ========== start SeriesRowTest.testValidSeriesRowThrowsExceptionIfArrayTooSmall
==========
main 2014-11-06 15:19:31,125 INFO [qpid.test.utils.QpidTestCase] ========== tearDown SeriesRowTest.testValidSeriesRowThrowsExceptionIfArrayTooSmall
==========
main 2014-11-06 15:19:31,125 INFO [qpid.test.utils.QpidTestCase] ========== start SeriesRowTest.testDimension
==========
main 2014-11-06 15:19:31,125 INFO [qpid.test.utils.QpidTestCase] ========== tearDown SeriesRowTest.testDimension
==========
main 2014-11-06 15:19:31,125 INFO [qpid.test.utils.QpidTestCase] ========== start SeriesRowTest.testDimensionAsDouble
==========
main 2014-11-06 15:19:31,125 INFO [qpid.test.utils.QpidTestCase] ========== tearDown SeriesRowTest.testDimensionAsDouble
==========
main 2014-11-06 15:19:31,126 INFO [qpid.test.utils.QpidTestCase] ========== start SeriesRowTest.testDimensionAsString
==========
main 2014-11-06 15:19:31,126 INFO [qpid.test.utils.QpidTestCase] ========== tearDown SeriesRowTest.testDimensionAsString
==========
main 2014-11-06 15:19:31,126 INFO [qpid.test.utils.QpidTestCase] ========== start SeriesRowTest.testValidSeriesRow
==========
main 2014-11-06 15:19:31,126 INFO [qpid.test.utils.QpidTestCase] ========== tearDown SeriesRowTest.testValidSeriesRow
==========
Tests run: 5, Failures: 0, Errors: 0, Skipped: 0, Time elapsed: 0.003 sec - in org.apache.qpid.disttest.charting.seriesbuilder.SeriesRowTest
Running org.apache.qpid.disttest.charting.seriesbuilder.JdbcUrlGeneratorTest
main 2014-11-06 15:19:31,128 INFO [qpid.test.utils.QpidTestCase] ========== start JdbcUrlGeneratorTest.testGetJdbcUrlWithoutProvidingAUrlReturnsCsvUrlWithCorrectDirectory
==========
main 2014-11-06 15:19:31,128 INFO [qpid.test.utils.QpidTestCase] ========== tearDown JdbcUrlGeneratorTest.testGetJdbcUrlWithoutProvidingAUrlReturnsCsvUrlWithCorrectDirectory
==========
main 2014-11-06 15:19:31,128 INFO [qpid.test.utils.QpidTestCase] ========== start JdbcUrlGeneratorTest.testGetJdbcUrlThrowsExceptionWithoutAProvidedUrlOrSeriesDirectory
==========
main 2014-11-06 15:19:31,129 INFO [qpid.test.utils.QpidTestCase] ========== tearDown JdbcUrlGeneratorTest.testGetJdbcUrlThrowsExceptionWithoutAProvidedUrlOrSeriesDirectory
==========
main 2014-11-06 15:19:31,129 INFO [qpid.test.utils.QpidTestCase] ========== start JdbcUrlGeneratorTest.testGetJdbcUrlThrowsExceptionIfUrlProvidedAndSeriesDirectorySpecified
==========
main 2014-11-06 15:19:31,130 INFO [qpid.test.utils.QpidTestCase] ========== tearDown JdbcUrlGeneratorTest.testGetJdbcUrlThrowsExceptionIfUrlProvidedAndSeriesDirectorySpecified
==========
main 2014-11-06 15:19:31,130 INFO [qpid.test.utils.QpidTestCase] ========== start JdbcUrlGeneratorTest.testGetJdbcUrlReturnsProvidedUrl
==========
main 2014-11-06 15:19:31,130 INFO [qpid.test.utils.QpidTestCase] ========== tearDown JdbcUrlGeneratorTest.testGetJdbcUrlReturnsProvidedUrl
==========
Tests run: 4, Failures: 0, Errors: 0, Skipped: 0, Time elapsed: 0.003 sec - in org.apache.qpid.disttest.charting.seriesbuilder.JdbcUrlGeneratorTest
Running org.apache.qpid.disttest.charting.definition.SeriesDefinitionCreatorTest
main 2014-11-06 15:19:31,132 INFO [qpid.test.utils.QpidTestCase] ========== start SeriesDefinitionCreatorTest.testSeriesDirectoryAndNameSubstitution
==========
main 2014-11-06 15:19:31,133 INFO [qpid.test.utils.QpidTestCase] Set system property "SeriesDefinitionProp"
to: "propValue"
main 2014-11-06 15:19:31,140 INFO [qpid.test.utils.QpidTestCase] ========== tearDown SeriesDefinitionCreatorTest.testSeriesDirectoryAndNameSubstitution
==========
main 2014-11-06 15:19:31,140 DEBUG [qpid.test.utils.QpidTestCase] reverting 1 test properties
main 2014-11-06 15:19:31,141 INFO [qpid.test.utils.QpidTestCase] ========== start SeriesDefinitionCreatorTest.testTwoSeriesDefinitions
==========
main 2014-11-06 15:19:31,142 INFO [qpid.test.utils.QpidTestCase] ========== tearDown SeriesDefinitionCreatorTest.testTwoSeriesDefinitions
==========
main 2014-11-06 15:19:31,142 INFO [qpid.test.utils.QpidTestCase] ========== start SeriesDefinitionCreatorTest.testOneSeriesDefinition
==========
main 2014-11-06 15:19:31,143 INFO [qpid.test.utils.QpidTestCase] ========== tearDown SeriesDefinitionCreatorTest.testOneSeriesDefinition
==========
main 2014-11-06 15:19:31,143 INFO [qpid.test.utils.QpidTestCase] ========== start SeriesDefinitionCreatorTest.testNonSequentialSeriesDefinitionsIgnored
==========
main 2014-11-06 15:19:31,144 INFO [qpid.test.utils.QpidTestCase] ========== tearDown SeriesDefinitionCreatorTest.testNonSequentialSeriesDefinitionsIgnored
==========
Tests run: 4, Failures: 0, Errors: 0, Skipped: 0, Time elapsed: 0.013 sec - in org.apache.qpid.disttest.charting.definition.SeriesDefinitionCreatorTest
Running org.apache.qpid.disttest.charting.definition.ChartingDefinitionCreatorTest
main 2014-11-06 15:19:31,146 INFO [qpid.test.utils.QpidTestCase] ========== start ChartingDefinitionCreatorTest.testLoadTwoDefinitionsFromDirectory
==========
main 2014-11-06 15:19:31,153 INFO [qpid.test.utils.QpidTestCase] ========== tearDown ChartingDefinitionCreatorTest.testLoadTwoDefinitionsFromDirectory
==========
main 2014-11-06 15:19:31,153 INFO [qpid.test.utils.QpidTestCase] ========== start ChartingDefinitionCreatorTest.testLoadOneDefinitionFromFile
==========
main 2014-11-06 15:19:31,154 INFO [qpid.test.utils.QpidTestCase] ========== tearDown ChartingDefinitionCreatorTest.testLoadOneDefinitionFromFile
==========
main 2014-11-06 15:19:31,155 INFO [qpid.test.utils.QpidTestCase] ========== start ChartingDefinitionCreatorTest.testDefinitionsProperties
==========
main 2014-11-06 15:19:31,155 INFO [qpid.test.utils.QpidTestCase] Set system property "ChartingDefinitionSysProp"
to: "propValue"
main 2014-11-06 15:19:31,156 INFO [qpid.test.utils.QpidTestCase] ========== tearDown ChartingDefinitionCreatorTest.testDefinitionsProperties
==========
main 2014-11-06 15:19:31,156 DEBUG [qpid.test.utils.QpidTestCase] reverting 1 test properties
main 2014-11-06 15:19:31,156 INFO [qpid.test.utils.QpidTestCase] ========== start ChartingDefinitionCreatorTest.testDefinitionFileNotFound
==========
main 2014-11-06 15:19:31,157 INFO [qpid.test.utils.QpidTestCase] ========== tearDown ChartingDefinitionCreatorTest.testDefinitionFileNotFound
==========
Tests run: 4, Failures: 0, Errors: 0, Skipped: 0, Time elapsed: 0.013 sec - in org.apache.qpid.disttest.charting.definition.ChartingDefinitionCreatorTest

Results :

Tests run: 39, Failures: 0, Errors: 0, Skipped: 0

[INFO] 
[INFO] --- maven-jar-plugin:2.4:jar (default-jar) @ qpid-perftests-visualisation-jfc ---
[INFO] Building jar: <https://builds.apache.org/job/Qpid-Java-Cpp-Test/ws/trunk/qpid/java/perftests/visualisation-jfc/target/qpid-perftests-visualisation-jfc-0.32-SNAPSHOT.jar>
[INFO] 
[INFO] --- maven-site-plugin:3.3:attach-descriptor (attach-descriptor) @ qpid-perftests-visualisation-jfc
---
[INFO] 
[INFO] --- maven-antrun-plugin:1.7:run (create-qbtc-output-dir) @ qpid-perftests-visualisation-jfc
---
[INFO] Executing tasks

main:
    [mkdir] Created dir: <https://builds.apache.org/job/Qpid-Java-Cpp-Test/ws/trunk/qpid/java/perftests/visualisation-jfc/target/qbtc-output>
[INFO] Executed tasks
[INFO]                                                                         
[INFO] ------------------------------------------------------------------------
[INFO] Skipping Qpid BDB Store System Tests
[INFO] This project has been banned from the build due to previous failures.
[INFO] ------------------------------------------------------------------------
[INFO] ------------------------------------------------------------------------
[INFO] Reactor Summary:
[INFO] 
[INFO] Qpid Java Build ................................... SUCCESS [2.949s]
[INFO] Qpid AMQP 1.0 Common .............................. SUCCESS [5.323s]
[INFO] Qpid AMQP 1.0 Client .............................. SUCCESS [0.600s]
[INFO] Qpid AMQP 1.0 Client JMS .......................... SUCCESS [1.628s]
[INFO] Qpid AMQP 1.0 JMS Client Examples ................. SUCCESS [0.196s]
[INFO] Qpid AMQP 1.0 Client WebSocket .................... SUCCESS [0.667s]
[INFO] Qpid Broker Code Generation ....................... SUCCESS [0.308s]
[INFO] Qpid Test Utilities ............................... SUCCESS [0.287s]
[INFO] Qpid Common ....................................... SUCCESS [28.479s]
[INFO] Qpid Management Common ............................ SUCCESS [1.413s]
[INFO] Qpid Java Broker Core ............................. SUCCESS [1:21.980s]
[INFO] Qpid Access Control Broker Plug-in ................ SUCCESS [3.920s]
[INFO] Qpid AMQP 0-8 Protocol Broker Plug-in ............. SUCCESS [20.705s]
[INFO] Qpid AMQP 0-10 Protocol Plug-in ................... SUCCESS [4.260s]
[INFO] Qpid AMQP 1-0 Protocol Broker Plug-in ............. SUCCESS [0.595s]
[INFO] Qpid AMQP 0-8 to 0-10 Message Conversion Broker Plug-in  SUCCESS [0.286s]
[INFO] Qpid AMQP 0-8 to 1-0 Message Conversion Broker Plug-in  SUCCESS [0.269s]
[INFO] Qpid AMQP 0-10 to 1-0 Message Conversion Broker Plug-in  SUCCESS [0.297s]
[INFO] Qpid Derby Message Store .......................... SUCCESS [15.443s]
[INFO] Qpid JDBC Message Store Connection Pooling Plug-in  SUCCESS [0.501s]
[INFO] Qpid JDBC Message Store Broker Plug-in ............ SUCCESS [9.102s]
[INFO] Qpid HTTP Management Broker Plug-in ............... SUCCESS [5.420s]
[INFO] Qpid JMX Management Broker Plug-in ................ SUCCESS [3.429s]
[INFO] Qpid Memory Message Store Broker Plug-in .......... SUCCESS [0.417s]
[INFO] Qpid WebSocket Broker Plug-in ..................... SUCCESS [0.277s]
[INFO] Qpid AMQP 0-x JMS Client .......................... SUCCESS [6.479s]
[INFO] Qpid BDB Message Store ............................ SUCCESS [2:12.828s]
[INFO] Qpid BDB Message Store JMX ........................ SUCCESS [2.128s]
[INFO] Qpid Java Broker .................................. SUCCESS [5.300s]
[INFO] Qpid AMQP Management Protocol Broker Plug-in ...... SUCCESS [0.249s]
[INFO] Qpid AMQP 0-x JMS Client Examples ................. SUCCESS [0.140s]
[INFO] Qpid JCA .......................................... SUCCESS [1.675s]
[INFO] Qpid Resource Adaptor ............................. SUCCESS [0.517s]
[INFO] Qpid Tools ........................................ SUCCESS [0.379s]
[INFO] Qpid Management Examples .......................... SUCCESS [0.148s]
[INFO] Qpid Java System Test Parent ...................... SUCCESS [0.895s]
[INFO] Qpid System Tests ................................. FAILURE [7:48.028s]
[INFO] Qpid Performance Tests ............................ SUCCESS [13.358s]
[INFO] Qpid Performance Test System Tests ................ SKIPPED
[INFO] Qpid Performance Tests Visualisation JFC .......... SUCCESS [4.755s]
[INFO] Qpid BDB Store System Tests ....................... SKIPPED
[INFO] ------------------------------------------------------------------------
[INFO] BUILD FAILURE
[INFO] ------------------------------------------------------------------------
[INFO] Total time: 13:46.914s
[INFO] Finished at: Thu Nov 06 15:19:31 UTC 2014
[INFO] Final Memory: 70M/377M
[INFO] ------------------------------------------------------------------------
[ERROR] Failed to execute goal org.apache.maven.plugins:maven-surefire-plugin:2.16:test (integration-test)
on project qpid-systests: There are test failures.
[ERROR] 
[ERROR] Please refer to <https://builds.apache.org/job/Qpid-Java-Cpp-Test/ws/trunk/qpid/java/systests/target/surefire-reports>
for the individual test results.
[ERROR] -> [Help 1]
[ERROR] 
[ERROR] To see the full stack trace of the errors, re-run Maven with the -e switch.
[ERROR] Re-run Maven using the -X switch to enable full debug logging.
[ERROR] 
[ERROR] For more information about the errors and possible solutions, please read the following
articles:
[ERROR] [Help 1] http://cwiki.apache.org/confluence/display/MAVEN/MojoFailureException
[ERROR] 
[ERROR] After correcting the problems, you can resume the build with the command
[ERROR]   mvn <goals> -rf :qpid-systests
Build step 'Invoke top-level Maven targets' marked build as failure
[locks-and-latches] Releasing all the locks
[locks-and-latches] All the locks released
Recording test results

Mime
View raw message