qpid-notifications mailing list archives

Site index · List index
Message view « Date » · « Thread »
Top « Date » · « Thread »
From Apache Jenkins Server <jenk...@builds.apache.org>
Subject Build failed in Jenkins: Qpid-Java-Cpp-Test #2273
Date Fri, 07 Nov 2014 17:28:04 GMT
See <https://builds.apache.org/job/Qpid-Java-Cpp-Test/2273/changes>

Changes:

[gsim] QPID-6218: no need to retreieve external resources

------------------------------------------
[...truncated 21298 lines...]
	at javax.naming.InitialContext.lookup(InitialContext.java:411)
	at javax.management.remote.rmi.RMIConnector.findRMIServerJNDI(RMIConnector.java:1925)
	at javax.management.remote.rmi.RMIConnector.findRMIServer(RMIConnector.java:1892)
	at javax.management.remote.rmi.RMIConnector.connect(RMIConnector.java:275)
	at javax.management.remote.JMXConnectorFactory.connect(JMXConnectorFactory.java:268)
	at org.apache.qpid.management.common.JMXConnnectionFactory$ConnectWaiter.run(JMXConnnectionFactory.java:245)
	at java.lang.Thread.run(Thread.java:724)

testReadonlyMBeanAttributes(org.apache.qpid.server.store.berkeleydb.replication.JMXManagementTest)
 Time elapsed: 0.144 sec  <<< ERROR!
java.io.IOException: null
	at org.apache.qpid.management.common.JMXConnnectionFactory.getJMXConnection(JMXConnnectionFactory.java:79)
	at org.apache.qpid.test.utils.JMXTestUtils.open(JMXTestUtils.java:87)
	at org.apache.qpid.server.store.berkeleydb.replication.JMXManagementTest.getStoreBeanForNodeAtBrokerPort(JMXManagementTest.java:275)
	at org.apache.qpid.server.store.berkeleydb.replication.JMXManagementTest.testReadonlyMBeanAttributes(JMXManagementTest.java:110)
Caused by: java.io.IOException: Failed to retrieve RMIServer stub: javax.naming.ServiceUnavailableException
[Root exception is java.rmi.ConnectException: Connection refused to host: 127.0.0.1; nested
exception is: 
	java.net.ConnectException: Connection refused]
	at javax.management.remote.rmi.RMIConnector.connect(RMIConnector.java:358)
	at javax.management.remote.JMXConnectorFactory.connect(JMXConnectorFactory.java:268)
	at org.apache.qpid.management.common.JMXConnnectionFactory$ConnectWaiter.run(JMXConnnectionFactory.java:245)
	at java.lang.Thread.run(Thread.java:724)
Caused by: javax.naming.ServiceUnavailableException: null
	at com.sun.jndi.rmi.registry.RegistryContext.lookup(RegistryContext.java:118)
	at com.sun.jndi.toolkit.url.GenericURLContext.lookup(GenericURLContext.java:203)
	at javax.naming.InitialContext.lookup(InitialContext.java:411)
	at javax.management.remote.rmi.RMIConnector.findRMIServerJNDI(RMIConnector.java:1925)
	at javax.management.remote.rmi.RMIConnector.findRMIServer(RMIConnector.java:1892)
	at javax.management.remote.rmi.RMIConnector.connect(RMIConnector.java:275)
	at javax.management.remote.JMXConnectorFactory.connect(JMXConnectorFactory.java:268)
	at org.apache.qpid.management.common.JMXConnnectionFactory$ConnectWaiter.run(JMXConnnectionFactory.java:245)
	at java.lang.Thread.run(Thread.java:724)
Caused by: java.rmi.ConnectException: Connection refused to host: 127.0.0.1; nested exception
is: 
	java.net.ConnectException: Connection refused
	at sun.rmi.transport.tcp.TCPEndpoint.newSocket(TCPEndpoint.java:619)
	at sun.rmi.transport.tcp.TCPChannel.createConnection(TCPChannel.java:216)
	at sun.rmi.transport.tcp.TCPChannel.newConnection(TCPChannel.java:202)
	at sun.rmi.server.UnicastRef.newCall(UnicastRef.java:340)
	at sun.rmi.registry.RegistryImpl_Stub.lookup(Unknown Source)
	at com.sun.jndi.rmi.registry.RegistryContext.lookup(RegistryContext.java:114)
	at com.sun.jndi.toolkit.url.GenericURLContext.lookup(GenericURLContext.java:203)
	at javax.naming.InitialContext.lookup(InitialContext.java:411)
	at javax.management.remote.rmi.RMIConnector.findRMIServerJNDI(RMIConnector.java:1925)
	at javax.management.remote.rmi.RMIConnector.findRMIServer(RMIConnector.java:1892)
	at javax.management.remote.rmi.RMIConnector.connect(RMIConnector.java:275)
	at javax.management.remote.JMXConnectorFactory.connect(JMXConnectorFactory.java:268)
	at org.apache.qpid.management.common.JMXConnnectionFactory$ConnectWaiter.run(JMXConnnectionFactory.java:245)
	at java.lang.Thread.run(Thread.java:724)
Caused by: java.net.ConnectException: Connection refused
	at java.net.PlainSocketImpl.socketConnect(Native Method)
	at java.net.AbstractPlainSocketImpl.doConnect(AbstractPlainSocketImpl.java:339)
	at java.net.AbstractPlainSocketImpl.connectToAddress(AbstractPlainSocketImpl.java:200)
	at java.net.AbstractPlainSocketImpl.connect(AbstractPlainSocketImpl.java:182)
	at java.net.SocksSocketImpl.connect(SocksSocketImpl.java:392)
	at java.net.Socket.connect(Socket.java:579)
	at java.net.Socket.connect(Socket.java:528)
	at java.net.Socket.<init>(Socket.java:425)
	at java.net.Socket.<init>(Socket.java:208)
	at sun.rmi.transport.proxy.RMIDirectSocketFactory.createSocket(RMIDirectSocketFactory.java:40)
	at sun.rmi.transport.proxy.RMIMasterSocketFactory.createSocket(RMIMasterSocketFactory.java:146)
	at sun.rmi.transport.tcp.TCPEndpoint.newSocket(TCPEndpoint.java:613)
	at sun.rmi.transport.tcp.TCPChannel.createConnection(TCPChannel.java:216)
	at sun.rmi.transport.tcp.TCPChannel.newConnection(TCPChannel.java:202)
	at sun.rmi.server.UnicastRef.newCall(UnicastRef.java:340)
	at sun.rmi.registry.RegistryImpl_Stub.lookup(Unknown Source)
	at com.sun.jndi.rmi.registry.RegistryContext.lookup(RegistryContext.java:114)
	at com.sun.jndi.toolkit.url.GenericURLContext.lookup(GenericURLContext.java:203)
	at javax.naming.InitialContext.lookup(InitialContext.java:411)
	at javax.management.remote.rmi.RMIConnector.findRMIServerJNDI(RMIConnector.java:1925)
	at javax.management.remote.rmi.RMIConnector.findRMIServer(RMIConnector.java:1892)
	at javax.management.remote.rmi.RMIConnector.connect(RMIConnector.java:275)
	at javax.management.remote.JMXConnectorFactory.connect(JMXConnectorFactory.java:268)
	at org.apache.qpid.management.common.JMXConnnectionFactory$ConnectWaiter.run(JMXConnnectionFactory.java:245)
	at java.lang.Thread.run(Thread.java:724)

Running org.apache.qpid.server.store.berkeleydb.replication.BDBHAVirtualHostRestTest
Tests run: 3, Failures: 0, Errors: 3, Skipped: 0, Time elapsed: 0.122 sec <<< FAILURE!
- in org.apache.qpid.server.store.berkeleydb.replication.BDBHAVirtualHostRestTest
testSetLocalTransactionSynchronizationPolicy(org.apache.qpid.server.store.berkeleydb.replication.BDBHAVirtualHostRestTest)
 Time elapsed: 0.015 sec  <<< ERROR!
java.net.ConnectException: Connection refused
	at java.net.PlainSocketImpl.socketConnect(Native Method)
	at java.net.AbstractPlainSocketImpl.doConnect(AbstractPlainSocketImpl.java:339)
	at java.net.AbstractPlainSocketImpl.connectToAddress(AbstractPlainSocketImpl.java:200)
	at java.net.AbstractPlainSocketImpl.connect(AbstractPlainSocketImpl.java:182)
	at java.net.SocksSocketImpl.connect(SocksSocketImpl.java:392)
	at java.net.Socket.connect(Socket.java:579)
	at sun.net.NetworkClient.doConnect(NetworkClient.java:175)
	at sun.net.www.http.HttpClient.openServer(HttpClient.java:378)
	at sun.net.www.http.HttpClient.openServer(HttpClient.java:473)
	at sun.net.www.http.HttpClient.<init>(HttpClient.java:203)
	at sun.net.www.http.HttpClient.New(HttpClient.java:290)
	at sun.net.www.http.HttpClient.New(HttpClient.java:306)
	at sun.net.www.protocol.http.HttpURLConnection.getNewHttpClient(HttpURLConnection.java:995)
	at sun.net.www.protocol.http.HttpURLConnection.plainConnect(HttpURLConnection.java:931)
	at sun.net.www.protocol.http.HttpURLConnection.connect(HttpURLConnection.java:849)
	at org.apache.qpid.systest.rest.RestTestHelper.getJsonAsList(RestTestHelper.java:290)
	at org.apache.qpid.systest.rest.QpidRestTestCase.waitForAttributeChanged(QpidRestTestCase.java:114)
	at org.apache.qpid.server.store.berkeleydb.replication.BDBHAVirtualHostRestTest.testSetLocalTransactionSynchronizationPolicy(BDBHAVirtualHostRestTest.java:116)

testMutateState(org.apache.qpid.server.store.berkeleydb.replication.BDBHAVirtualHostRestTest)
 Time elapsed: 0.073 sec  <<< ERROR!
java.net.ConnectException: Connection refused
	at java.net.PlainSocketImpl.socketConnect(Native Method)
	at java.net.AbstractPlainSocketImpl.doConnect(AbstractPlainSocketImpl.java:339)
	at java.net.AbstractPlainSocketImpl.connectToAddress(AbstractPlainSocketImpl.java:200)
	at java.net.AbstractPlainSocketImpl.connect(AbstractPlainSocketImpl.java:182)
	at java.net.SocksSocketImpl.connect(SocksSocketImpl.java:392)
	at java.net.Socket.connect(Socket.java:579)
	at sun.net.NetworkClient.doConnect(NetworkClient.java:175)
	at sun.net.www.http.HttpClient.openServer(HttpClient.java:378)
	at sun.net.www.http.HttpClient.openServer(HttpClient.java:473)
	at sun.net.www.http.HttpClient.<init>(HttpClient.java:203)
	at sun.net.www.http.HttpClient.New(HttpClient.java:290)
	at sun.net.www.http.HttpClient.New(HttpClient.java:306)
	at sun.net.www.protocol.http.HttpURLConnection.getNewHttpClient(HttpURLConnection.java:995)
	at sun.net.www.protocol.http.HttpURLConnection.plainConnect(HttpURLConnection.java:931)
	at sun.net.www.protocol.http.HttpURLConnection.connect(HttpURLConnection.java:849)
	at org.apache.qpid.systest.rest.RestTestHelper.getJsonAsList(RestTestHelper.java:290)
	at org.apache.qpid.systest.rest.QpidRestTestCase.waitForAttributeChanged(QpidRestTestCase.java:114)
	at org.apache.qpid.server.store.berkeleydb.replication.BDBHAVirtualHostRestTest.testMutateState(BDBHAVirtualHostRestTest.java:140)

testSetRemoteTransactionSynchronizationPolicy(org.apache.qpid.server.store.berkeleydb.replication.BDBHAVirtualHostRestTest)
 Time elapsed: 0.034 sec  <<< ERROR!
java.net.ConnectException: Connection refused
	at java.net.PlainSocketImpl.socketConnect(Native Method)
	at java.net.AbstractPlainSocketImpl.doConnect(AbstractPlainSocketImpl.java:339)
	at java.net.AbstractPlainSocketImpl.connectToAddress(AbstractPlainSocketImpl.java:200)
	at java.net.AbstractPlainSocketImpl.connect(AbstractPlainSocketImpl.java:182)
	at java.net.SocksSocketImpl.connect(SocksSocketImpl.java:392)
	at java.net.Socket.connect(Socket.java:579)
	at sun.net.NetworkClient.doConnect(NetworkClient.java:175)
	at sun.net.www.http.HttpClient.openServer(HttpClient.java:378)
	at sun.net.www.http.HttpClient.openServer(HttpClient.java:473)
	at sun.net.www.http.HttpClient.<init>(HttpClient.java:203)
	at sun.net.www.http.HttpClient.New(HttpClient.java:290)
	at sun.net.www.http.HttpClient.New(HttpClient.java:306)
	at sun.net.www.protocol.http.HttpURLConnection.getNewHttpClient(HttpURLConnection.java:995)
	at sun.net.www.protocol.http.HttpURLConnection.plainConnect(HttpURLConnection.java:931)
	at sun.net.www.protocol.http.HttpURLConnection.connect(HttpURLConnection.java:849)
	at org.apache.qpid.systest.rest.RestTestHelper.getJsonAsList(RestTestHelper.java:290)
	at org.apache.qpid.systest.rest.QpidRestTestCase.waitForAttributeChanged(QpidRestTestCase.java:114)
	at org.apache.qpid.server.store.berkeleydb.replication.BDBHAVirtualHostRestTest.testSetRemoteTransactionSynchronizationPolicy(BDBHAVirtualHostRestTest.java:128)


Results :

Failed tests: 
  MultiNodeTest>QpidTestCase.run:148->QpidBrokerTestCase.runBare:312->setUp:80 null
  MultiNodeTest>QpidTestCase.run:148->QpidBrokerTestCase.runBare:312->setUp:80 null
  MultiNodeTest>QpidTestCase.run:148->QpidBrokerTestCase.runBare:312->setUp:80 null
  MultiNodeTest>QpidTestCase.run:148->QpidBrokerTestCase.runBare:312->setUp:80 null
  MultiNodeTest>QpidTestCase.run:148->QpidBrokerTestCase.runBare:312->setUp:80 null
  MultiNodeTest>QpidTestCase.run:148->QpidBrokerTestCase.runBare:312->setUp:80 null
  MultiNodeTest>QpidTestCase.run:148->QpidBrokerTestCase.runBare:312->setUp:80 null
  MultiNodeTest>QpidTestCase.run:148->QpidBrokerTestCase.runBare:312->setUp:80 null
  MultiNodeTest>QpidTestCase.run:148->QpidBrokerTestCase.runBare:312->setUp:80 null
  MultiNodeTest>QpidTestCase.run:148->QpidBrokerTestCase.runBare:312->setUp:80 null
  TwoNodeTest>QpidTestCase.run:148->QpidBrokerTestCase.runBare:312->setUp:54 null
  TwoNodeTest>QpidTestCase.run:148->QpidBrokerTestCase.runBare:312->setUp:54 null
  TwoNodeTest>QpidTestCase.run:148->QpidBrokerTestCase.runBare:312->setUp:54 null
  TwoNodeTest>QpidTestCase.run:148->QpidBrokerTestCase.runBare:312->setUp:54 null
  TwoNodeTest>QpidTestCase.run:148->QpidBrokerTestCase.runBare:312->setUp:54 null
  TwoNodeTest>QpidTestCase.run:148->QpidBrokerTestCase.runBare:312->setUp:54 null
  TwoNodeTest>QpidTestCase.run:148->QpidBrokerTestCase.runBare:312->setUp:54 null

Tests in error: 
  BDBHAVirtualHostNodeRestTest>QpidTestCase.run:148->QpidBrokerTestCase.runBare:312->testNewMasterElectedWhenVirtualHostIsStopped:135->createHANode:317
» Connect
  BDBHAVirtualHostNodeRestTest>QpidTestCase.run:148->QpidBrokerTestCase.runBare:312->testMutateStateOfOneNode:103->createHANode:317
» Connect
  BDBHAVirtualHostNodeRestTest>QpidTestCase.run:148->QpidBrokerTestCase.runBare:312->testIntruderProtection:252->createHANode:317
» Connect
  BDBHAVirtualHostNodeRestTest>QpidTestCase.run:148->QpidBrokerTestCase.runBare:312->testDeleteMasterNode:192->createHANode:317
» Connect
  BDBHAVirtualHostNodeRestTest>QpidTestCase.run:148->QpidBrokerTestCase.runBare:312->testCreate3NodeGroup:92->createHANode:317
» Connect
  BDBHAVirtualHostNodeRestTest>QpidTestCase.run:148->QpidBrokerTestCase.runBare:312->testDeleteReplicaNode:166->createHANode:317
» Connect
  BDBHAVirtualHostNodeRestTest>QpidTestCase.run:148->QpidBrokerTestCase.runBare:312->testIntruderBDBHAVHNNotAllowedToConnect:232->createHANode:317
» Connect
  JMXManagementTest>QpidTestCase.run:148->QpidBrokerTestCase.runBare:312->testRemoveRemoteNodeFromGroup:163->getStoreBeanForNodeAtBrokerPort:275
» IO
  JMXManagementTest>QpidTestCase.run:148->QpidBrokerTestCase.runBare:312->testVirtualHostOperationsDeniedForNonMasterNode:186->getManagedBrokerBeanForNodeAtBrokerPort:282
» IO
  JMXManagementTest>QpidTestCase.run:148->QpidBrokerTestCase.runBare:312->testStateOfNonActiveBrokerIsNotMaster:132->getStoreBeanForNodeAtBrokerPort:275
» IO
  JMXManagementTest>QpidTestCase.run:148->QpidBrokerTestCase.runBare:312->testStateOfActiveBrokerIsMaster:124->getStoreBeanForNodeAtBrokerPort:275
» IO
  JMXManagementTest>QpidTestCase.run:148->QpidBrokerTestCase.runBare:312->testVirtualHostMbeanOnMasterTransfer:224->getManagedBrokerBeanForNodeAtBrokerPort:282
» IO
  JMXManagementTest>QpidTestCase.run:148->QpidBrokerTestCase.runBare:312->testGroupMembers:141->getStoreBeanForNodeAtBrokerPort:275
» IO
  JMXManagementTest>QpidTestCase.run:148->QpidBrokerTestCase.runBare:312->testReadonlyMBeanAttributes:110->getStoreBeanForNodeAtBrokerPort:275
» IO
  BDBHAVirtualHostRestTest>QpidTestCase.run:148->QpidBrokerTestCase.runBare:312->testSetLocalTransactionSynchronizationPolicy:116->QpidRestTestCase.waitForAttributeChanged:114
» Connect
  BDBHAVirtualHostRestTest>QpidTestCase.run:148->QpidBrokerTestCase.runBare:312->testMutateState:140->QpidRestTestCase.waitForAttributeChanged:114
» Connect
  BDBHAVirtualHostRestTest>QpidTestCase.run:148->QpidBrokerTestCase.runBare:312->testSetRemoteTransactionSynchronizationPolicy:128->QpidRestTestCase.waitForAttributeChanged:114
» Connect

Tests run: 43, Failures: 17, Errors: 17, Skipped: 0

[INFO] ------------------------------------------------------------------------
[INFO] Reactor Summary:
[INFO] 
[INFO] Qpid Java Build ................................... SUCCESS [2.949s]
[INFO] Qpid AMQP 1.0 Common .............................. SUCCESS [6.365s]
[INFO] Qpid AMQP 1.0 Client .............................. SUCCESS [0.655s]
[INFO] Qpid AMQP 1.0 Client JMS .......................... SUCCESS [2.224s]
[INFO] Qpid AMQP 1.0 JMS Client Examples ................. SUCCESS [0.225s]
[INFO] Qpid AMQP 1.0 Client WebSocket .................... SUCCESS [0.676s]
[INFO] Qpid Broker Code Generation ....................... SUCCESS [0.303s]
[INFO] Qpid Test Utilities ............................... SUCCESS [0.244s]
[INFO] Qpid Common ....................................... SUCCESS [28.917s]
[INFO] Qpid Management Common ............................ SUCCESS [1.151s]
[INFO] Qpid Java Broker Core ............................. SUCCESS [1:21.752s]
[INFO] Qpid Access Control Broker Plug-in ................ SUCCESS [4.299s]
[INFO] Qpid AMQP 0-8 Protocol Broker Plug-in ............. SUCCESS [20.532s]
[INFO] Qpid AMQP 0-10 Protocol Plug-in ................... SUCCESS [4.547s]
[INFO] Qpid AMQP 1-0 Protocol Broker Plug-in ............. SUCCESS [0.662s]
[INFO] Qpid AMQP 0-8 to 0-10 Message Conversion Broker Plug-in  SUCCESS [0.360s]
[INFO] Qpid AMQP 0-8 to 1-0 Message Conversion Broker Plug-in  SUCCESS [0.360s]
[INFO] Qpid AMQP 0-10 to 1-0 Message Conversion Broker Plug-in  SUCCESS [0.345s]
[INFO] Qpid Derby Message Store .......................... SUCCESS [16.862s]
[INFO] Qpid JDBC Message Store Connection Pooling Plug-in  SUCCESS [0.540s]
[INFO] Qpid JDBC Message Store Broker Plug-in ............ SUCCESS [9.235s]
[INFO] Qpid HTTP Management Broker Plug-in ............... SUCCESS [4.738s]
[INFO] Qpid JMX Management Broker Plug-in ................ SUCCESS [3.263s]
[INFO] Qpid Memory Message Store Broker Plug-in .......... SUCCESS [0.419s]
[INFO] Qpid WebSocket Broker Plug-in ..................... SUCCESS [0.277s]
[INFO] Qpid AMQP 0-x JMS Client .......................... SUCCESS [7.278s]
[INFO] Qpid BDB Message Store ............................ SUCCESS [2:13.150s]
[INFO] Qpid BDB Message Store JMX ........................ SUCCESS [2.132s]
[INFO] Qpid Java Broker .................................. SUCCESS [5.129s]
[INFO] Qpid AMQP Management Protocol Broker Plug-in ...... SUCCESS [0.270s]
[INFO] Qpid AMQP 0-x JMS Client Examples ................. SUCCESS [0.154s]
[INFO] Qpid JCA .......................................... SUCCESS [1.600s]
[INFO] Qpid Resource Adaptor ............................. SUCCESS [0.417s]
[INFO] Qpid Tools ........................................ SUCCESS [0.396s]
[INFO] Qpid Management Examples .......................... SUCCESS [0.174s]
[INFO] Qpid Java System Test Parent ...................... SUCCESS [0.781s]
[INFO] Qpid System Tests ................................. SUCCESS [6:43.382s]
[INFO] Qpid Performance Tests ............................ SUCCESS [13.802s]
[INFO] Qpid Performance Test System Tests ................ SUCCESS [16.392s]
[INFO] Qpid Performance Tests Visualisation JFC .......... SUCCESS [3.978s]
[INFO] Qpid BDB Store System Tests ....................... FAILURE [5.019s]
[INFO] ------------------------------------------------------------------------
[INFO] BUILD FAILURE
[INFO] ------------------------------------------------------------------------
[INFO] Total time: 13:07.426s
[INFO] Finished at: Fri Nov 07 17:27:25 UTC 2014
[INFO] Final Memory: 71M/280M
[INFO] ------------------------------------------------------------------------
[ERROR] Failed to execute goal org.apache.maven.plugins:maven-surefire-plugin:2.16:test (integration-test)
on project qpid-bdbstore-systests: There are test failures.
[ERROR] 
[ERROR] Please refer to <https://builds.apache.org/job/Qpid-Java-Cpp-Test/ws/trunk/qpid/java/bdbstore/systests/target/surefire-reports>
for the individual test results.
[ERROR] -> [Help 1]
[ERROR] 
[ERROR] To see the full stack trace of the errors, re-run Maven with the -e switch.
[ERROR] Re-run Maven using the -X switch to enable full debug logging.
[ERROR] 
[ERROR] For more information about the errors and possible solutions, please read the following
articles:
[ERROR] [Help 1] http://cwiki.apache.org/confluence/display/MAVEN/MojoFailureException
[ERROR] 
[ERROR] After correcting the problems, you can resume the build with the command
[ERROR]   mvn <goals> -rf :qpid-bdbstore-systests
Build step 'Invoke top-level Maven targets' marked build as failure
[locks-and-latches] Releasing all the locks
[locks-and-latches] All the locks released
Recording test results

Mime
View raw message