qpid-notifications mailing list archives

Site index · List index
Message view « Date » · « Thread »
Top « Date » · « Thread »
From Apache Jenkins Server <jenk...@builds.apache.org>
Subject Build failed in Jenkins: Qpid-Java-Cpp-Test #2251
Date Tue, 28 Oct 2014 16:01:03 GMT
See <https://builds.apache.org/job/Qpid-Java-Cpp-Test/2251/changes>

Changes:

[rgodfrey] QPID-6193 : [Java AMQP 1.0] Allow channel max to be successfully established as
between 2^15 and 2^16 - 1

------------------------------------------
[...truncated 17118 lines...]
[INFO] skip non existing resourceDirectory <https://builds.apache.org/job/Qpid-Java-Cpp-Test/ws/trunk/qpid/java/perftests/visualisation-jfc/src/main/resources>
[INFO] Copying 0 resource
[INFO] Copying 3 resources
[INFO] 
[INFO] --- maven-compiler-plugin:3.1:compile (default-compile) @ qpid-perftests-visualisation-jfc
---
[INFO] Changes detected - recompiling the module!
[INFO] Compiling 30 source files to <https://builds.apache.org/job/Qpid-Java-Cpp-Test/ws/trunk/qpid/java/perftests/visualisation-jfc/target/classes>
[INFO] 
[INFO] --- maven-resources-plugin:2.6:testResources (default-testResources) @ qpid-perftests-visualisation-jfc
---
[INFO] Using 'UTF-8' encoding to copy filtered resources.
[INFO] Copying 1 resource
[INFO] skip non existing resourceDirectory <https://builds.apache.org/job/Qpid-Java-Cpp-Test/ws/trunk/qpid/java/perftests/visualisation-jfc/src/test/resources>
[INFO] Copying 3 resources
[INFO] 
[INFO] --- maven-compiler-plugin:3.1:testCompile (default-testCompile) @ qpid-perftests-visualisation-jfc
---
[INFO] Changes detected - recompiling the module!
[INFO] Compiling 11 source files to <https://builds.apache.org/job/Qpid-Java-Cpp-Test/ws/trunk/qpid/java/perftests/visualisation-jfc/target/test-classes>
[INFO] 
[INFO] --- maven-surefire-plugin:2.16:test (default-test) @ qpid-perftests-visualisation-jfc
---
[INFO] Surefire report directory: <https://builds.apache.org/job/Qpid-Java-Cpp-Test/ws/trunk/qpid/java/perftests/visualisation-jfc/target/surefire-reports>

-------------------------------------------------------
 T E S T S
-------------------------------------------------------
Running org.apache.qpid.disttest.charting.chartbuilder.BaseChartBuilderTest
main 2014-10-28 16:00:09,568 INFO [qpid.test.utils.QpidTestCase] Some tests should be excluded,
building the exclude list
main 2014-10-28 16:00:09,569 INFO [qpid.test.utils.QpidTestCase] Specified exclude file does
not exist: <https://builds.apache.org/job/Qpid-Java-Cpp-Test/ws/trunk/qpid/java/perftests/visualisation-jfc/../test-profiles//Excludes>
main 2014-10-28 16:00:09,569 INFO [qpid.test.utils.QpidTestCase] Specified exclude file does
not exist: <https://builds.apache.org/job/Qpid-Java-Cpp-Test/ws/trunk/qpid/java/perftests/visualisation-jfc/../test-profiles//CPPExcludes>
main 2014-10-28 16:00:09,570 INFO [qpid.test.utils.QpidTestCase] Specified exclude file does
not exist: <https://builds.apache.org/job/Qpid-Java-Cpp-Test/ws/trunk/qpid/java/perftests/visualisation-jfc/../test-profiles//cpp.excludes>
main 2014-10-28 16:00:09,570 INFO [qpid.test.utils.QpidTestCase] Specified exclude file does
not exist: <https://builds.apache.org/job/Qpid-Java-Cpp-Test/ws/trunk/qpid/java/perftests/visualisation-jfc/../test-profiles//CPPPrefetchExcludes>
main 2014-10-28 16:00:09,570 INFO [qpid.test.utils.QpidTestCase] Specified exclude file does
not exist: <https://builds.apache.org/job/Qpid-Java-Cpp-Test/ws/trunk/qpid/java/perftests/visualisation-jfc/../test-profiles//CPPTransientExcludes>
main 2014-10-28 16:00:09,570 INFO [qpid.test.utils.QpidTestCase] Specified exclude file does
not exist: <https://builds.apache.org/job/Qpid-Java-Cpp-Test/ws/trunk/qpid/java/perftests/visualisation-jfc/../test-profiles//cpp.excludes>
main 2014-10-28 16:00:09,965 INFO [qpid.test.utils.QpidTestCase] ========== start BaseChartBuilderTest.testBuildChart
==========
main 2014-10-28 16:00:10,204 INFO [qpid.test.utils.QpidTestCase] ========== tearDown BaseChartBuilderTest.testBuildChart
==========
Tests run: 1, Failures: 0, Errors: 0, Skipped: 0, Time elapsed: 1.065 sec - in org.apache.qpid.disttest.charting.chartbuilder.BaseChartBuilderTest
Running org.apache.qpid.disttest.charting.chartbuilder.TimeSeriesBuilderCallbackTest
main 2014-10-28 16:00:10,207 INFO [qpid.test.utils.QpidTestCase] ========== start TimeSeriesBuilderCallbackTest.testAddPointToSeries
==========
main 2014-10-28 16:00:10,269 INFO [qpid.test.utils.QpidTestCase] ========== tearDown TimeSeriesBuilderCallbackTest.testAddPointToSeries
==========
Tests run: 1, Failures: 0, Errors: 0, Skipped: 0, Time elapsed: 0.064 sec - in org.apache.qpid.disttest.charting.chartbuilder.TimeSeriesBuilderCallbackTest
Running org.apache.qpid.disttest.charting.chartbuilder.ChartProductionTest
main 2014-10-28 16:00:10,296 INFO [qpid.test.utils.QpidTestCase] ========== start ChartProductionTest.testLine3DChart
==========
main 2014-10-28 16:00:10,306 INFO [disttest.charting.writer.ChartWriter] Set chart directory:
/tmp/charts-1414512010301
main 2014-10-28 16:00:10,950 INFO [disttest.charting.writer.ChartWriter] Written /tmp/charts-1414512010301/testLine3DChart.png
chart
main 2014-10-28 16:00:10,950 INFO [qpid.test.utils.QpidTestCase] ========== tearDown ChartProductionTest.testLine3DChart
==========
main 2014-10-28 16:00:10,951 INFO [qpid.test.utils.QpidTestCase] ========== start ChartProductionTest.testXYLineChart
==========
main 2014-10-28 16:00:10,952 INFO [disttest.charting.writer.ChartWriter] Set chart directory:
/tmp/charts-1414512010952
main 2014-10-28 16:00:11,179 INFO [disttest.charting.writer.ChartWriter] Written /tmp/charts-1414512010952/testXYLineChart.png
chart
main 2014-10-28 16:00:11,179 INFO [qpid.test.utils.QpidTestCase] ========== tearDown ChartProductionTest.testXYLineChart
==========
main 2014-10-28 16:00:11,180 INFO [qpid.test.utils.QpidTestCase] ========== start ChartProductionTest.testStatisticalBarChart
==========
main 2014-10-28 16:00:11,181 INFO [disttest.charting.writer.ChartWriter] Set chart directory:
/tmp/charts-1414512011181
main 2014-10-28 16:00:11,290 INFO [disttest.charting.writer.ChartWriter] Written /tmp/charts-1414512011181/testStatisticalBarChart.png
chart
main 2014-10-28 16:00:11,290 INFO [qpid.test.utils.QpidTestCase] ========== tearDown ChartProductionTest.testStatisticalBarChart
==========
main 2014-10-28 16:00:11,290 INFO [qpid.test.utils.QpidTestCase] ========== start ChartProductionTest.testLineChart
==========
main 2014-10-28 16:00:11,291 INFO [disttest.charting.writer.ChartWriter] Set chart directory:
/tmp/charts-1414512011291
main 2014-10-28 16:00:11,373 INFO [disttest.charting.writer.ChartWriter] Written /tmp/charts-1414512011291/testLineChart.png
chart
main 2014-10-28 16:00:11,373 INFO [qpid.test.utils.QpidTestCase] ========== tearDown ChartProductionTest.testLineChart
==========
main 2014-10-28 16:00:11,373 INFO [qpid.test.utils.QpidTestCase] ========== start ChartProductionTest.testBarChart
==========
main 2014-10-28 16:00:11,374 INFO [disttest.charting.writer.ChartWriter] Set chart directory:
/tmp/charts-1414512011374
main 2014-10-28 16:00:11,460 INFO [disttest.charting.writer.ChartWriter] Written /tmp/charts-1414512011374/testBarChart.png
chart
main 2014-10-28 16:00:11,461 INFO [qpid.test.utils.QpidTestCase] ========== tearDown ChartProductionTest.testBarChart
==========
main 2014-10-28 16:00:11,461 INFO [qpid.test.utils.QpidTestCase] ========== start ChartProductionTest.testBar3DChart
==========
main 2014-10-28 16:00:11,463 INFO [disttest.charting.writer.ChartWriter] Set chart directory:
/tmp/charts-1414512011463
main 2014-10-28 16:00:11,700 INFO [disttest.charting.writer.ChartWriter] Written /tmp/charts-1414512011463/testBar3DChart.png
chart
main 2014-10-28 16:00:11,700 INFO [qpid.test.utils.QpidTestCase] ========== tearDown ChartProductionTest.testBar3DChart
==========
main 2014-10-28 16:00:11,701 INFO [qpid.test.utils.QpidTestCase] ========== start ChartProductionTest.testTimeSeriesLineChart
==========
main 2014-10-28 16:00:11,702 INFO [disttest.charting.writer.ChartWriter] Set chart directory:
/tmp/charts-1414512011702
main 2014-10-28 16:00:11,804 INFO [disttest.charting.writer.ChartWriter] Written /tmp/charts-1414512011702/testTimeSeriesLineChart.png
chart
main 2014-10-28 16:00:11,804 INFO [qpid.test.utils.QpidTestCase] ========== tearDown ChartProductionTest.testTimeSeriesLineChart
==========
main 2014-10-28 16:00:11,805 INFO [qpid.test.utils.QpidTestCase] ========== start ChartProductionTest.testXYLineChartWithColourAndWidth
==========
main 2014-10-28 16:00:11,806 INFO [disttest.charting.writer.ChartWriter] Set chart directory:
/tmp/charts-1414512011806
main 2014-10-28 16:00:11,892 INFO [disttest.charting.writer.ChartWriter] Written /tmp/charts-1414512011806/testXYLineChartWithColourAndWidth.png
chart
main 2014-10-28 16:00:11,892 INFO [qpid.test.utils.QpidTestCase] ========== tearDown ChartProductionTest.testXYLineChartWithColourAndWidth
==========
Tests run: 8, Failures: 0, Errors: 0, Skipped: 0, Time elapsed: 1.622 sec - in org.apache.qpid.disttest.charting.chartbuilder.ChartProductionTest
Running org.apache.qpid.disttest.charting.chartbuilder.ChartBuilderFactoryTest
main 2014-10-28 16:00:11,895 INFO [qpid.test.utils.QpidTestCase] ========== start ChartBuilderFactoryTest.testXYLineChart
==========
main 2014-10-28 16:00:11,895 INFO [qpid.test.utils.QpidTestCase] ========== tearDown ChartBuilderFactoryTest.testXYLineChart
==========
main 2014-10-28 16:00:11,895 INFO [qpid.test.utils.QpidTestCase] ========== start ChartBuilderFactoryTest.testLineChart
==========
main 2014-10-28 16:00:11,895 INFO [qpid.test.utils.QpidTestCase] ========== tearDown ChartBuilderFactoryTest.testLineChart
==========
main 2014-10-28 16:00:11,895 INFO [qpid.test.utils.QpidTestCase] ========== start ChartBuilderFactoryTest.testBarChart
==========
main 2014-10-28 16:00:11,896 INFO [qpid.test.utils.QpidTestCase] ========== tearDown ChartBuilderFactoryTest.testBarChart
==========
main 2014-10-28 16:00:11,896 INFO [qpid.test.utils.QpidTestCase] ========== start ChartBuilderFactoryTest.testTimeSeriesLineChart
==========
main 2014-10-28 16:00:11,896 INFO [qpid.test.utils.QpidTestCase] ========== tearDown ChartBuilderFactoryTest.testTimeSeriesLineChart
==========
main 2014-10-28 16:00:11,896 INFO [qpid.test.utils.QpidTestCase] ========== start ChartBuilderFactoryTest.testLineChart3D
==========
main 2014-10-28 16:00:11,896 INFO [qpid.test.utils.QpidTestCase] ========== tearDown ChartBuilderFactoryTest.testLineChart3D
==========
main 2014-10-28 16:00:11,897 INFO [qpid.test.utils.QpidTestCase] ========== start ChartBuilderFactoryTest.testBarChart3D
==========
main 2014-10-28 16:00:11,897 INFO [qpid.test.utils.QpidTestCase] ========== tearDown ChartBuilderFactoryTest.testBarChart3D
==========
Tests run: 6, Failures: 0, Errors: 0, Skipped: 0, Time elapsed: 0.004 sec - in org.apache.qpid.disttest.charting.chartbuilder.ChartBuilderFactoryTest
Running org.apache.qpid.disttest.charting.chartbuilder.ColorFactoryTest
main 2014-10-28 16:00:11,898 INFO [qpid.test.utils.QpidTestCase] ========== start ColorFactoryTest.testDarkBlue
==========
main 2014-10-28 16:00:11,898 INFO [qpid.test.utils.QpidTestCase] ========== tearDown ColorFactoryTest.testDarkBlue
==========
main 2014-10-28 16:00:11,899 INFO [qpid.test.utils.QpidTestCase] ========== start ColorFactoryTest.testBlue
==========
main 2014-10-28 16:00:11,899 INFO [qpid.test.utils.QpidTestCase] ========== tearDown ColorFactoryTest.testBlue
==========
Tests run: 2, Failures: 0, Errors: 0, Skipped: 0, Time elapsed: 0.001 sec - in org.apache.qpid.disttest.charting.chartbuilder.ColorFactoryTest
Running org.apache.qpid.disttest.charting.writer.ChartWriterTest
main 2014-10-28 16:00:11,917 INFO [disttest.charting.writer.ChartWriter] Set chart directory:
/tmp/TestFileUtils-testDir-1414512011917
main 2014-10-28 16:00:11,994 INFO [disttest.charting.writer.ChartWriter] Written /tmp/TestFileUtils-testDir-1414512011917/chart1.png
chart
main 2014-10-28 16:00:11,994 INFO [disttest.charting.writer.ChartWriter] Only 1 chart image(s)
have been written so no HTML summary file will be produced
main 2014-10-28 16:00:11,994 INFO [qpid.test.utils.QpidTestCase] ========== tearDown null
==========
main 2014-10-28 16:00:11,995 INFO [disttest.charting.writer.ChartWriter] Set chart directory:
/tmp/TestFileUtils-testDir-1414512011995
main 2014-10-28 16:00:12,062 INFO [disttest.charting.writer.ChartWriter] Written /tmp/TestFileUtils-testDir-1414512011995/chart1.png
chart
main 2014-10-28 16:00:12,062 INFO [qpid.test.utils.QpidTestCase] ========== tearDown null
==========
main 2014-10-28 16:00:12,063 INFO [disttest.charting.writer.ChartWriter] Set chart directory:
/tmp/TestFileUtils-testDir-1414512012063
main 2014-10-28 16:00:12,136 INFO [disttest.charting.writer.ChartWriter] Written /tmp/TestFileUtils-testDir-1414512012063/chart2.png
chart
main 2014-10-28 16:00:12,209 INFO [disttest.charting.writer.ChartWriter] Written /tmp/TestFileUtils-testDir-1414512012063/chart1.png
chart
main 2014-10-28 16:00:12,212 DEBUG [disttest.charting.writer.ChartWriter] About to produce
HTML summary file /tmp/TestFileUtils-testDir-1414512012063/chart-summary.html from charts
{/tmp/TestFileUtils-testDir-1414512012063/chart1.png=Mock for ChartingDefinition, hashCode:
4706628, /tmp/TestFileUtils-testDir-1414512012063/chart2.png=Mock for ChartingDefinition,
hashCode: 16515840}
main 2014-10-28 16:00:12,222 INFO [qpid.test.utils.QpidTestCase] ========== tearDown null
==========
Tests run: 3, Failures: 0, Errors: 0, Skipped: 0, Time elapsed: 0.323 sec - in org.apache.qpid.disttest.charting.writer.ChartWriterTest
Running org.apache.qpid.disttest.charting.seriesbuilder.SeriesRowTest
main 2014-10-28 16:00:12,224 INFO [qpid.test.utils.QpidTestCase] ========== start SeriesRowTest.testValidSeriesRowThrowsExceptionIfArrayTooSmall
==========
main 2014-10-28 16:00:12,224 INFO [qpid.test.utils.QpidTestCase] ========== tearDown SeriesRowTest.testValidSeriesRowThrowsExceptionIfArrayTooSmall
==========
main 2014-10-28 16:00:12,224 INFO [qpid.test.utils.QpidTestCase] ========== start SeriesRowTest.testDimension
==========
main 2014-10-28 16:00:12,225 INFO [qpid.test.utils.QpidTestCase] ========== tearDown SeriesRowTest.testDimension
==========
main 2014-10-28 16:00:12,225 INFO [qpid.test.utils.QpidTestCase] ========== start SeriesRowTest.testDimensionAsDouble
==========
main 2014-10-28 16:00:12,225 INFO [qpid.test.utils.QpidTestCase] ========== tearDown SeriesRowTest.testDimensionAsDouble
==========
main 2014-10-28 16:00:12,225 INFO [qpid.test.utils.QpidTestCase] ========== start SeriesRowTest.testDimensionAsString
==========
main 2014-10-28 16:00:12,225 INFO [qpid.test.utils.QpidTestCase] ========== tearDown SeriesRowTest.testDimensionAsString
==========
main 2014-10-28 16:00:12,226 INFO [qpid.test.utils.QpidTestCase] ========== start SeriesRowTest.testValidSeriesRow
==========
main 2014-10-28 16:00:12,226 INFO [qpid.test.utils.QpidTestCase] ========== tearDown SeriesRowTest.testValidSeriesRow
==========
Tests run: 5, Failures: 0, Errors: 0, Skipped: 0, Time elapsed: 0.002 sec - in org.apache.qpid.disttest.charting.seriesbuilder.SeriesRowTest
Running org.apache.qpid.disttest.charting.seriesbuilder.JdbcUrlGeneratorTest
main 2014-10-28 16:00:12,227 INFO [qpid.test.utils.QpidTestCase] ========== start JdbcUrlGeneratorTest.testGetJdbcUrlWithoutProvidingAUrlReturnsCsvUrlWithCorrectDirectory
==========
main 2014-10-28 16:00:12,241 INFO [qpid.test.utils.QpidTestCase] ========== tearDown JdbcUrlGeneratorTest.testGetJdbcUrlWithoutProvidingAUrlReturnsCsvUrlWithCorrectDirectory
==========
main 2014-10-28 16:00:12,241 INFO [qpid.test.utils.QpidTestCase] ========== start JdbcUrlGeneratorTest.testGetJdbcUrlThrowsExceptionWithoutAProvidedUrlOrSeriesDirectory
==========
main 2014-10-28 16:00:12,242 INFO [qpid.test.utils.QpidTestCase] ========== tearDown JdbcUrlGeneratorTest.testGetJdbcUrlThrowsExceptionWithoutAProvidedUrlOrSeriesDirectory
==========
main 2014-10-28 16:00:12,242 INFO [qpid.test.utils.QpidTestCase] ========== start JdbcUrlGeneratorTest.testGetJdbcUrlThrowsExceptionIfUrlProvidedAndSeriesDirectorySpecified
==========
main 2014-10-28 16:00:12,243 INFO [qpid.test.utils.QpidTestCase] ========== tearDown JdbcUrlGeneratorTest.testGetJdbcUrlThrowsExceptionIfUrlProvidedAndSeriesDirectorySpecified
==========
main 2014-10-28 16:00:12,243 INFO [qpid.test.utils.QpidTestCase] ========== start JdbcUrlGeneratorTest.testGetJdbcUrlReturnsProvidedUrl
==========
main 2014-10-28 16:00:12,243 INFO [qpid.test.utils.QpidTestCase] ========== tearDown JdbcUrlGeneratorTest.testGetJdbcUrlReturnsProvidedUrl
==========
Tests run: 4, Failures: 0, Errors: 0, Skipped: 0, Time elapsed: 0.017 sec - in org.apache.qpid.disttest.charting.seriesbuilder.JdbcUrlGeneratorTest
Running org.apache.qpid.disttest.charting.seriesbuilder.JdbcSeriesBuilderTest
main 2014-10-28 16:00:12,245 INFO [qpid.test.utils.QpidTestCase] ========== start JdbcSeriesBuilderTest.testBuildOneSeries
==========
main 2014-10-28 16:00:12,293 INFO [disttest.charting.seriesbuilder.JdbcSeriesBuilder] Loaded
JDBC driver class org.relique.jdbc.csv.CsvDriver
main 2014-10-28 16:00:12,340 INFO [disttest.charting.seriesbuilder.JdbcSeriesBuilder] Created:
JdbcSeriesBuilder[jdbcUrlGenerator=JdbcUrlGenerator[providedJdbdUrl=<null>]]
main 2014-10-28 16:00:12,429 INFO [qpid.test.utils.QpidTestCase] ========== tearDown JdbcSeriesBuilderTest.testBuildOneSeries
==========
Tests run: 1, Failures: 0, Errors: 0, Skipped: 0, Time elapsed: 0.185 sec - in org.apache.qpid.disttest.charting.seriesbuilder.JdbcSeriesBuilderTest
Running org.apache.qpid.disttest.charting.definition.ChartingDefinitionCreatorTest
main 2014-10-28 16:00:12,433 INFO [qpid.test.utils.QpidTestCase] ========== start ChartingDefinitionCreatorTest.testLoadTwoDefinitionsFromDirectory
==========
main 2014-10-28 16:00:12,449 INFO [qpid.test.utils.QpidTestCase] ========== tearDown ChartingDefinitionCreatorTest.testLoadTwoDefinitionsFromDirectory
==========
main 2014-10-28 16:00:12,450 INFO [qpid.test.utils.QpidTestCase] ========== start ChartingDefinitionCreatorTest.testLoadOneDefinitionFromFile
==========
main 2014-10-28 16:00:12,451 INFO [qpid.test.utils.QpidTestCase] ========== tearDown ChartingDefinitionCreatorTest.testLoadOneDefinitionFromFile
==========
main 2014-10-28 16:00:12,452 INFO [qpid.test.utils.QpidTestCase] ========== start ChartingDefinitionCreatorTest.testDefinitionsProperties
==========
main 2014-10-28 16:00:12,452 INFO [qpid.test.utils.QpidTestCase] Set system property "ChartingDefinitionSysProp"
to: "propValue"
main 2014-10-28 16:00:12,454 INFO [qpid.test.utils.QpidTestCase] ========== tearDown ChartingDefinitionCreatorTest.testDefinitionsProperties
==========
main 2014-10-28 16:00:12,454 DEBUG [qpid.test.utils.QpidTestCase] reverting 1 test properties
main 2014-10-28 16:00:12,454 INFO [qpid.test.utils.QpidTestCase] ========== start ChartingDefinitionCreatorTest.testDefinitionFileNotFound
==========
main 2014-10-28 16:00:12,455 INFO [qpid.test.utils.QpidTestCase] ========== tearDown ChartingDefinitionCreatorTest.testDefinitionFileNotFound
==========
Tests run: 4, Failures: 0, Errors: 0, Skipped: 0, Time elapsed: 0.025 sec - in org.apache.qpid.disttest.charting.definition.ChartingDefinitionCreatorTest
Running org.apache.qpid.disttest.charting.definition.SeriesDefinitionCreatorTest
main 2014-10-28 16:00:12,458 INFO [qpid.test.utils.QpidTestCase] ========== start SeriesDefinitionCreatorTest.testSeriesDirectoryAndNameSubstitution
==========
main 2014-10-28 16:00:12,458 INFO [qpid.test.utils.QpidTestCase] Set system property "SeriesDefinitionProp"
to: "propValue"
main 2014-10-28 16:00:12,459 INFO [qpid.test.utils.QpidTestCase] ========== tearDown SeriesDefinitionCreatorTest.testSeriesDirectoryAndNameSubstitution
==========
main 2014-10-28 16:00:12,459 DEBUG [qpid.test.utils.QpidTestCase] reverting 1 test properties
main 2014-10-28 16:00:12,460 INFO [qpid.test.utils.QpidTestCase] ========== start SeriesDefinitionCreatorTest.testTwoSeriesDefinitions
==========
main 2014-10-28 16:00:12,461 INFO [qpid.test.utils.QpidTestCase] ========== tearDown SeriesDefinitionCreatorTest.testTwoSeriesDefinitions
==========
main 2014-10-28 16:00:12,462 INFO [qpid.test.utils.QpidTestCase] ========== start SeriesDefinitionCreatorTest.testOneSeriesDefinition
==========
main 2014-10-28 16:00:12,463 INFO [qpid.test.utils.QpidTestCase] ========== tearDown SeriesDefinitionCreatorTest.testOneSeriesDefinition
==========
main 2014-10-28 16:00:12,464 INFO [qpid.test.utils.QpidTestCase] ========== start SeriesDefinitionCreatorTest.testNonSequentialSeriesDefinitionsIgnored
==========
main 2014-10-28 16:00:12,464 INFO [qpid.test.utils.QpidTestCase] ========== tearDown SeriesDefinitionCreatorTest.testNonSequentialSeriesDefinitionsIgnored
==========
Tests run: 4, Failures: 0, Errors: 0, Skipped: 0, Time elapsed: 0.008 sec - in org.apache.qpid.disttest.charting.definition.SeriesDefinitionCreatorTest

Results :

Tests run: 39, Failures: 0, Errors: 0, Skipped: 0

[INFO] 
[INFO] --- maven-jar-plugin:2.4:jar (default-jar) @ qpid-perftests-visualisation-jfc ---
[INFO] Building jar: <https://builds.apache.org/job/Qpid-Java-Cpp-Test/ws/trunk/qpid/java/perftests/visualisation-jfc/target/qpid-perftests-visualisation-jfc-0.32-SNAPSHOT.jar>
[INFO] 
[INFO] --- maven-site-plugin:3.3:attach-descriptor (attach-descriptor) @ qpid-perftests-visualisation-jfc
---
[INFO] 
[INFO] --- maven-antrun-plugin:1.7:run (create-qbtc-output-dir) @ qpid-perftests-visualisation-jfc
---
[INFO] Executing tasks

main:
    [mkdir] Created dir: <https://builds.apache.org/job/Qpid-Java-Cpp-Test/ws/trunk/qpid/java/perftests/visualisation-jfc/target/qbtc-output>
[INFO] Executed tasks
[INFO]                                                                         
[INFO] ------------------------------------------------------------------------
[INFO] Skipping Qpid BDB Store System Tests
[INFO] This project has been banned from the build due to previous failures.
[INFO] ------------------------------------------------------------------------
[INFO] ------------------------------------------------------------------------
[INFO] Reactor Summary:
[INFO] 
[INFO] Qpid Java Build ................................... SUCCESS [2.524s]
[INFO] Qpid AMQP 1.0 Common .............................. SUCCESS [5.953s]
[INFO] Qpid AMQP 1.0 Client .............................. SUCCESS [0.534s]
[INFO] Qpid AMQP 1.0 Client JMS .......................... SUCCESS [1.755s]
[INFO] Qpid AMQP 1.0 JMS Client Examples ................. SUCCESS [0.269s]
[INFO] Qpid AMQP 1.0 Client WebSocket .................... SUCCESS [0.668s]
[INFO] Qpid Broker Code Generation ....................... SUCCESS [0.222s]
[INFO] Qpid Test Utilities ............................... SUCCESS [0.292s]
[INFO] Qpid Common ....................................... SUCCESS [29.664s]
[INFO] Qpid Management Common ............................ SUCCESS [1.082s]
[INFO] Qpid Java Broker Core ............................. SUCCESS [1:40.173s]
[INFO] Qpid Access Control Broker Plug-in ................ SUCCESS [4.357s]
[INFO] Qpid AMQP 0-8 Protocol Broker Plug-in ............. SUCCESS [20.862s]
[INFO] Qpid AMQP 0-10 Protocol Plug-in ................... SUCCESS [4.381s]
[INFO] Qpid AMQP 1-0 Protocol Broker Plug-in ............. SUCCESS [0.507s]
[INFO] Qpid AMQP 0-8 to 0-10 Message Conversion Broker Plug-in  SUCCESS [0.274s]
[INFO] Qpid AMQP 0-8 to 1-0 Message Conversion Broker Plug-in  SUCCESS [0.285s]
[INFO] Qpid AMQP 0-10 to 1-0 Message Conversion Broker Plug-in  SUCCESS [0.240s]
[INFO] Qpid Derby Message Store .......................... SUCCESS [16.605s]
[INFO] Qpid JDBC Message Store Connection Pooling Plug-in  SUCCESS [0.290s]
[INFO] Qpid JDBC Message Store Broker Plug-in ............ SUCCESS [11.023s]
[INFO] Qpid HTTP Management Broker Plug-in ............... SUCCESS [5.119s]
[INFO] Qpid JMX Management Broker Plug-in ................ SUCCESS [3.522s]
[INFO] Qpid Memory Message Store Broker Plug-in .......... SUCCESS [0.525s]
[INFO] Qpid WebSocket Broker Plug-in ..................... SUCCESS [0.296s]
[INFO] Qpid AMQP 0-x JMS Client .......................... SUCCESS [7.058s]
[INFO] Qpid BDB Message Store ............................ SUCCESS [2:12.505s]
[INFO] Qpid BDB Message Store JMX ........................ SUCCESS [2.106s]
[INFO] Qpid Java Broker .................................. SUCCESS [5.017s]
[INFO] Qpid AMQP Management Protocol Broker Plug-in ...... SUCCESS [0.277s]
[INFO] Qpid AMQP 0-x JMS Client Examples ................. SUCCESS [0.169s]
[INFO] Qpid JCA .......................................... SUCCESS [1.560s]
[INFO] Qpid Resource Adaptor ............................. SUCCESS [0.384s]
[INFO] Qpid Tools ........................................ SUCCESS [0.398s]
[INFO] Qpid Management Examples .......................... SUCCESS [0.161s]
[INFO] Qpid Java System Test Parent ...................... SUCCESS [0.759s]
[INFO] Qpid System Tests ................................. FAILURE [7:48.883s]
[INFO] Qpid Performance Tests ............................ SUCCESS [13.671s]
[INFO] Qpid Performance Test System Tests ................ SKIPPED
[INFO] Qpid Performance Tests Visualisation JFC .......... SUCCESS [4.519s]
[INFO] Qpid BDB Store System Tests ....................... SKIPPED
[INFO] ------------------------------------------------------------------------
[INFO] BUILD FAILURE
[INFO] ------------------------------------------------------------------------
[INFO] Total time: 14:09.855s
[INFO] Finished at: Tue Oct 28 16:00:12 UTC 2014
[INFO] Final Memory: 72M/397M
[INFO] ------------------------------------------------------------------------
[ERROR] Failed to execute goal org.apache.maven.plugins:maven-surefire-plugin:2.16:test (integration-test)
on project qpid-systests: There are test failures.
[ERROR] 
[ERROR] Please refer to <https://builds.apache.org/job/Qpid-Java-Cpp-Test/ws/trunk/qpid/java/systests/target/surefire-reports>
for the individual test results.
[ERROR] -> [Help 1]
[ERROR] 
[ERROR] To see the full stack trace of the errors, re-run Maven with the -e switch.
[ERROR] Re-run Maven using the -X switch to enable full debug logging.
[ERROR] 
[ERROR] For more information about the errors and possible solutions, please read the following
articles:
[ERROR] [Help 1] http://cwiki.apache.org/confluence/display/MAVEN/MojoFailureException
[ERROR] 
[ERROR] After correcting the problems, you can resume the build with the command
[ERROR]   mvn <goals> -rf :qpid-systests
Build step 'Invoke top-level Maven targets' marked build as failure
[locks-and-latches] Releasing all the locks
[locks-and-latches] All the locks released
Recording test results

Mime
View raw message