qpid-notifications mailing list archives

Site index · List index
Message view « Date » · « Thread »
Top « Date » · « Thread »
From Apache Jenkins Server <jenk...@builds.apache.org>
Subject Build failed in Jenkins: Qpid-Java-Java-Test-IBMJDK1.7 #871
Date Sat, 18 Oct 2014 02:33:19 GMT
See <https://builds.apache.org/job/Qpid-Java-Java-Test-IBMJDK1.7/871/changes>

Changes:

[rgodfrey] QPID-6162 : add documentation

[rgodfrey] QPID-6164 : add documentation to the client book

[rgodfrey] QPID-6165 : [Java Broker] Allow the number of open connections to be limited on
a per port basis

[rgodfrey] QPID-6161 : fix bdb ha tests where the vhn name differs from the vh name by adding
an alias into the config

[rgodfrey] QPID-6163 : [Java Broker] Disconnect clients which do not obey flow control

[rgodfrey] QPID-6164 : Add synchronous publish capability to 0-8/9/9-1

[rgodfrey] QPID-6125 : [Java Broker] AMQP 0-8/9/9-1 protocol handler refactoring

[rgodfrey] QPID-6162 : Add authentication providers which store user data in the config file

[rgodfrey] QPID-6161 : [Java Broker] add virtual host aliases

[kwall] NO-JIRA: [Java Tests] Enable client side logging during HA tests to help diagnose
a failing test

[pmoravec] QPID-6157: linearstore: segfault when 2 journals request new journal file from
empty EFP

------------------------------------------
[...truncated 8724 lines...]
22193/22589 KB   
22197/22589 KB   
22201/22589 KB   
22205/22589 KB   
22209/22589 KB   
22213/22589 KB   
22217/22589 KB   
22221/22589 KB   
22225/22589 KB   
22229/22589 KB   
22233/22589 KB   
22237/22589 KB   
22241/22589 KB   
22245/22589 KB   
22249/22589 KB   
22253/22589 KB   
22257/22589 KB   
22261/22589 KB   
22265/22589 KB   
22269/22589 KB   
22273/22589 KB   
22277/22589 KB   
22281/22589 KB   
22285/22589 KB   
22289/22589 KB   
22293/22589 KB   
22297/22589 KB   
22301/22589 KB   
22305/22589 KB   
22309/22589 KB   
22313/22589 KB   
22317/22589 KB   
22321/22589 KB   
22325/22589 KB   
22329/22589 KB   
22333/22589 KB   
22337/22589 KB   
22341/22589 KB   
22345/22589 KB   
22349/22589 KB   
22353/22589 KB   
22357/22589 KB   
22361/22589 KB   
22365/22589 KB   
22369/22589 KB   
22373/22589 KB   
22377/22589 KB   
22381/22589 KB   
22385/22589 KB   
22389/22589 KB   
22393/22589 KB   
22397/22589 KB   
22401/22589 KB   
22405/22589 KB   
22409/22589 KB   
22413/22589 KB   
22417/22589 KB   
22421/22589 KB   
22425/22589 KB   
22429/22589 KB   
22433/22589 KB   
22437/22589 KB   
22441/22589 KB   
22445/22589 KB   
22449/22589 KB   
22453/22589 KB   
22457/22589 KB   
22461/22589 KB   
22465/22589 KB   
22469/22589 KB   
22473/22589 KB   
22477/22589 KB   
22481/22589 KB   
22485/22589 KB   
22489/22589 KB   
22493/22589 KB   
22497/22589 KB   
22501/22589 KB   
22505/22589 KB   
22509/22589 KB   
22513/22589 KB   
22517/22589 KB   
22521/22589 KB   
22525/22589 KB   
22529/22589 KB   
22533/22589 KB   
22537/22589 KB   
22541/22589 KB   
22545/22589 KB   
22549/22589 KB   
22553/22589 KB   
22557/22589 KB   
22561/22589 KB   
22565/22589 KB   
22569/22589 KB   
22573/22589 KB   
22577/22589 KB   
22581/22589 KB   
22585/22589 KB   
22589/22589 KB   
                 
Downloaded: http://repository.apache.org/snapshots/org/apache/qpid/qpid-broker/0.32-SNAPSHOT/qpid-broker-0.32-20141017.233342-65-bin.tar.gz
(22589 KB at 11876.3 KB/sec)
[INFO] Unpacking /home/jenkins/.m2/repository/org/apache/qpid/qpid-broker/0.32-SNAPSHOT/qpid-broker-0.32-SNAPSHOT-bin.tar.gz
to <https://builds.apache.org/job/Qpid-Java-Java-Test-IBMJDK1.7/ws/trunk/qpid/java/qpid-systests-parent/target>
with includes "" and excludes ""
[INFO] Expanding: /home/jenkins/.m2/repository/org/apache/qpid/qpid-broker/0.32-SNAPSHOT/qpid-broker-0.32-SNAPSHOT-bin.tar.gz
into <https://builds.apache.org/job/Qpid-Java-Java-Test-IBMJDK1.7/ws/trunk/qpid/java/qpid-systests-parent/target>
[INFO] 
[INFO] --- maven-dependency-plugin:2.8:copy (copy-sleepycat-jar-for-bdb-tests) @ qpid-systests-parent
---
[INFO] Configured Artifact: com.sleepycat:je:5.0.97:jar
[INFO] Copying je-5.0.97.jar to <https://builds.apache.org/job/Qpid-Java-Java-Test-IBMJDK1.7/ws/trunk/qpid/java/qpid-systests-parent/target/qpid-broker/0.32-SNAPSHOT/lib/je-5.0.97.jar>
[INFO] 
[INFO] --- maven-surefire-plugin:2.16:test (integration-test) @ qpid-systests-parent ---
[INFO] No tests to run.
[INFO] 
[INFO] --- maven-site-plugin:3.3:site (default-site) @ qpid-systests-parent ---
[INFO] configuring report plugin org.apache.maven.plugins:maven-project-info-reports-plugin:2.7
[INFO] configuring report plugin org.codehaus.mojo:license-maven-plugin:1.6
[INFO] configuring report plugin org.apache.maven.plugins:maven-surefire-report-plugin:2.16
[INFO] configuring report plugin org.apache.maven.plugins:maven-jxr-plugin:2.3
[INFO] configuring report plugin org.jacoco:jacoco-maven-plugin:0.7.0.201403182114
[INFO] Skipping JaCoCo execution because property jacoco.skip is set.
[INFO] Skipping JaCoCo execution because property jacoco.skip is set.
[INFO] configuring report plugin org.apache.rat:apache-rat-plugin:0.10
[INFO] Parent project loaded from repository: org.apache.qpid:qpid-parent:pom:1.0
[INFO] Parent project loaded from repository: org.apache:apache:pom:14
[INFO] Relativizing decoration links with respect to project URL: http://qpid.apache.org/qpid-java-build/qpid-systests-parent
[INFO] Rendering site with org.apache.maven.skins:maven-default-skin:jar:1.0 skin.
[INFO] Generating "About" report    --- maven-project-info-reports-plugin:2.7
[INFO] Generating "Plugin Management" report    --- maven-project-info-reports-plugin:2.7
[INFO] Generating "Distribution Management" report    --- maven-project-info-reports-plugin:2.7
[INFO] Generating "Dependency Information" report    --- maven-project-info-reports-plugin:2.7
[INFO] Generating "Dependency Convergence" report    --- maven-project-info-reports-plugin:2.7
[INFO] Generating "Source Repository" report    --- maven-project-info-reports-plugin:2.7
[INFO] Generating "Mailing Lists" report    --- maven-project-info-reports-plugin:2.7
[INFO] Generating "Issue Tracking" report    --- maven-project-info-reports-plugin:2.7
[INFO] Generating "Continuous Integration" report    --- maven-project-info-reports-plugin:2.7
[INFO] Generating "Project Plugins" report    --- maven-project-info-reports-plugin:2.7
[INFO] Generating "Project License" report    --- maven-project-info-reports-plugin:2.7
[INFO] Generating "Dependency Management" report    --- maven-project-info-reports-plugin:2.7
[INFO] Generating "Project Team" report    --- maven-project-info-reports-plugin:2.7
[INFO] Generating "Project Summary" report    --- maven-project-info-reports-plugin:2.7
[INFO] Generating "Dependencies" report    --- maven-project-info-reports-plugin:2.7
[INFO] Generating "Third Parties" report    --- license-maven-plugin:1.6
[INFO] Generating "Rat Report" report    --- apache-rat-plugin:0.10
[INFO] 51 implicit excludes (use -debug for more details).
[INFO] Exclude: build/**
[INFO] Exclude: lib/**
[INFO] Exclude: test-profiles/test_resources/ssl/**
[INFO] 1 resources included (use -debug for more details)
[INFO] 
[INFO] --- maven-site-plugin:3.3:stage (default-cli) @ qpid-systests-parent ---
[INFO] Using this base directory for staging: <https://builds.apache.org/job/Qpid-Java-Java-Test-IBMJDK1.7/ws/trunk/qpid/java/target/staging>
[INFO] Parent project loaded from repository: org.apache.qpid:qpid-parent:pom:1.0
file://<https://builds.apache.org/job/Qpid-Java-Java-Test-IBMJDK1.7/ws/trunk/qpid/java/target/staging/>
- Session: Opened  
[INFO] Pushing <https://builds.apache.org/job/Qpid-Java-Java-Test-IBMJDK1.7/ws/trunk/qpid/java/qpid-systests-parent/target/site>
[INFO]    >>> to file://<https://builds.apache.org/job/Qpid-Java-Java-Test-IBMJDK1.7/ws/trunk/qpid/java/target/staging/qpid-systests-parent/qpid-systests-parent>
file://<https://builds.apache.org/job/Qpid-Java-Java-Test-IBMJDK1.7/ws/trunk/qpid/java/target/staging/>
- Session: Disconnecting  
file://<https://builds.apache.org/job/Qpid-Java-Java-Test-IBMJDK1.7/ws/trunk/qpid/java/target/staging/>
- Session: Disconnected
[INFO]                                                                         
[INFO] ------------------------------------------------------------------------
[INFO] Skipping Qpid System Tests
[INFO] This project has been banned from the build due to previous failures.
[INFO] ------------------------------------------------------------------------
[INFO]                                                                         
[INFO] ------------------------------------------------------------------------
[INFO] Skipping Qpid Performance Tests
[INFO] This project has been banned from the build due to previous failures.
[INFO] ------------------------------------------------------------------------
[INFO]                                                                         
[INFO] ------------------------------------------------------------------------
[INFO] Skipping Qpid Performance Test System Tests
[INFO] This project has been banned from the build due to previous failures.
[INFO] ------------------------------------------------------------------------
[INFO]                                                                         
[INFO] ------------------------------------------------------------------------
[INFO] Skipping Qpid Performance Tests Visualisation JFC
[INFO] This project has been banned from the build due to previous failures.
[INFO] ------------------------------------------------------------------------
[INFO]                                                                         
[INFO] ------------------------------------------------------------------------
[INFO] Skipping Qpid BDB Store System Tests
[INFO] This project has been banned from the build due to previous failures.
[INFO] ------------------------------------------------------------------------
[INFO] ------------------------------------------------------------------------
[INFO] Reactor Summary:
[INFO] 
[INFO] Qpid Java Build ................................... SUCCESS [37.250s]
[INFO] Qpid AMQP 1.0 Common .............................. SUCCESS [8.908s]
[INFO] Qpid AMQP 1.0 Client .............................. SUCCESS [3.004s]
[INFO] Qpid AMQP 1.0 Client JMS .......................... SUCCESS [5.055s]
[INFO] Qpid AMQP 1.0 JMS Client Examples ................. SUCCESS [2.336s]
[INFO] Qpid AMQP 1.0 Client WebSocket .................... SUCCESS [2.920s]
[INFO] Qpid Broker Code Generation ....................... SUCCESS [2.263s]
[INFO] Qpid Test Utilities ............................... SUCCESS [2.395s]
[INFO] Qpid Common ....................................... FAILURE [25.226s]
[INFO] Qpid Management Common ............................ SUCCESS [4.625s]
[INFO] Qpid Java Broker Core ............................. SKIPPED
[INFO] Qpid Access Control Broker Plug-in ................ SKIPPED
[INFO] Qpid AMQP 0-8 Protocol Broker Plug-in ............. SKIPPED
[INFO] Qpid AMQP 0-10 Protocol Plug-in ................... SKIPPED
[INFO] Qpid AMQP 1-0 Protocol Broker Plug-in ............. SKIPPED
[INFO] Qpid AMQP 0-8 to 0-10 Message Conversion Broker Plug-in  SKIPPED
[INFO] Qpid AMQP 0-8 to 1-0 Message Conversion Broker Plug-in  SKIPPED
[INFO] Qpid AMQP 0-10 to 1-0 Message Conversion Broker Plug-in  SKIPPED
[INFO] Qpid Derby Message Store .......................... SKIPPED
[INFO] Qpid JDBC Message Store Connection Pooling Plug-in  SKIPPED
[INFO] Qpid JDBC Message Store Broker Plug-in ............ SKIPPED
[INFO] Qpid HTTP Management Broker Plug-in ............... SKIPPED
[INFO] Qpid JMX Management Broker Plug-in ................ SKIPPED
[INFO] Qpid Memory Message Store Broker Plug-in .......... SKIPPED
[INFO] Qpid WebSocket Broker Plug-in ..................... SKIPPED
[INFO] Qpid AMQP 0-x JMS Client .......................... SKIPPED
[INFO] Qpid BDB Message Store ............................ SKIPPED
[INFO] Qpid BDB Message Store JMX ........................ SKIPPED
[INFO] Qpid Java Broker .................................. SKIPPED
[INFO] Qpid AMQP Management Protocol Broker Plug-in ...... SKIPPED
[INFO] Qpid AMQP 0-x JMS Client Examples ................. SKIPPED
[INFO] Qpid JCA .......................................... SKIPPED
[INFO] Qpid Resource Adaptor ............................. SKIPPED
[INFO] Qpid Tools ........................................ SKIPPED
[INFO] Qpid Management Examples .......................... SUCCESS [2.388s]
[INFO] Qpid Java System Test Parent ...................... SUCCESS [6.123s]
[INFO] Qpid System Tests ................................. SKIPPED
[INFO] Qpid Performance Tests ............................ SKIPPED
[INFO] Qpid Performance Test System Tests ................ SKIPPED
[INFO] Qpid Performance Tests Visualisation JFC .......... SKIPPED
[INFO] Qpid BDB Store System Tests ....................... SKIPPED
[INFO] ------------------------------------------------------------------------
[INFO] BUILD FAILURE
[INFO] ------------------------------------------------------------------------
[INFO] Total time: 1:43.792s
[INFO] Finished at: Sat Oct 18 02:33:13 UTC 2014
[INFO] Final Memory: 59M/206M
[INFO] ------------------------------------------------------------------------
[ERROR] Failed to execute goal org.apache.maven.plugins:maven-surefire-plugin:2.16:test (default-test)
on project qpid-common: There are test failures.
[ERROR] 
[ERROR] Please refer to <https://builds.apache.org/job/Qpid-Java-Java-Test-IBMJDK1.7/ws/trunk/qpid/java/common/target/surefire-reports>
for the individual test results.
[ERROR] -> [Help 1]
[ERROR] 
[ERROR] To see the full stack trace of the errors, re-run Maven with the -e switch.
[ERROR] Re-run Maven using the -X switch to enable full debug logging.
[ERROR] 
[ERROR] For more information about the errors and possible solutions, please read the following
articles:
[ERROR] [Help 1] http://cwiki.apache.org/confluence/display/MAVEN/MojoFailureException
[ERROR] 
[ERROR] After correcting the problems, you can resume the build with the command
[ERROR]   mvn <goals> -rf :qpid-common
Build step 'Invoke top-level Maven targets' marked build as failure
[locks-and-latches] Releasing all the locks
[locks-and-latches] All the locks released
Recording test results

Mime
View raw message