qpid-notifications mailing list archives

Site index · List index
Message view « Date » · « Thread »
Top « Date » · « Thread »
From Apache Jenkins Server <jenk...@builds.apache.org>
Subject Build failed in Jenkins: Qpid-Java-Cpp-Test #2206
Date Mon, 13 Oct 2014 13:43:25 GMT
See <https://builds.apache.org/job/Qpid-Java-Cpp-Test/2206/changes>

Changes:

[aconway] NO-JIRA: Fix duplicate id "ha-broker-options" in broker docbook source.

Fixed cut and paste error.

------------------------------------------
[...truncated 16842 lines...]
[INFO] skip non existing resourceDirectory <https://builds.apache.org/job/Qpid-Java-Cpp-Test/ws/trunk/qpid/java/perftests/visualisation-jfc/src/main/resources>
[INFO] Copying 0 resource
[INFO] Copying 3 resources
[INFO] 
[INFO] --- maven-compiler-plugin:3.1:compile (default-compile) @ qpid-perftests-visualisation-jfc
---
[INFO] Changes detected - recompiling the module!
[INFO] Compiling 30 source files to <https://builds.apache.org/job/Qpid-Java-Cpp-Test/ws/trunk/qpid/java/perftests/visualisation-jfc/target/classes>
[INFO] 
[INFO] --- maven-resources-plugin:2.6:testResources (default-testResources) @ qpid-perftests-visualisation-jfc
---
[INFO] Using 'UTF-8' encoding to copy filtered resources.
[INFO] Copying 1 resource
[INFO] skip non existing resourceDirectory <https://builds.apache.org/job/Qpid-Java-Cpp-Test/ws/trunk/qpid/java/perftests/visualisation-jfc/src/test/resources>
[INFO] Copying 3 resources
[INFO] 
[INFO] --- maven-compiler-plugin:3.1:testCompile (default-testCompile) @ qpid-perftests-visualisation-jfc
---
[INFO] Changes detected - recompiling the module!
[INFO] Compiling 11 source files to <https://builds.apache.org/job/Qpid-Java-Cpp-Test/ws/trunk/qpid/java/perftests/visualisation-jfc/target/test-classes>
[INFO] 
[INFO] --- maven-surefire-plugin:2.16:test (default-test) @ qpid-perftests-visualisation-jfc
---
[INFO] Surefire report directory: <https://builds.apache.org/job/Qpid-Java-Cpp-Test/ws/trunk/qpid/java/perftests/visualisation-jfc/target/surefire-reports>

-------------------------------------------------------
 T E S T S
-------------------------------------------------------
Running org.apache.qpid.disttest.charting.chartbuilder.BaseChartBuilderTest
main 2014-10-13 13:43:08,764 INFO [qpid.test.utils.QpidTestCase] Some tests should be excluded,
building the exclude list
main 2014-10-13 13:43:08,765 INFO [qpid.test.utils.QpidTestCase] Specified exclude file does
not exist: <https://builds.apache.org/job/Qpid-Java-Cpp-Test/ws/trunk/qpid/java/perftests/visualisation-jfc/../test-profiles//Excludes>
main 2014-10-13 13:43:08,766 INFO [qpid.test.utils.QpidTestCase] Specified exclude file does
not exist: <https://builds.apache.org/job/Qpid-Java-Cpp-Test/ws/trunk/qpid/java/perftests/visualisation-jfc/../test-profiles//CPPExcludes>
main 2014-10-13 13:43:08,766 INFO [qpid.test.utils.QpidTestCase] Specified exclude file does
not exist: <https://builds.apache.org/job/Qpid-Java-Cpp-Test/ws/trunk/qpid/java/perftests/visualisation-jfc/../test-profiles//cpp.excludes>
main 2014-10-13 13:43:08,766 INFO [qpid.test.utils.QpidTestCase] Specified exclude file does
not exist: <https://builds.apache.org/job/Qpid-Java-Cpp-Test/ws/trunk/qpid/java/perftests/visualisation-jfc/../test-profiles//CPPPrefetchExcludes>
main 2014-10-13 13:43:08,766 INFO [qpid.test.utils.QpidTestCase] Specified exclude file does
not exist: <https://builds.apache.org/job/Qpid-Java-Cpp-Test/ws/trunk/qpid/java/perftests/visualisation-jfc/../test-profiles//CPPTransientExcludes>
main 2014-10-13 13:43:08,766 INFO [qpid.test.utils.QpidTestCase] Specified exclude file does
not exist: <https://builds.apache.org/job/Qpid-Java-Cpp-Test/ws/trunk/qpid/java/perftests/visualisation-jfc/../test-profiles//cpp.excludes>
main 2014-10-13 13:43:09,162 INFO [qpid.test.utils.QpidTestCase] ========== start BaseChartBuilderTest.testBuildChart
==========
main 2014-10-13 13:43:09,387 INFO [qpid.test.utils.QpidTestCase] ========== tearDown BaseChartBuilderTest.testBuildChart
==========
Tests run: 1, Failures: 0, Errors: 0, Skipped: 0, Time elapsed: 0.996 sec - in org.apache.qpid.disttest.charting.chartbuilder.BaseChartBuilderTest
Running org.apache.qpid.disttest.charting.chartbuilder.TimeSeriesBuilderCallbackTest
main 2014-10-13 13:43:09,390 INFO [qpid.test.utils.QpidTestCase] ========== start TimeSeriesBuilderCallbackTest.testAddPointToSeries
==========
main 2014-10-13 13:43:09,451 INFO [qpid.test.utils.QpidTestCase] ========== tearDown TimeSeriesBuilderCallbackTest.testAddPointToSeries
==========
Tests run: 1, Failures: 0, Errors: 0, Skipped: 0, Time elapsed: 0.063 sec - in org.apache.qpid.disttest.charting.chartbuilder.TimeSeriesBuilderCallbackTest
Running org.apache.qpid.disttest.charting.chartbuilder.ChartProductionTest
main 2014-10-13 13:43:09,478 INFO [qpid.test.utils.QpidTestCase] ========== start ChartProductionTest.testLine3DChart
==========
main 2014-10-13 13:43:09,487 INFO [disttest.charting.writer.ChartWriter] Set chart directory:
/tmp/charts-1413207789482
main 2014-10-13 13:43:10,046 INFO [disttest.charting.writer.ChartWriter] Written /tmp/charts-1413207789482/testLine3DChart.png
chart
main 2014-10-13 13:43:10,046 INFO [qpid.test.utils.QpidTestCase] ========== tearDown ChartProductionTest.testLine3DChart
==========
main 2014-10-13 13:43:10,047 INFO [qpid.test.utils.QpidTestCase] ========== start ChartProductionTest.testXYLineChart
==========
main 2014-10-13 13:43:10,048 INFO [disttest.charting.writer.ChartWriter] Set chart directory:
/tmp/charts-1413207790048
main 2014-10-13 13:43:10,177 INFO [disttest.charting.writer.ChartWriter] Written /tmp/charts-1413207790048/testXYLineChart.png
chart
main 2014-10-13 13:43:10,177 INFO [qpid.test.utils.QpidTestCase] ========== tearDown ChartProductionTest.testXYLineChart
==========
main 2014-10-13 13:43:10,177 INFO [qpid.test.utils.QpidTestCase] ========== start ChartProductionTest.testStatisticalBarChart
==========
main 2014-10-13 13:43:10,178 INFO [disttest.charting.writer.ChartWriter] Set chart directory:
/tmp/charts-1413207790178
main 2014-10-13 13:43:10,277 INFO [disttest.charting.writer.ChartWriter] Written /tmp/charts-1413207790178/testStatisticalBarChart.png
chart
main 2014-10-13 13:43:10,277 INFO [qpid.test.utils.QpidTestCase] ========== tearDown ChartProductionTest.testStatisticalBarChart
==========
main 2014-10-13 13:43:10,277 INFO [qpid.test.utils.QpidTestCase] ========== start ChartProductionTest.testLineChart
==========
main 2014-10-13 13:43:10,278 INFO [disttest.charting.writer.ChartWriter] Set chart directory:
/tmp/charts-1413207790278
main 2014-10-13 13:43:10,356 INFO [disttest.charting.writer.ChartWriter] Written /tmp/charts-1413207790278/testLineChart.png
chart
main 2014-10-13 13:43:10,356 INFO [qpid.test.utils.QpidTestCase] ========== tearDown ChartProductionTest.testLineChart
==========
main 2014-10-13 13:43:10,357 INFO [qpid.test.utils.QpidTestCase] ========== start ChartProductionTest.testBarChart
==========
main 2014-10-13 13:43:10,358 INFO [disttest.charting.writer.ChartWriter] Set chart directory:
/tmp/charts-1413207790358
main 2014-10-13 13:43:10,437 INFO [disttest.charting.writer.ChartWriter] Written /tmp/charts-1413207790358/testBarChart.png
chart
main 2014-10-13 13:43:10,437 INFO [qpid.test.utils.QpidTestCase] ========== tearDown ChartProductionTest.testBarChart
==========
main 2014-10-13 13:43:10,437 INFO [qpid.test.utils.QpidTestCase] ========== start ChartProductionTest.testBar3DChart
==========
main 2014-10-13 13:43:10,438 INFO [disttest.charting.writer.ChartWriter] Set chart directory:
/tmp/charts-1413207790438
main 2014-10-13 13:43:10,515 INFO [disttest.charting.writer.ChartWriter] Written /tmp/charts-1413207790438/testBar3DChart.png
chart
main 2014-10-13 13:43:10,515 INFO [qpid.test.utils.QpidTestCase] ========== tearDown ChartProductionTest.testBar3DChart
==========
main 2014-10-13 13:43:10,515 INFO [qpid.test.utils.QpidTestCase] ========== start ChartProductionTest.testTimeSeriesLineChart
==========
main 2014-10-13 13:43:10,516 INFO [disttest.charting.writer.ChartWriter] Set chart directory:
/tmp/charts-1413207790516
main 2014-10-13 13:43:10,614 INFO [disttest.charting.writer.ChartWriter] Written /tmp/charts-1413207790516/testTimeSeriesLineChart.png
chart
main 2014-10-13 13:43:10,614 INFO [qpid.test.utils.QpidTestCase] ========== tearDown ChartProductionTest.testTimeSeriesLineChart
==========
main 2014-10-13 13:43:10,615 INFO [qpid.test.utils.QpidTestCase] ========== start ChartProductionTest.testXYLineChartWithColourAndWidth
==========
main 2014-10-13 13:43:10,616 INFO [disttest.charting.writer.ChartWriter] Set chart directory:
/tmp/charts-1413207790615
main 2014-10-13 13:43:10,701 INFO [disttest.charting.writer.ChartWriter] Written /tmp/charts-1413207790615/testXYLineChartWithColourAndWidth.png
chart
main 2014-10-13 13:43:10,701 INFO [qpid.test.utils.QpidTestCase] ========== tearDown ChartProductionTest.testXYLineChartWithColourAndWidth
==========
Tests run: 8, Failures: 0, Errors: 0, Skipped: 0, Time elapsed: 1.249 sec - in org.apache.qpid.disttest.charting.chartbuilder.ChartProductionTest
Running org.apache.qpid.disttest.charting.chartbuilder.ChartBuilderFactoryTest
main 2014-10-13 13:43:10,703 INFO [qpid.test.utils.QpidTestCase] ========== start ChartBuilderFactoryTest.testXYLineChart
==========
main 2014-10-13 13:43:10,703 INFO [qpid.test.utils.QpidTestCase] ========== tearDown ChartBuilderFactoryTest.testXYLineChart
==========
main 2014-10-13 13:43:10,704 INFO [qpid.test.utils.QpidTestCase] ========== start ChartBuilderFactoryTest.testLineChart
==========
main 2014-10-13 13:43:10,704 INFO [qpid.test.utils.QpidTestCase] ========== tearDown ChartBuilderFactoryTest.testLineChart
==========
main 2014-10-13 13:43:10,704 INFO [qpid.test.utils.QpidTestCase] ========== start ChartBuilderFactoryTest.testBarChart
==========
main 2014-10-13 13:43:10,704 INFO [qpid.test.utils.QpidTestCase] ========== tearDown ChartBuilderFactoryTest.testBarChart
==========
main 2014-10-13 13:43:10,705 INFO [qpid.test.utils.QpidTestCase] ========== start ChartBuilderFactoryTest.testTimeSeriesLineChart
==========
main 2014-10-13 13:43:10,705 INFO [qpid.test.utils.QpidTestCase] ========== tearDown ChartBuilderFactoryTest.testTimeSeriesLineChart
==========
main 2014-10-13 13:43:10,705 INFO [qpid.test.utils.QpidTestCase] ========== start ChartBuilderFactoryTest.testLineChart3D
==========
main 2014-10-13 13:43:10,705 INFO [qpid.test.utils.QpidTestCase] ========== tearDown ChartBuilderFactoryTest.testLineChart3D
==========
main 2014-10-13 13:43:10,706 INFO [qpid.test.utils.QpidTestCase] ========== start ChartBuilderFactoryTest.testBarChart3D
==========
main 2014-10-13 13:43:10,706 INFO [qpid.test.utils.QpidTestCase] ========== tearDown ChartBuilderFactoryTest.testBarChart3D
==========
Tests run: 6, Failures: 0, Errors: 0, Skipped: 0, Time elapsed: 0.004 sec - in org.apache.qpid.disttest.charting.chartbuilder.ChartBuilderFactoryTest
Running org.apache.qpid.disttest.charting.chartbuilder.ColorFactoryTest
main 2014-10-13 13:43:10,707 INFO [qpid.test.utils.QpidTestCase] ========== start ColorFactoryTest.testDarkBlue
==========
main 2014-10-13 13:43:10,708 INFO [qpid.test.utils.QpidTestCase] ========== tearDown ColorFactoryTest.testDarkBlue
==========
main 2014-10-13 13:43:10,708 INFO [qpid.test.utils.QpidTestCase] ========== start ColorFactoryTest.testBlue
==========
main 2014-10-13 13:43:10,708 INFO [qpid.test.utils.QpidTestCase] ========== tearDown ColorFactoryTest.testBlue
==========
Tests run: 2, Failures: 0, Errors: 0, Skipped: 0, Time elapsed: 0.001 sec - in org.apache.qpid.disttest.charting.chartbuilder.ColorFactoryTest
Running org.apache.qpid.disttest.charting.writer.ChartWriterTest
main 2014-10-13 13:43:10,725 INFO [disttest.charting.writer.ChartWriter] Set chart directory:
/tmp/TestFileUtils-testDir-1413207790725
main 2014-10-13 13:43:10,800 INFO [disttest.charting.writer.ChartWriter] Written /tmp/TestFileUtils-testDir-1413207790725/chart1.png
chart
main 2014-10-13 13:43:10,800 INFO [disttest.charting.writer.ChartWriter] Only 1 chart image(s)
have been written so no HTML summary file will be produced
main 2014-10-13 13:43:10,800 INFO [qpid.test.utils.QpidTestCase] ========== tearDown null
==========
main 2014-10-13 13:43:10,802 INFO [disttest.charting.writer.ChartWriter] Set chart directory:
/tmp/TestFileUtils-testDir-1413207790801
main 2014-10-13 13:43:10,870 INFO [disttest.charting.writer.ChartWriter] Written /tmp/TestFileUtils-testDir-1413207790801/chart1.png
chart
main 2014-10-13 13:43:10,870 INFO [qpid.test.utils.QpidTestCase] ========== tearDown null
==========
main 2014-10-13 13:43:10,871 INFO [disttest.charting.writer.ChartWriter] Set chart directory:
/tmp/TestFileUtils-testDir-1413207790871
main 2014-10-13 13:43:10,939 INFO [disttest.charting.writer.ChartWriter] Written /tmp/TestFileUtils-testDir-1413207790871/chart2.png
chart
main 2014-10-13 13:43:11,003 INFO [disttest.charting.writer.ChartWriter] Written /tmp/TestFileUtils-testDir-1413207790871/chart1.png
chart
main 2014-10-13 13:43:11,005 DEBUG [disttest.charting.writer.ChartWriter] About to produce
HTML summary file /tmp/TestFileUtils-testDir-1413207790871/chart-summary.html from charts
{/tmp/TestFileUtils-testDir-1413207790871/chart1.png=Mock for ChartingDefinition, hashCode:
17302603, /tmp/TestFileUtils-testDir-1413207790871/chart2.png=Mock for ChartingDefinition,
hashCode: 22150760}
main 2014-10-13 13:43:11,016 INFO [qpid.test.utils.QpidTestCase] ========== tearDown null
==========
Tests run: 3, Failures: 0, Errors: 0, Skipped: 0, Time elapsed: 0.307 sec - in org.apache.qpid.disttest.charting.writer.ChartWriterTest
Running org.apache.qpid.disttest.charting.seriesbuilder.SeriesRowTest
main 2014-10-13 13:43:11,018 INFO [qpid.test.utils.QpidTestCase] ========== start SeriesRowTest.testValidSeriesRowThrowsExceptionIfArrayTooSmall
==========
main 2014-10-13 13:43:11,018 INFO [qpid.test.utils.QpidTestCase] ========== tearDown SeriesRowTest.testValidSeriesRowThrowsExceptionIfArrayTooSmall
==========
main 2014-10-13 13:43:11,018 INFO [qpid.test.utils.QpidTestCase] ========== start SeriesRowTest.testDimension
==========
main 2014-10-13 13:43:11,018 INFO [qpid.test.utils.QpidTestCase] ========== tearDown SeriesRowTest.testDimension
==========
main 2014-10-13 13:43:11,019 INFO [qpid.test.utils.QpidTestCase] ========== start SeriesRowTest.testDimensionAsDouble
==========
main 2014-10-13 13:43:11,019 INFO [qpid.test.utils.QpidTestCase] ========== tearDown SeriesRowTest.testDimensionAsDouble
==========
main 2014-10-13 13:43:11,019 INFO [qpid.test.utils.QpidTestCase] ========== start SeriesRowTest.testDimensionAsString
==========
main 2014-10-13 13:43:11,019 INFO [qpid.test.utils.QpidTestCase] ========== tearDown SeriesRowTest.testDimensionAsString
==========
main 2014-10-13 13:43:11,020 INFO [qpid.test.utils.QpidTestCase] ========== start SeriesRowTest.testValidSeriesRow
==========
main 2014-10-13 13:43:11,020 INFO [qpid.test.utils.QpidTestCase] ========== tearDown SeriesRowTest.testValidSeriesRow
==========
Tests run: 5, Failures: 0, Errors: 0, Skipped: 0, Time elapsed: 0.003 sec - in org.apache.qpid.disttest.charting.seriesbuilder.SeriesRowTest
Running org.apache.qpid.disttest.charting.seriesbuilder.JdbcUrlGeneratorTest
main 2014-10-13 13:43:11,021 INFO [qpid.test.utils.QpidTestCase] ========== start JdbcUrlGeneratorTest.testGetJdbcUrlWithoutProvidingAUrlReturnsCsvUrlWithCorrectDirectory
==========
main 2014-10-13 13:43:11,035 INFO [qpid.test.utils.QpidTestCase] ========== tearDown JdbcUrlGeneratorTest.testGetJdbcUrlWithoutProvidingAUrlReturnsCsvUrlWithCorrectDirectory
==========
main 2014-10-13 13:43:11,035 INFO [qpid.test.utils.QpidTestCase] ========== start JdbcUrlGeneratorTest.testGetJdbcUrlThrowsExceptionWithoutAProvidedUrlOrSeriesDirectory
==========
main 2014-10-13 13:43:11,035 INFO [qpid.test.utils.QpidTestCase] ========== tearDown JdbcUrlGeneratorTest.testGetJdbcUrlThrowsExceptionWithoutAProvidedUrlOrSeriesDirectory
==========
main 2014-10-13 13:43:11,036 INFO [qpid.test.utils.QpidTestCase] ========== start JdbcUrlGeneratorTest.testGetJdbcUrlThrowsExceptionIfUrlProvidedAndSeriesDirectorySpecified
==========
main 2014-10-13 13:43:11,036 INFO [qpid.test.utils.QpidTestCase] ========== tearDown JdbcUrlGeneratorTest.testGetJdbcUrlThrowsExceptionIfUrlProvidedAndSeriesDirectorySpecified
==========
main 2014-10-13 13:43:11,036 INFO [qpid.test.utils.QpidTestCase] ========== start JdbcUrlGeneratorTest.testGetJdbcUrlReturnsProvidedUrl
==========
main 2014-10-13 13:43:11,037 INFO [qpid.test.utils.QpidTestCase] ========== tearDown JdbcUrlGeneratorTest.testGetJdbcUrlReturnsProvidedUrl
==========
Tests run: 4, Failures: 0, Errors: 0, Skipped: 0, Time elapsed: 0.016 sec - in org.apache.qpid.disttest.charting.seriesbuilder.JdbcUrlGeneratorTest
Running org.apache.qpid.disttest.charting.seriesbuilder.JdbcSeriesBuilderTest
main 2014-10-13 13:43:11,038 INFO [qpid.test.utils.QpidTestCase] ========== start JdbcSeriesBuilderTest.testBuildOneSeries
==========
main 2014-10-13 13:43:11,115 INFO [disttest.charting.seriesbuilder.JdbcSeriesBuilder] Loaded
JDBC driver class org.relique.jdbc.csv.CsvDriver
main 2014-10-13 13:43:11,143 INFO [disttest.charting.seriesbuilder.JdbcSeriesBuilder] Created:
JdbcSeriesBuilder[jdbcUrlGenerator=JdbcUrlGenerator[providedJdbdUrl=<null>]]
main 2014-10-13 13:43:11,214 INFO [qpid.test.utils.QpidTestCase] ========== tearDown JdbcSeriesBuilderTest.testBuildOneSeries
==========
Tests run: 1, Failures: 0, Errors: 0, Skipped: 0, Time elapsed: 0.177 sec - in org.apache.qpid.disttest.charting.seriesbuilder.JdbcSeriesBuilderTest
Running org.apache.qpid.disttest.charting.definition.ChartingDefinitionCreatorTest
main 2014-10-13 13:43:11,218 INFO [qpid.test.utils.QpidTestCase] ========== start ChartingDefinitionCreatorTest.testLoadTwoDefinitionsFromDirectory
==========
main 2014-10-13 13:43:11,232 INFO [qpid.test.utils.QpidTestCase] ========== tearDown ChartingDefinitionCreatorTest.testLoadTwoDefinitionsFromDirectory
==========
main 2014-10-13 13:43:11,232 INFO [qpid.test.utils.QpidTestCase] ========== start ChartingDefinitionCreatorTest.testLoadOneDefinitionFromFile
==========
main 2014-10-13 13:43:11,233 INFO [qpid.test.utils.QpidTestCase] ========== tearDown ChartingDefinitionCreatorTest.testLoadOneDefinitionFromFile
==========
main 2014-10-13 13:43:11,234 INFO [qpid.test.utils.QpidTestCase] ========== start ChartingDefinitionCreatorTest.testDefinitionsProperties
==========
main 2014-10-13 13:43:11,234 INFO [qpid.test.utils.QpidTestCase] Set system property "ChartingDefinitionSysProp"
to: "propValue"
main 2014-10-13 13:43:11,235 INFO [qpid.test.utils.QpidTestCase] ========== tearDown ChartingDefinitionCreatorTest.testDefinitionsProperties
==========
main 2014-10-13 13:43:11,235 DEBUG [qpid.test.utils.QpidTestCase] reverting 1 test properties
main 2014-10-13 13:43:11,236 INFO [qpid.test.utils.QpidTestCase] ========== start ChartingDefinitionCreatorTest.testDefinitionFileNotFound
==========
main 2014-10-13 13:43:11,236 INFO [qpid.test.utils.QpidTestCase] ========== tearDown ChartingDefinitionCreatorTest.testDefinitionFileNotFound
==========
Tests run: 4, Failures: 0, Errors: 0, Skipped: 0, Time elapsed: 0.022 sec - in org.apache.qpid.disttest.charting.definition.ChartingDefinitionCreatorTest
Running org.apache.qpid.disttest.charting.definition.SeriesDefinitionCreatorTest
main 2014-10-13 13:43:11,238 INFO [qpid.test.utils.QpidTestCase] ========== start SeriesDefinitionCreatorTest.testSeriesDirectoryAndNameSubstitution
==========
main 2014-10-13 13:43:11,238 INFO [qpid.test.utils.QpidTestCase] Set system property "SeriesDefinitionProp"
to: "propValue"
main 2014-10-13 13:43:11,239 INFO [qpid.test.utils.QpidTestCase] ========== tearDown SeriesDefinitionCreatorTest.testSeriesDirectoryAndNameSubstitution
==========
main 2014-10-13 13:43:11,239 DEBUG [qpid.test.utils.QpidTestCase] reverting 1 test properties
main 2014-10-13 13:43:11,239 INFO [qpid.test.utils.QpidTestCase] ========== start SeriesDefinitionCreatorTest.testTwoSeriesDefinitions
==========
main 2014-10-13 13:43:11,240 INFO [qpid.test.utils.QpidTestCase] ========== tearDown SeriesDefinitionCreatorTest.testTwoSeriesDefinitions
==========
main 2014-10-13 13:43:11,241 INFO [qpid.test.utils.QpidTestCase] ========== start SeriesDefinitionCreatorTest.testOneSeriesDefinition
==========
main 2014-10-13 13:43:11,242 INFO [qpid.test.utils.QpidTestCase] ========== tearDown SeriesDefinitionCreatorTest.testOneSeriesDefinition
==========
main 2014-10-13 13:43:11,242 INFO [qpid.test.utils.QpidTestCase] ========== start SeriesDefinitionCreatorTest.testNonSequentialSeriesDefinitionsIgnored
==========
main 2014-10-13 13:43:11,243 INFO [qpid.test.utils.QpidTestCase] ========== tearDown SeriesDefinitionCreatorTest.testNonSequentialSeriesDefinitionsIgnored
==========
Tests run: 4, Failures: 0, Errors: 0, Skipped: 0, Time elapsed: 0.006 sec - in org.apache.qpid.disttest.charting.definition.SeriesDefinitionCreatorTest

Results :

Tests run: 39, Failures: 0, Errors: 0, Skipped: 0

[INFO] 
[INFO] --- maven-jar-plugin:2.4:jar (default-jar) @ qpid-perftests-visualisation-jfc ---
[INFO] Building jar: <https://builds.apache.org/job/Qpid-Java-Cpp-Test/ws/trunk/qpid/java/perftests/visualisation-jfc/target/qpid-perftests-visualisation-jfc-0.32-SNAPSHOT.jar>
[INFO] 
[INFO] --- maven-site-plugin:3.3:attach-descriptor (attach-descriptor) @ qpid-perftests-visualisation-jfc
---
[INFO] 
[INFO] --- maven-antrun-plugin:1.7:run (create-qbtc-output-dir) @ qpid-perftests-visualisation-jfc
---
[INFO] Executing tasks

main:
    [mkdir] Created dir: <https://builds.apache.org/job/Qpid-Java-Cpp-Test/ws/trunk/qpid/java/perftests/visualisation-jfc/target/qbtc-output>
[INFO] Executed tasks
[INFO]                                                                         
[INFO] ------------------------------------------------------------------------
[INFO] Skipping Qpid BDB Store System Tests
[INFO] This project has been banned from the build due to previous failures.
[INFO] ------------------------------------------------------------------------
[INFO] ------------------------------------------------------------------------
[INFO] Reactor Summary:
[INFO] 
[INFO] Qpid Java Build ................................... SUCCESS [2.207s]
[INFO] Qpid AMQP 1.0 Common .............................. SUCCESS [4.959s]
[INFO] Qpid AMQP 1.0 Client .............................. SUCCESS [0.622s]
[INFO] Qpid AMQP 1.0 Client JMS .......................... SUCCESS [1.429s]
[INFO] Qpid AMQP 1.0 JMS Client Examples ................. SUCCESS [0.210s]
[INFO] Qpid AMQP 1.0 Client WebSocket .................... SUCCESS [0.463s]
[INFO] Qpid Broker Code Generation ....................... SUCCESS [0.191s]
[INFO] Qpid Test Utilities ............................... SUCCESS [0.201s]
[INFO] Qpid Common ....................................... SUCCESS [30.338s]
[INFO] Qpid Management Common ............................ SUCCESS [0.961s]
[INFO] Qpid Java Broker Core ............................. SUCCESS [1:18.450s]
[INFO] Qpid Access Control Broker Plug-in ................ SUCCESS [3.928s]
[INFO] Qpid AMQP 0-8 Protocol Broker Plug-in ............. SUCCESS [20.436s]
[INFO] Qpid AMQP 0-10 Protocol Plug-in ................... SUCCESS [3.797s]
[INFO] Qpid AMQP 1-0 Protocol Broker Plug-in ............. SUCCESS [0.389s]
[INFO] Qpid AMQP 0-8 to 0-10 Message Conversion Broker Plug-in  SUCCESS [0.224s]
[INFO] Qpid AMQP 0-8 to 1-0 Message Conversion Broker Plug-in  SUCCESS [0.225s]
[INFO] Qpid AMQP 0-10 to 1-0 Message Conversion Broker Plug-in  SUCCESS [0.200s]
[INFO] Qpid Derby Message Store .......................... SUCCESS [16.313s]
[INFO] Qpid JDBC Message Store Connection Pooling Plug-in  SUCCESS [0.188s]
[INFO] Qpid JDBC Message Store Broker Plug-in ............ SUCCESS [8.814s]
[INFO] Qpid HTTP Management Broker Plug-in ............... SUCCESS [4.311s]
[INFO] Qpid JMX Management Broker Plug-in ................ SUCCESS [3.316s]
[INFO] Qpid Memory Message Store Broker Plug-in .......... SUCCESS [0.235s]
[INFO] Qpid WebSocket Broker Plug-in ..................... SUCCESS [0.263s]
[INFO] Qpid AMQP 0-x JMS Client .......................... SUCCESS [6.910s]
[INFO] Qpid BDB Message Store ............................ SUCCESS [1:53.307s]
[INFO] Qpid BDB Message Store JMX ........................ SUCCESS [1.892s]
[INFO] Qpid Java Broker .................................. SUCCESS [4.553s]
[INFO] Qpid AMQP Management Protocol Broker Plug-in ...... SUCCESS [0.182s]
[INFO] Qpid AMQP 0-x JMS Client Examples ................. SUCCESS [0.141s]
[INFO] Qpid JCA .......................................... SUCCESS [1.492s]
[INFO] Qpid Resource Adaptor ............................. SUCCESS [0.407s]
[INFO] Qpid Tools ........................................ SUCCESS [0.243s]
[INFO] Qpid Management Examples .......................... SUCCESS [0.103s]
[INFO] Qpid Java System Test Parent ...................... SUCCESS [0.694s]
[INFO] Qpid System Tests ................................. FAILURE [7:50.865s]
[INFO] Qpid Performance Tests ............................ SUCCESS [12.798s]
[INFO] Qpid Performance Test System Tests ................ SKIPPED
[INFO] Qpid Performance Tests Visualisation JFC .......... SUCCESS [3.845s]
[INFO] Qpid BDB Store System Tests ....................... SKIPPED
[INFO] ------------------------------------------------------------------------
[INFO] BUILD FAILURE
[INFO] ------------------------------------------------------------------------
[INFO] Total time: 13:21.130s
[INFO] Finished at: Mon Oct 13 13:43:11 UTC 2014
[INFO] Final Memory: 70M/310M
[INFO] ------------------------------------------------------------------------
[ERROR] Failed to execute goal org.apache.maven.plugins:maven-surefire-plugin:2.16:test (integration-test)
on project qpid-systests: There are test failures.
[ERROR] 
[ERROR] Please refer to <https://builds.apache.org/job/Qpid-Java-Cpp-Test/ws/trunk/qpid/java/systests/target/surefire-reports>
for the individual test results.
[ERROR] -> [Help 1]
[ERROR] 
[ERROR] To see the full stack trace of the errors, re-run Maven with the -e switch.
[ERROR] Re-run Maven using the -X switch to enable full debug logging.
[ERROR] 
[ERROR] For more information about the errors and possible solutions, please read the following
articles:
[ERROR] [Help 1] http://cwiki.apache.org/confluence/display/MAVEN/MojoFailureException
[ERROR] 
[ERROR] After correcting the problems, you can resume the build with the command
[ERROR]   mvn <goals> -rf :qpid-systests
Build step 'Invoke top-level Maven targets' marked build as failure
[locks-and-latches] Releasing all the locks
[locks-and-latches] All the locks released
Recording test results

Mime
View raw message