qpid-notifications mailing list archives

Site index · List index
Message view « Date » · « Thread »
Top « Date » · « Thread »
From Apache Jenkins Server <jenk...@builds.apache.org>
Subject Build failed in Jenkins: Qpid-Java-Cpp-Test #2213
Date Wed, 15 Oct 2014 16:49:30 GMT
See <https://builds.apache.org/job/Qpid-Java-Cpp-Test/2213/changes>

Changes:

[macbean] QPID-6138: [Java Perf Tests] Update perf test chart def descriptions

------------------------------------------
[...truncated 16897 lines...]
[INFO] skip non existing resourceDirectory <https://builds.apache.org/job/Qpid-Java-Cpp-Test/ws/trunk/qpid/java/perftests/visualisation-jfc/src/main/resources>
[INFO] Copying 0 resource
[INFO] Copying 3 resources
[INFO] 
[INFO] --- maven-compiler-plugin:3.1:compile (default-compile) @ qpid-perftests-visualisation-jfc
---
[INFO] Changes detected - recompiling the module!
[INFO] Compiling 30 source files to <https://builds.apache.org/job/Qpid-Java-Cpp-Test/ws/trunk/qpid/java/perftests/visualisation-jfc/target/classes>
[INFO] 
[INFO] --- maven-resources-plugin:2.6:testResources (default-testResources) @ qpid-perftests-visualisation-jfc
---
[INFO] Using 'UTF-8' encoding to copy filtered resources.
[INFO] Copying 1 resource
[INFO] skip non existing resourceDirectory <https://builds.apache.org/job/Qpid-Java-Cpp-Test/ws/trunk/qpid/java/perftests/visualisation-jfc/src/test/resources>
[INFO] Copying 3 resources
[INFO] 
[INFO] --- maven-compiler-plugin:3.1:testCompile (default-testCompile) @ qpid-perftests-visualisation-jfc
---
[INFO] Changes detected - recompiling the module!
[INFO] Compiling 11 source files to <https://builds.apache.org/job/Qpid-Java-Cpp-Test/ws/trunk/qpid/java/perftests/visualisation-jfc/target/test-classes>
[INFO] 
[INFO] --- maven-surefire-plugin:2.16:test (default-test) @ qpid-perftests-visualisation-jfc
---
[INFO] Surefire report directory: <https://builds.apache.org/job/Qpid-Java-Cpp-Test/ws/trunk/qpid/java/perftests/visualisation-jfc/target/surefire-reports>

-------------------------------------------------------
 T E S T S
-------------------------------------------------------
Running org.apache.qpid.disttest.charting.chartbuilder.BaseChartBuilderTest
main 2014-10-15 16:49:03,563 INFO [qpid.test.utils.QpidTestCase] Some tests should be excluded,
building the exclude list
main 2014-10-15 16:49:03,565 INFO [qpid.test.utils.QpidTestCase] Specified exclude file does
not exist: <https://builds.apache.org/job/Qpid-Java-Cpp-Test/ws/trunk/qpid/java/perftests/visualisation-jfc/../test-profiles//Excludes>
main 2014-10-15 16:49:03,565 INFO [qpid.test.utils.QpidTestCase] Specified exclude file does
not exist: <https://builds.apache.org/job/Qpid-Java-Cpp-Test/ws/trunk/qpid/java/perftests/visualisation-jfc/../test-profiles//CPPExcludes>
main 2014-10-15 16:49:03,565 INFO [qpid.test.utils.QpidTestCase] Specified exclude file does
not exist: <https://builds.apache.org/job/Qpid-Java-Cpp-Test/ws/trunk/qpid/java/perftests/visualisation-jfc/../test-profiles//cpp.excludes>
main 2014-10-15 16:49:03,565 INFO [qpid.test.utils.QpidTestCase] Specified exclude file does
not exist: <https://builds.apache.org/job/Qpid-Java-Cpp-Test/ws/trunk/qpid/java/perftests/visualisation-jfc/../test-profiles//CPPPrefetchExcludes>
main 2014-10-15 16:49:03,566 INFO [qpid.test.utils.QpidTestCase] Specified exclude file does
not exist: <https://builds.apache.org/job/Qpid-Java-Cpp-Test/ws/trunk/qpid/java/perftests/visualisation-jfc/../test-profiles//CPPTransientExcludes>
main 2014-10-15 16:49:03,566 INFO [qpid.test.utils.QpidTestCase] Specified exclude file does
not exist: <https://builds.apache.org/job/Qpid-Java-Cpp-Test/ws/trunk/qpid/java/perftests/visualisation-jfc/../test-profiles//cpp.excludes>
main 2014-10-15 16:49:04,146 INFO [qpid.test.utils.QpidTestCase] ========== start BaseChartBuilderTest.testBuildChart
==========
main 2014-10-15 16:49:04,460 INFO [qpid.test.utils.QpidTestCase] ========== tearDown BaseChartBuilderTest.testBuildChart
==========
Tests run: 1, Failures: 0, Errors: 0, Skipped: 0, Time elapsed: 1.422 sec - in org.apache.qpid.disttest.charting.chartbuilder.BaseChartBuilderTest
Running org.apache.qpid.disttest.charting.chartbuilder.TimeSeriesBuilderCallbackTest
main 2014-10-15 16:49:04,464 INFO [qpid.test.utils.QpidTestCase] ========== start TimeSeriesBuilderCallbackTest.testAddPointToSeries
==========
main 2014-10-15 16:49:04,546 INFO [qpid.test.utils.QpidTestCase] ========== tearDown TimeSeriesBuilderCallbackTest.testAddPointToSeries
==========
Tests run: 1, Failures: 0, Errors: 0, Skipped: 0, Time elapsed: 0.083 sec - in org.apache.qpid.disttest.charting.chartbuilder.TimeSeriesBuilderCallbackTest
Running org.apache.qpid.disttest.charting.chartbuilder.ChartProductionTest
main 2014-10-15 16:49:04,582 INFO [qpid.test.utils.QpidTestCase] ========== start ChartProductionTest.testLine3DChart
==========
main 2014-10-15 16:49:04,593 INFO [disttest.charting.writer.ChartWriter] Set chart directory:
/tmp/charts-1413391744587
main 2014-10-15 16:49:05,377 INFO [disttest.charting.writer.ChartWriter] Written /tmp/charts-1413391744587/testLine3DChart.png
chart
main 2014-10-15 16:49:05,377 INFO [qpid.test.utils.QpidTestCase] ========== tearDown ChartProductionTest.testLine3DChart
==========
main 2014-10-15 16:49:05,378 INFO [qpid.test.utils.QpidTestCase] ========== start ChartProductionTest.testXYLineChart
==========
main 2014-10-15 16:49:05,380 INFO [disttest.charting.writer.ChartWriter] Set chart directory:
/tmp/charts-1413391745379
main 2014-10-15 16:49:05,550 INFO [disttest.charting.writer.ChartWriter] Written /tmp/charts-1413391745379/testXYLineChart.png
chart
main 2014-10-15 16:49:05,550 INFO [qpid.test.utils.QpidTestCase] ========== tearDown ChartProductionTest.testXYLineChart
==========
main 2014-10-15 16:49:05,551 INFO [qpid.test.utils.QpidTestCase] ========== start ChartProductionTest.testStatisticalBarChart
==========
main 2014-10-15 16:49:05,552 INFO [disttest.charting.writer.ChartWriter] Set chart directory:
/tmp/charts-1413391745552
main 2014-10-15 16:49:05,673 INFO [disttest.charting.writer.ChartWriter] Written /tmp/charts-1413391745552/testStatisticalBarChart.png
chart
main 2014-10-15 16:49:05,673 INFO [qpid.test.utils.QpidTestCase] ========== tearDown ChartProductionTest.testStatisticalBarChart
==========
main 2014-10-15 16:49:05,673 INFO [qpid.test.utils.QpidTestCase] ========== start ChartProductionTest.testLineChart
==========
main 2014-10-15 16:49:05,674 INFO [disttest.charting.writer.ChartWriter] Set chart directory:
/tmp/charts-1413391745674
main 2014-10-15 16:49:05,774 INFO [disttest.charting.writer.ChartWriter] Written /tmp/charts-1413391745674/testLineChart.png
chart
main 2014-10-15 16:49:05,774 INFO [qpid.test.utils.QpidTestCase] ========== tearDown ChartProductionTest.testLineChart
==========
main 2014-10-15 16:49:05,774 INFO [qpid.test.utils.QpidTestCase] ========== start ChartProductionTest.testBarChart
==========
main 2014-10-15 16:49:05,776 INFO [disttest.charting.writer.ChartWriter] Set chart directory:
/tmp/charts-1413391745776
main 2014-10-15 16:49:05,868 INFO [disttest.charting.writer.ChartWriter] Written /tmp/charts-1413391745776/testBarChart.png
chart
main 2014-10-15 16:49:05,868 INFO [qpid.test.utils.QpidTestCase] ========== tearDown ChartProductionTest.testBarChart
==========
main 2014-10-15 16:49:05,869 INFO [qpid.test.utils.QpidTestCase] ========== start ChartProductionTest.testBar3DChart
==========
main 2014-10-15 16:49:05,870 INFO [disttest.charting.writer.ChartWriter] Set chart directory:
/tmp/charts-1413391745870
main 2014-10-15 16:49:05,978 INFO [disttest.charting.writer.ChartWriter] Written /tmp/charts-1413391745870/testBar3DChart.png
chart
main 2014-10-15 16:49:05,978 INFO [qpid.test.utils.QpidTestCase] ========== tearDown ChartProductionTest.testBar3DChart
==========
main 2014-10-15 16:49:05,979 INFO [qpid.test.utils.QpidTestCase] ========== start ChartProductionTest.testTimeSeriesLineChart
==========
main 2014-10-15 16:49:05,980 INFO [disttest.charting.writer.ChartWriter] Set chart directory:
/tmp/charts-1413391745979
main 2014-10-15 16:49:06,103 INFO [disttest.charting.writer.ChartWriter] Written /tmp/charts-1413391745979/testTimeSeriesLineChart.png
chart
main 2014-10-15 16:49:06,103 INFO [qpid.test.utils.QpidTestCase] ========== tearDown ChartProductionTest.testTimeSeriesLineChart
==========
main 2014-10-15 16:49:06,104 INFO [qpid.test.utils.QpidTestCase] ========== start ChartProductionTest.testXYLineChartWithColourAndWidth
==========
main 2014-10-15 16:49:06,105 INFO [disttest.charting.writer.ChartWriter] Set chart directory:
/tmp/charts-1413391746105
main 2014-10-15 16:49:06,205 INFO [disttest.charting.writer.ChartWriter] Written /tmp/charts-1413391746105/testXYLineChartWithColourAndWidth.png
chart
main 2014-10-15 16:49:06,205 INFO [qpid.test.utils.QpidTestCase] ========== tearDown ChartProductionTest.testXYLineChartWithColourAndWidth
==========
Tests run: 8, Failures: 0, Errors: 0, Skipped: 0, Time elapsed: 1.658 sec - in org.apache.qpid.disttest.charting.chartbuilder.ChartProductionTest
Running org.apache.qpid.disttest.charting.chartbuilder.ChartBuilderFactoryTest
main 2014-10-15 16:49:06,208 INFO [qpid.test.utils.QpidTestCase] ========== start ChartBuilderFactoryTest.testXYLineChart
==========
main 2014-10-15 16:49:06,208 INFO [qpid.test.utils.QpidTestCase] ========== tearDown ChartBuilderFactoryTest.testXYLineChart
==========
main 2014-10-15 16:49:06,208 INFO [qpid.test.utils.QpidTestCase] ========== start ChartBuilderFactoryTest.testLineChart
==========
main 2014-10-15 16:49:06,208 INFO [qpid.test.utils.QpidTestCase] ========== tearDown ChartBuilderFactoryTest.testLineChart
==========
main 2014-10-15 16:49:06,209 INFO [qpid.test.utils.QpidTestCase] ========== start ChartBuilderFactoryTest.testBarChart
==========
main 2014-10-15 16:49:06,209 INFO [qpid.test.utils.QpidTestCase] ========== tearDown ChartBuilderFactoryTest.testBarChart
==========
main 2014-10-15 16:49:06,210 INFO [qpid.test.utils.QpidTestCase] ========== start ChartBuilderFactoryTest.testTimeSeriesLineChart
==========
main 2014-10-15 16:49:06,210 INFO [qpid.test.utils.QpidTestCase] ========== tearDown ChartBuilderFactoryTest.testTimeSeriesLineChart
==========
main 2014-10-15 16:49:06,210 INFO [qpid.test.utils.QpidTestCase] ========== start ChartBuilderFactoryTest.testLineChart3D
==========
main 2014-10-15 16:49:06,210 INFO [qpid.test.utils.QpidTestCase] ========== tearDown ChartBuilderFactoryTest.testLineChart3D
==========
main 2014-10-15 16:49:06,211 INFO [qpid.test.utils.QpidTestCase] ========== start ChartBuilderFactoryTest.testBarChart3D
==========
main 2014-10-15 16:49:06,211 INFO [qpid.test.utils.QpidTestCase] ========== tearDown ChartBuilderFactoryTest.testBarChart3D
==========
Tests run: 6, Failures: 0, Errors: 0, Skipped: 0, Time elapsed: 0.006 sec - in org.apache.qpid.disttest.charting.chartbuilder.ChartBuilderFactoryTest
Running org.apache.qpid.disttest.charting.chartbuilder.ColorFactoryTest
main 2014-10-15 16:49:06,213 INFO [qpid.test.utils.QpidTestCase] ========== start ColorFactoryTest.testDarkBlue
==========
main 2014-10-15 16:49:06,214 INFO [qpid.test.utils.QpidTestCase] ========== tearDown ColorFactoryTest.testDarkBlue
==========
main 2014-10-15 16:49:06,215 INFO [qpid.test.utils.QpidTestCase] ========== start ColorFactoryTest.testBlue
==========
main 2014-10-15 16:49:06,215 INFO [qpid.test.utils.QpidTestCase] ========== tearDown ColorFactoryTest.testBlue
==========
Tests run: 2, Failures: 0, Errors: 0, Skipped: 0, Time elapsed: 0.002 sec - in org.apache.qpid.disttest.charting.chartbuilder.ColorFactoryTest
Running org.apache.qpid.disttest.charting.writer.ChartWriterTest
main 2014-10-15 16:49:06,236 INFO [disttest.charting.writer.ChartWriter] Set chart directory:
/tmp/TestFileUtils-testDir-1413391746236
main 2014-10-15 16:49:06,324 INFO [disttest.charting.writer.ChartWriter] Written /tmp/TestFileUtils-testDir-1413391746236/chart1.png
chart
main 2014-10-15 16:49:06,325 INFO [disttest.charting.writer.ChartWriter] Only 1 chart image(s)
have been written so no HTML summary file will be produced
main 2014-10-15 16:49:06,325 INFO [qpid.test.utils.QpidTestCase] ========== tearDown null
==========
main 2014-10-15 16:49:06,327 INFO [disttest.charting.writer.ChartWriter] Set chart directory:
/tmp/TestFileUtils-testDir-1413391746326
main 2014-10-15 16:49:06,413 INFO [disttest.charting.writer.ChartWriter] Written /tmp/TestFileUtils-testDir-1413391746326/chart1.png
chart
main 2014-10-15 16:49:06,413 INFO [qpid.test.utils.QpidTestCase] ========== tearDown null
==========
main 2014-10-15 16:49:06,415 INFO [disttest.charting.writer.ChartWriter] Set chart directory:
/tmp/TestFileUtils-testDir-1413391746415
main 2014-10-15 16:49:06,486 INFO [disttest.charting.writer.ChartWriter] Written /tmp/TestFileUtils-testDir-1413391746415/chart2.png
chart
main 2014-10-15 16:49:06,559 INFO [disttest.charting.writer.ChartWriter] Written /tmp/TestFileUtils-testDir-1413391746415/chart1.png
chart
main 2014-10-15 16:49:06,560 DEBUG [disttest.charting.writer.ChartWriter] About to produce
HTML summary file /tmp/TestFileUtils-testDir-1413391746415/chart-summary.html from charts
{/tmp/TestFileUtils-testDir-1413391746415/chart1.png=Mock for ChartingDefinition, hashCode:
13900970, /tmp/TestFileUtils-testDir-1413391746415/chart2.png=Mock for ChartingDefinition,
hashCode: 27654930}
main 2014-10-15 16:49:06,570 INFO [qpid.test.utils.QpidTestCase] ========== tearDown null
==========
Tests run: 3, Failures: 0, Errors: 0, Skipped: 0, Time elapsed: 0.355 sec - in org.apache.qpid.disttest.charting.writer.ChartWriterTest
Running org.apache.qpid.disttest.charting.seriesbuilder.SeriesRowTest
main 2014-10-15 16:49:06,573 INFO [qpid.test.utils.QpidTestCase] ========== start SeriesRowTest.testValidSeriesRowThrowsExceptionIfArrayTooSmall
==========
main 2014-10-15 16:49:06,573 INFO [qpid.test.utils.QpidTestCase] ========== tearDown SeriesRowTest.testValidSeriesRowThrowsExceptionIfArrayTooSmall
==========
main 2014-10-15 16:49:06,574 INFO [qpid.test.utils.QpidTestCase] ========== start SeriesRowTest.testDimension
==========
main 2014-10-15 16:49:06,574 INFO [qpid.test.utils.QpidTestCase] ========== tearDown SeriesRowTest.testDimension
==========
main 2014-10-15 16:49:06,574 INFO [qpid.test.utils.QpidTestCase] ========== start SeriesRowTest.testDimensionAsDouble
==========
main 2014-10-15 16:49:06,575 INFO [qpid.test.utils.QpidTestCase] ========== tearDown SeriesRowTest.testDimensionAsDouble
==========
main 2014-10-15 16:49:06,575 INFO [qpid.test.utils.QpidTestCase] ========== start SeriesRowTest.testDimensionAsString
==========
main 2014-10-15 16:49:06,575 INFO [qpid.test.utils.QpidTestCase] ========== tearDown SeriesRowTest.testDimensionAsString
==========
main 2014-10-15 16:49:06,576 INFO [qpid.test.utils.QpidTestCase] ========== start SeriesRowTest.testValidSeriesRow
==========
main 2014-10-15 16:49:06,576 INFO [qpid.test.utils.QpidTestCase] ========== tearDown SeriesRowTest.testValidSeriesRow
==========
Tests run: 5, Failures: 0, Errors: 0, Skipped: 0, Time elapsed: 0.004 sec - in org.apache.qpid.disttest.charting.seriesbuilder.SeriesRowTest
Running org.apache.qpid.disttest.charting.seriesbuilder.JdbcUrlGeneratorTest
main 2014-10-15 16:49:06,578 INFO [qpid.test.utils.QpidTestCase] ========== start JdbcUrlGeneratorTest.testGetJdbcUrlWithoutProvidingAUrlReturnsCsvUrlWithCorrectDirectory
==========
main 2014-10-15 16:49:06,593 INFO [qpid.test.utils.QpidTestCase] ========== tearDown JdbcUrlGeneratorTest.testGetJdbcUrlWithoutProvidingAUrlReturnsCsvUrlWithCorrectDirectory
==========
main 2014-10-15 16:49:06,593 INFO [qpid.test.utils.QpidTestCase] ========== start JdbcUrlGeneratorTest.testGetJdbcUrlThrowsExceptionWithoutAProvidedUrlOrSeriesDirectory
==========
main 2014-10-15 16:49:06,594 INFO [qpid.test.utils.QpidTestCase] ========== tearDown JdbcUrlGeneratorTest.testGetJdbcUrlThrowsExceptionWithoutAProvidedUrlOrSeriesDirectory
==========
main 2014-10-15 16:49:06,594 INFO [qpid.test.utils.QpidTestCase] ========== start JdbcUrlGeneratorTest.testGetJdbcUrlThrowsExceptionIfUrlProvidedAndSeriesDirectorySpecified
==========
main 2014-10-15 16:49:06,595 INFO [qpid.test.utils.QpidTestCase] ========== tearDown JdbcUrlGeneratorTest.testGetJdbcUrlThrowsExceptionIfUrlProvidedAndSeriesDirectorySpecified
==========
main 2014-10-15 16:49:06,595 INFO [qpid.test.utils.QpidTestCase] ========== start JdbcUrlGeneratorTest.testGetJdbcUrlReturnsProvidedUrl
==========
main 2014-10-15 16:49:06,596 INFO [qpid.test.utils.QpidTestCase] ========== tearDown JdbcUrlGeneratorTest.testGetJdbcUrlReturnsProvidedUrl
==========
Tests run: 4, Failures: 0, Errors: 0, Skipped: 0, Time elapsed: 0.019 sec - in org.apache.qpid.disttest.charting.seriesbuilder.JdbcUrlGeneratorTest
Running org.apache.qpid.disttest.charting.seriesbuilder.JdbcSeriesBuilderTest
main 2014-10-15 16:49:06,598 INFO [qpid.test.utils.QpidTestCase] ========== start JdbcSeriesBuilderTest.testBuildOneSeries
==========
main 2014-10-15 16:49:06,665 INFO [disttest.charting.seriesbuilder.JdbcSeriesBuilder] Loaded
JDBC driver class org.relique.jdbc.csv.CsvDriver
main 2014-10-15 16:49:06,706 INFO [disttest.charting.seriesbuilder.JdbcSeriesBuilder] Created:
JdbcSeriesBuilder[jdbcUrlGenerator=JdbcUrlGenerator[providedJdbdUrl=<null>]]
main 2014-10-15 16:49:06,799 INFO [qpid.test.utils.QpidTestCase] ========== tearDown JdbcSeriesBuilderTest.testBuildOneSeries
==========
Tests run: 1, Failures: 0, Errors: 0, Skipped: 0, Time elapsed: 0.203 sec - in org.apache.qpid.disttest.charting.seriesbuilder.JdbcSeriesBuilderTest
Running org.apache.qpid.disttest.charting.definition.ChartingDefinitionCreatorTest
main 2014-10-15 16:49:06,805 INFO [qpid.test.utils.QpidTestCase] ========== start ChartingDefinitionCreatorTest.testLoadTwoDefinitionsFromDirectory
==========
main 2014-10-15 16:49:06,824 INFO [qpid.test.utils.QpidTestCase] ========== tearDown ChartingDefinitionCreatorTest.testLoadTwoDefinitionsFromDirectory
==========
main 2014-10-15 16:49:06,825 INFO [qpid.test.utils.QpidTestCase] ========== start ChartingDefinitionCreatorTest.testLoadOneDefinitionFromFile
==========
main 2014-10-15 16:49:06,827 INFO [qpid.test.utils.QpidTestCase] ========== tearDown ChartingDefinitionCreatorTest.testLoadOneDefinitionFromFile
==========
main 2014-10-15 16:49:06,827 INFO [qpid.test.utils.QpidTestCase] ========== start ChartingDefinitionCreatorTest.testDefinitionsProperties
==========
main 2014-10-15 16:49:06,828 INFO [qpid.test.utils.QpidTestCase] Set system property "ChartingDefinitionSysProp"
to: "propValue"
main 2014-10-15 16:49:06,830 INFO [qpid.test.utils.QpidTestCase] ========== tearDown ChartingDefinitionCreatorTest.testDefinitionsProperties
==========
main 2014-10-15 16:49:06,830 DEBUG [qpid.test.utils.QpidTestCase] reverting 1 test properties
main 2014-10-15 16:49:06,830 INFO [qpid.test.utils.QpidTestCase] ========== start ChartingDefinitionCreatorTest.testDefinitionFileNotFound
==========
main 2014-10-15 16:49:06,831 INFO [qpid.test.utils.QpidTestCase] ========== tearDown ChartingDefinitionCreatorTest.testDefinitionFileNotFound
==========
Tests run: 4, Failures: 0, Errors: 0, Skipped: 0, Time elapsed: 0.031 sec - in org.apache.qpid.disttest.charting.definition.ChartingDefinitionCreatorTest
Running org.apache.qpid.disttest.charting.definition.SeriesDefinitionCreatorTest
main 2014-10-15 16:49:06,835 INFO [qpid.test.utils.QpidTestCase] ========== start SeriesDefinitionCreatorTest.testSeriesDirectoryAndNameSubstitution
==========
main 2014-10-15 16:49:06,835 INFO [qpid.test.utils.QpidTestCase] Set system property "SeriesDefinitionProp"
to: "propValue"
main 2014-10-15 16:49:06,836 INFO [qpid.test.utils.QpidTestCase] ========== tearDown SeriesDefinitionCreatorTest.testSeriesDirectoryAndNameSubstitution
==========
main 2014-10-15 16:49:06,837 DEBUG [qpid.test.utils.QpidTestCase] reverting 1 test properties
main 2014-10-15 16:49:06,837 INFO [qpid.test.utils.QpidTestCase] ========== start SeriesDefinitionCreatorTest.testTwoSeriesDefinitions
==========
main 2014-10-15 16:49:06,839 INFO [qpid.test.utils.QpidTestCase] ========== tearDown SeriesDefinitionCreatorTest.testTwoSeriesDefinitions
==========
main 2014-10-15 16:49:06,839 INFO [qpid.test.utils.QpidTestCase] ========== start SeriesDefinitionCreatorTest.testOneSeriesDefinition
==========
main 2014-10-15 16:49:06,841 INFO [qpid.test.utils.QpidTestCase] ========== tearDown SeriesDefinitionCreatorTest.testOneSeriesDefinition
==========
main 2014-10-15 16:49:06,841 INFO [qpid.test.utils.QpidTestCase] ========== start SeriesDefinitionCreatorTest.testNonSequentialSeriesDefinitionsIgnored
==========
main 2014-10-15 16:49:06,842 INFO [qpid.test.utils.QpidTestCase] ========== tearDown SeriesDefinitionCreatorTest.testNonSequentialSeriesDefinitionsIgnored
==========
Tests run: 4, Failures: 0, Errors: 0, Skipped: 0, Time elapsed: 0.01 sec - in org.apache.qpid.disttest.charting.definition.SeriesDefinitionCreatorTest

Results :

Tests run: 39, Failures: 0, Errors: 0, Skipped: 0

[INFO] 
[INFO] --- maven-jar-plugin:2.4:jar (default-jar) @ qpid-perftests-visualisation-jfc ---
[INFO] Building jar: <https://builds.apache.org/job/Qpid-Java-Cpp-Test/ws/trunk/qpid/java/perftests/visualisation-jfc/target/qpid-perftests-visualisation-jfc-0.32-SNAPSHOT.jar>
[INFO] 
[INFO] --- maven-site-plugin:3.3:attach-descriptor (attach-descriptor) @ qpid-perftests-visualisation-jfc
---
[INFO] 
[INFO] --- maven-antrun-plugin:1.7:run (create-qbtc-output-dir) @ qpid-perftests-visualisation-jfc
---
[INFO] Executing tasks

main:
    [mkdir] Created dir: <https://builds.apache.org/job/Qpid-Java-Cpp-Test/ws/trunk/qpid/java/perftests/visualisation-jfc/target/qbtc-output>
[INFO] Executed tasks
[INFO]                                                                         
[INFO] ------------------------------------------------------------------------
[INFO] Skipping Qpid BDB Store System Tests
[INFO] This project has been banned from the build due to previous failures.
[INFO] ------------------------------------------------------------------------
[INFO] ------------------------------------------------------------------------
[INFO] Reactor Summary:
[INFO] 
[INFO] Qpid Java Build ................................... SUCCESS [2.249s]
[INFO] Qpid AMQP 1.0 Common .............................. SUCCESS [5.240s]
[INFO] Qpid AMQP 1.0 Client .............................. SUCCESS [0.628s]
[INFO] Qpid AMQP 1.0 Client JMS .......................... SUCCESS [1.852s]
[INFO] Qpid AMQP 1.0 JMS Client Examples ................. SUCCESS [0.240s]
[INFO] Qpid AMQP 1.0 Client WebSocket .................... SUCCESS [0.558s]
[INFO] Qpid Broker Code Generation ....................... SUCCESS [0.226s]
[INFO] Qpid Test Utilities ............................... SUCCESS [0.267s]
[INFO] Qpid Common ....................................... SUCCESS [31.088s]
[INFO] Qpid Management Common ............................ SUCCESS [1.195s]
[INFO] Qpid Java Broker Core ............................. SUCCESS [1:18.987s]
[INFO] Qpid Access Control Broker Plug-in ................ SUCCESS [3.919s]
[INFO] Qpid AMQP 0-8 Protocol Broker Plug-in ............. SUCCESS [20.370s]
[INFO] Qpid AMQP 0-10 Protocol Plug-in ................... SUCCESS [3.875s]
[INFO] Qpid AMQP 1-0 Protocol Broker Plug-in ............. SUCCESS [0.431s]
[INFO] Qpid AMQP 0-8 to 0-10 Message Conversion Broker Plug-in  SUCCESS [0.272s]
[INFO] Qpid AMQP 0-8 to 1-0 Message Conversion Broker Plug-in  SUCCESS [0.241s]
[INFO] Qpid AMQP 0-10 to 1-0 Message Conversion Broker Plug-in  SUCCESS [0.257s]
[INFO] Qpid Derby Message Store .......................... SUCCESS [14.806s]
[INFO] Qpid JDBC Message Store Connection Pooling Plug-in  SUCCESS [0.330s]
[INFO] Qpid JDBC Message Store Broker Plug-in ............ SUCCESS [9.350s]
[INFO] Qpid HTTP Management Broker Plug-in ............... SUCCESS [4.787s]
[INFO] Qpid JMX Management Broker Plug-in ................ SUCCESS [3.166s]
[INFO] Qpid Memory Message Store Broker Plug-in .......... SUCCESS [0.394s]
[INFO] Qpid WebSocket Broker Plug-in ..................... SUCCESS [0.281s]
[INFO] Qpid AMQP 0-x JMS Client .......................... SUCCESS [7.866s]
[INFO] Qpid BDB Message Store ............................ SUCCESS [1:54.854s]
[INFO] Qpid BDB Message Store JMX ........................ SUCCESS [1.998s]
[INFO] Qpid Java Broker .................................. SUCCESS [4.763s]
[INFO] Qpid AMQP Management Protocol Broker Plug-in ...... SUCCESS [0.268s]
[INFO] Qpid AMQP 0-x JMS Client Examples ................. SUCCESS [0.135s]
[INFO] Qpid JCA .......................................... SUCCESS [1.577s]
[INFO] Qpid Resource Adaptor ............................. SUCCESS [0.411s]
[INFO] Qpid Tools ........................................ SUCCESS [0.259s]
[INFO] Qpid Management Examples .......................... SUCCESS [0.169s]
[INFO] Qpid Java System Test Parent ...................... SUCCESS [0.760s]
[INFO] Qpid System Tests ................................. FAILURE [8:07.276s]
[INFO] Qpid Performance Tests ............................ SUCCESS [15.259s]
[INFO] Qpid Performance Test System Tests ................ SKIPPED
[INFO] Qpid Performance Tests Visualisation JFC .......... SUCCESS [5.239s]
[INFO] Qpid BDB Store System Tests ....................... SKIPPED
[INFO] ------------------------------------------------------------------------
[INFO] BUILD FAILURE
[INFO] ------------------------------------------------------------------------
[INFO] Total time: 13:47.039s
[INFO] Finished at: Wed Oct 15 16:49:06 UTC 2014
[INFO] Final Memory: 70M/337M
[INFO] ------------------------------------------------------------------------
[ERROR] Failed to execute goal org.apache.maven.plugins:maven-surefire-plugin:2.16:test (integration-test)
on project qpid-systests: There are test failures.
[ERROR] 
[ERROR] Please refer to <https://builds.apache.org/job/Qpid-Java-Cpp-Test/ws/trunk/qpid/java/systests/target/surefire-reports>
for the individual test results.
[ERROR] -> [Help 1]
[ERROR] 
[ERROR] To see the full stack trace of the errors, re-run Maven with the -e switch.
[ERROR] Re-run Maven using the -X switch to enable full debug logging.
[ERROR] 
[ERROR] For more information about the errors and possible solutions, please read the following
articles:
[ERROR] [Help 1] http://cwiki.apache.org/confluence/display/MAVEN/MojoFailureException
[ERROR] 
[ERROR] After correcting the problems, you can resume the build with the command
[ERROR]   mvn <goals> -rf :qpid-systests
Build step 'Invoke top-level Maven targets' marked build as failure
[locks-and-latches] Releasing all the locks
[locks-and-latches] All the locks released
Recording test results

Mime
View raw message