qpid-notifications mailing list archives

Site index · List index
Message view « Date » · « Thread »
Top « Date » · « Thread »
From Apache Jenkins Server <jenk...@builds.apache.org>
Subject Build failed in Jenkins: Qpid-Java-Cpp-Test #2061
Date Mon, 11 Aug 2014 10:47:53 GMT
See <https://builds.apache.org/job/Qpid-Java-Cpp-Test/2061/changes>

Changes:

[rgodfrey] QPID-5978 : [Java Client] deal with protocol initialisation failures such as unsupported
versions, or attempting to connect to an HTTP port

[kwall] QPID-5984: [Java Broker] Queue tab improvements

* Revert to two column layout to optimise use of screen space
* Expose flow control, oldest message age and maximum delivery attempt attributes

[kwall] QPID-5982: [Java Broker] BDB HA: Reset replication transaction id when contact with
remote node is lost

* Change BDB HA VHN tab so that replication transaction id -1 is shown as N/A
* Adjust width of VH table on Broker tab to avoid state UNAVAIABLE wrapping over two lines.

[kwall] QPID-5983: [Java Broker] BDB HA: Reset role to DETACHED when BDB HA VHN is stopped.

------------------------------------------
[...truncated 17502 lines...]
[INFO] skip non existing resourceDirectory /x1/jenkins/jenkins-slave/workspace/Qpid-Java-Cpp-Test/trunk/qpid/java/perftests/visualisation-jfc/src/main/resources
[INFO] Copying 0 resource
[INFO] Copying 3 resources
[INFO] 
[INFO] --- maven-compiler-plugin:3.1:compile (default-compile) @ qpid-perftests-visualisation-jfc
---
[INFO] Changes detected - recompiling the module!
[INFO] Compiling 30 source files to /x1/jenkins/jenkins-slave/workspace/Qpid-Java-Cpp-Test/trunk/qpid/java/perftests/visualisation-jfc/target/classes
[INFO] 
[INFO] --- maven-resources-plugin:2.6:testResources (default-testResources) @ qpid-perftests-visualisation-jfc
---
[INFO] Using 'UTF-8' encoding to copy filtered resources.
[INFO] Copying 1 resource
[INFO] skip non existing resourceDirectory /x1/jenkins/jenkins-slave/workspace/Qpid-Java-Cpp-Test/trunk/qpid/java/perftests/visualisation-jfc/src/test/resources
[INFO] Copying 3 resources
[INFO] 
[INFO] --- maven-compiler-plugin:3.1:testCompile (default-testCompile) @ qpid-perftests-visualisation-jfc
---
[INFO] Changes detected - recompiling the module!
[INFO] Compiling 11 source files to /x1/jenkins/jenkins-slave/workspace/Qpid-Java-Cpp-Test/trunk/qpid/java/perftests/visualisation-jfc/target/test-classes
[INFO] 
[INFO] --- maven-surefire-plugin:2.16:test (default-test) @ qpid-perftests-visualisation-jfc
---
[INFO] Surefire report directory: /x1/jenkins/jenkins-slave/workspace/Qpid-Java-Cpp-Test/trunk/qpid/java/perftests/visualisation-jfc/target/surefire-reports

-------------------------------------------------------
 T E S T S
-------------------------------------------------------
Running org.apache.qpid.disttest.charting.seriesbuilder.SeriesRowTest
main 2014-08-11 10:47:46,294 INFO [qpid.test.utils.QpidTestCase] Some tests should be excluded,
building the exclude list
main 2014-08-11 10:47:46,296 INFO [qpid.test.utils.QpidTestCase] Specified exclude file does
not exist: /x1/jenkins/jenkins-slave/workspace/Qpid-Java-Cpp-Test/trunk/qpid/java/perftests/visualisation-jfc/../test-profiles//Excludes
main 2014-08-11 10:47:46,296 INFO [qpid.test.utils.QpidTestCase] Specified exclude file does
not exist: /x1/jenkins/jenkins-slave/workspace/Qpid-Java-Cpp-Test/trunk/qpid/java/perftests/visualisation-jfc/../test-profiles//CPPExcludes
main 2014-08-11 10:47:46,296 INFO [qpid.test.utils.QpidTestCase] Specified exclude file does
not exist: /x1/jenkins/jenkins-slave/workspace/Qpid-Java-Cpp-Test/trunk/qpid/java/perftests/visualisation-jfc/../test-profiles//cpp.excludes
main 2014-08-11 10:47:46,296 INFO [qpid.test.utils.QpidTestCase] Specified exclude file does
not exist: /x1/jenkins/jenkins-slave/workspace/Qpid-Java-Cpp-Test/trunk/qpid/java/perftests/visualisation-jfc/../test-profiles//CPPPrefetchExcludes
main 2014-08-11 10:47:46,296 INFO [qpid.test.utils.QpidTestCase] Specified exclude file does
not exist: /x1/jenkins/jenkins-slave/workspace/Qpid-Java-Cpp-Test/trunk/qpid/java/perftests/visualisation-jfc/../test-profiles//CPPTransientExcludes
main 2014-08-11 10:47:46,296 INFO [qpid.test.utils.QpidTestCase] Specified exclude file does
not exist: /x1/jenkins/jenkins-slave/workspace/Qpid-Java-Cpp-Test/trunk/qpid/java/perftests/visualisation-jfc/../test-profiles//cpp.excludes
main 2014-08-11 10:47:46,303 INFO [qpid.test.utils.QpidTestCase] ========== start SeriesRowTest.testValidSeriesRowThrowsExceptionIfArrayTooSmall
==========
main 2014-08-11 10:47:46,304 INFO [qpid.test.utils.QpidTestCase] ========== tearDown SeriesRowTest.testValidSeriesRowThrowsExceptionIfArrayTooSmall
==========
main 2014-08-11 10:47:46,305 INFO [qpid.test.utils.QpidTestCase] ========== start SeriesRowTest.testDimension
==========
main 2014-08-11 10:47:46,305 INFO [qpid.test.utils.QpidTestCase] ========== tearDown SeriesRowTest.testDimension
==========
main 2014-08-11 10:47:46,306 INFO [qpid.test.utils.QpidTestCase] ========== start SeriesRowTest.testDimensionAsDouble
==========
main 2014-08-11 10:47:46,306 INFO [qpid.test.utils.QpidTestCase] ========== tearDown SeriesRowTest.testDimensionAsDouble
==========
main 2014-08-11 10:47:46,307 INFO [qpid.test.utils.QpidTestCase] ========== start SeriesRowTest.testDimensionAsString
==========
main 2014-08-11 10:47:46,307 INFO [qpid.test.utils.QpidTestCase] ========== tearDown SeriesRowTest.testDimensionAsString
==========
main 2014-08-11 10:47:46,307 INFO [qpid.test.utils.QpidTestCase] ========== start SeriesRowTest.testValidSeriesRow
==========
main 2014-08-11 10:47:46,307 INFO [qpid.test.utils.QpidTestCase] ========== tearDown SeriesRowTest.testValidSeriesRow
==========
Tests run: 5, Failures: 0, Errors: 0, Skipped: 0, Time elapsed: 0.146 sec - in org.apache.qpid.disttest.charting.seriesbuilder.SeriesRowTest
Running org.apache.qpid.disttest.charting.seriesbuilder.JdbcSeriesBuilderTest
main 2014-08-11 10:47:46,443 INFO [qpid.test.utils.QpidTestCase] ========== start JdbcSeriesBuilderTest.testBuildOneSeries
==========
main 2014-08-11 10:47:46,497 INFO [disttest.charting.seriesbuilder.JdbcSeriesBuilder] Loaded
JDBC driver class org.relique.jdbc.csv.CsvDriver
main 2014-08-11 10:47:46,514 INFO [disttest.charting.seriesbuilder.JdbcSeriesBuilder] Created:
JdbcSeriesBuilder[jdbcUrlGenerator=JdbcUrlGenerator[providedJdbdUrl=<null>]]
main 2014-08-11 10:47:46,559 INFO [qpid.test.utils.QpidTestCase] ========== tearDown JdbcSeriesBuilderTest.testBuildOneSeries
==========
Tests run: 1, Failures: 0, Errors: 0, Skipped: 0, Time elapsed: 0.251 sec - in org.apache.qpid.disttest.charting.seriesbuilder.JdbcSeriesBuilderTest
Running org.apache.qpid.disttest.charting.seriesbuilder.JdbcUrlGeneratorTest
main 2014-08-11 10:47:46,560 INFO [qpid.test.utils.QpidTestCase] ========== start JdbcUrlGeneratorTest.testGetJdbcUrlWithoutProvidingAUrlReturnsCsvUrlWithCorrectDirectory
==========
main 2014-08-11 10:47:46,566 INFO [qpid.test.utils.QpidTestCase] ========== tearDown JdbcUrlGeneratorTest.testGetJdbcUrlWithoutProvidingAUrlReturnsCsvUrlWithCorrectDirectory
==========
main 2014-08-11 10:47:46,566 INFO [qpid.test.utils.QpidTestCase] ========== start JdbcUrlGeneratorTest.testGetJdbcUrlThrowsExceptionWithoutAProvidedUrlOrSeriesDirectory
==========
main 2014-08-11 10:47:46,567 INFO [qpid.test.utils.QpidTestCase] ========== tearDown JdbcUrlGeneratorTest.testGetJdbcUrlThrowsExceptionWithoutAProvidedUrlOrSeriesDirectory
==========
main 2014-08-11 10:47:46,568 INFO [qpid.test.utils.QpidTestCase] ========== start JdbcUrlGeneratorTest.testGetJdbcUrlThrowsExceptionIfUrlProvidedAndSeriesDirectorySpecified
==========
main 2014-08-11 10:47:46,568 INFO [qpid.test.utils.QpidTestCase] ========== tearDown JdbcUrlGeneratorTest.testGetJdbcUrlThrowsExceptionIfUrlProvidedAndSeriesDirectorySpecified
==========
main 2014-08-11 10:47:46,568 INFO [qpid.test.utils.QpidTestCase] ========== start JdbcUrlGeneratorTest.testGetJdbcUrlReturnsProvidedUrl
==========
main 2014-08-11 10:47:46,569 INFO [qpid.test.utils.QpidTestCase] ========== tearDown JdbcUrlGeneratorTest.testGetJdbcUrlReturnsProvidedUrl
==========
Tests run: 4, Failures: 0, Errors: 0, Skipped: 0, Time elapsed: 0.009 sec - in org.apache.qpid.disttest.charting.seriesbuilder.JdbcUrlGeneratorTest
Running org.apache.qpid.disttest.charting.chartbuilder.ColorFactoryTest
main 2014-08-11 10:47:46,570 INFO [qpid.test.utils.QpidTestCase] ========== start ColorFactoryTest.testDarkBlue
==========
main 2014-08-11 10:47:46,591 INFO [qpid.test.utils.QpidTestCase] ========== tearDown ColorFactoryTest.testDarkBlue
==========
main 2014-08-11 10:47:46,592 INFO [qpid.test.utils.QpidTestCase] ========== start ColorFactoryTest.testBlue
==========
main 2014-08-11 10:47:46,592 INFO [qpid.test.utils.QpidTestCase] ========== tearDown ColorFactoryTest.testBlue
==========
Tests run: 2, Failures: 0, Errors: 0, Skipped: 0, Time elapsed: 0.024 sec - in org.apache.qpid.disttest.charting.chartbuilder.ColorFactoryTest
Running org.apache.qpid.disttest.charting.chartbuilder.BaseChartBuilderTest
main 2014-08-11 10:47:46,661 INFO [qpid.test.utils.QpidTestCase] ========== start BaseChartBuilderTest.testBuildChart
==========
main 2014-08-11 10:47:46,790 INFO [qpid.test.utils.QpidTestCase] ========== tearDown BaseChartBuilderTest.testBuildChart
==========
Tests run: 1, Failures: 0, Errors: 0, Skipped: 0, Time elapsed: 0.198 sec - in org.apache.qpid.disttest.charting.chartbuilder.BaseChartBuilderTest
Running org.apache.qpid.disttest.charting.chartbuilder.ChartBuilderFactoryTest
main 2014-08-11 10:47:46,794 INFO [qpid.test.utils.QpidTestCase] ========== start ChartBuilderFactoryTest.testXYLineChart
==========
main 2014-08-11 10:47:46,796 INFO [qpid.test.utils.QpidTestCase] ========== tearDown ChartBuilderFactoryTest.testXYLineChart
==========
main 2014-08-11 10:47:46,797 INFO [qpid.test.utils.QpidTestCase] ========== start ChartBuilderFactoryTest.testLineChart
==========
main 2014-08-11 10:47:46,798 INFO [qpid.test.utils.QpidTestCase] ========== tearDown ChartBuilderFactoryTest.testLineChart
==========
main 2014-08-11 10:47:46,799 INFO [qpid.test.utils.QpidTestCase] ========== start ChartBuilderFactoryTest.testBarChart
==========
main 2014-08-11 10:47:46,799 INFO [qpid.test.utils.QpidTestCase] ========== tearDown ChartBuilderFactoryTest.testBarChart
==========
main 2014-08-11 10:47:46,800 INFO [qpid.test.utils.QpidTestCase] ========== start ChartBuilderFactoryTest.testTimeSeriesLineChart
==========
main 2014-08-11 10:47:46,801 INFO [qpid.test.utils.QpidTestCase] ========== tearDown ChartBuilderFactoryTest.testTimeSeriesLineChart
==========
main 2014-08-11 10:47:46,802 INFO [qpid.test.utils.QpidTestCase] ========== start ChartBuilderFactoryTest.testLineChart3D
==========
main 2014-08-11 10:47:46,802 INFO [qpid.test.utils.QpidTestCase] ========== tearDown ChartBuilderFactoryTest.testLineChart3D
==========
main 2014-08-11 10:47:46,803 INFO [qpid.test.utils.QpidTestCase] ========== start ChartBuilderFactoryTest.testBarChart3D
==========
main 2014-08-11 10:47:46,804 INFO [qpid.test.utils.QpidTestCase] ========== tearDown ChartBuilderFactoryTest.testBarChart3D
==========
Tests run: 6, Failures: 0, Errors: 0, Skipped: 0, Time elapsed: 0.013 sec - in org.apache.qpid.disttest.charting.chartbuilder.ChartBuilderFactoryTest
Running org.apache.qpid.disttest.charting.chartbuilder.TimeSeriesBuilderCallbackTest
main 2014-08-11 10:47:46,806 INFO [qpid.test.utils.QpidTestCase] ========== start TimeSeriesBuilderCallbackTest.testAddPointToSeries
==========
main 2014-08-11 10:47:46,839 INFO [qpid.test.utils.QpidTestCase] ========== tearDown TimeSeriesBuilderCallbackTest.testAddPointToSeries
==========
Tests run: 1, Failures: 0, Errors: 0, Skipped: 0, Time elapsed: 0.034 sec - in org.apache.qpid.disttest.charting.chartbuilder.TimeSeriesBuilderCallbackTest
Running org.apache.qpid.disttest.charting.chartbuilder.ChartProductionTest
main 2014-08-11 10:47:46,845 INFO [qpid.test.utils.QpidTestCase] ========== start ChartProductionTest.testLine3DChart
==========
main 2014-08-11 10:47:46,849 INFO [disttest.charting.writer.ChartWriter] Set chart directory:
/tmp/charts-1407754066847
main 2014-08-11 10:47:47,358 INFO [disttest.charting.writer.ChartWriter] Written /tmp/charts-1407754066847/testLine3DChart.png
chart
main 2014-08-11 10:47:47,358 INFO [qpid.test.utils.QpidTestCase] ========== tearDown ChartProductionTest.testLine3DChart
==========
main 2014-08-11 10:47:47,358 INFO [qpid.test.utils.QpidTestCase] ========== start ChartProductionTest.testXYLineChart
==========
main 2014-08-11 10:47:47,359 INFO [disttest.charting.writer.ChartWriter] Set chart directory:
/tmp/charts-1407754067359
main 2014-08-11 10:47:47,456 INFO [disttest.charting.writer.ChartWriter] Written /tmp/charts-1407754067359/testXYLineChart.png
chart
main 2014-08-11 10:47:47,457 INFO [qpid.test.utils.QpidTestCase] ========== tearDown ChartProductionTest.testXYLineChart
==========
main 2014-08-11 10:47:47,457 INFO [qpid.test.utils.QpidTestCase] ========== start ChartProductionTest.testStatisticalBarChart
==========
main 2014-08-11 10:47:47,458 INFO [disttest.charting.writer.ChartWriter] Set chart directory:
/tmp/charts-1407754067457
main 2014-08-11 10:47:47,528 INFO [disttest.charting.writer.ChartWriter] Written /tmp/charts-1407754067457/testStatisticalBarChart.png
chart
main 2014-08-11 10:47:47,529 INFO [qpid.test.utils.QpidTestCase] ========== tearDown ChartProductionTest.testStatisticalBarChart
==========
main 2014-08-11 10:47:47,529 INFO [qpid.test.utils.QpidTestCase] ========== start ChartProductionTest.testLineChart
==========
main 2014-08-11 10:47:47,529 INFO [disttest.charting.writer.ChartWriter] Set chart directory:
/tmp/charts-1407754067529
main 2014-08-11 10:47:47,595 INFO [disttest.charting.writer.ChartWriter] Written /tmp/charts-1407754067529/testLineChart.png
chart
main 2014-08-11 10:47:47,596 INFO [qpid.test.utils.QpidTestCase] ========== tearDown ChartProductionTest.testLineChart
==========
main 2014-08-11 10:47:47,596 INFO [qpid.test.utils.QpidTestCase] ========== start ChartProductionTest.testBarChart
==========
main 2014-08-11 10:47:47,596 INFO [disttest.charting.writer.ChartWriter] Set chart directory:
/tmp/charts-1407754067596
main 2014-08-11 10:47:47,661 INFO [disttest.charting.writer.ChartWriter] Written /tmp/charts-1407754067596/testBarChart.png
chart
main 2014-08-11 10:47:47,661 INFO [qpid.test.utils.QpidTestCase] ========== tearDown ChartProductionTest.testBarChart
==========
main 2014-08-11 10:47:47,662 INFO [qpid.test.utils.QpidTestCase] ========== start ChartProductionTest.testBar3DChart
==========
main 2014-08-11 10:47:47,662 INFO [disttest.charting.writer.ChartWriter] Set chart directory:
/tmp/charts-1407754067662
main 2014-08-11 10:47:47,725 INFO [disttest.charting.writer.ChartWriter] Written /tmp/charts-1407754067662/testBar3DChart.png
chart
main 2014-08-11 10:47:47,725 INFO [qpid.test.utils.QpidTestCase] ========== tearDown ChartProductionTest.testBar3DChart
==========
main 2014-08-11 10:47:47,725 INFO [qpid.test.utils.QpidTestCase] ========== start ChartProductionTest.testTimeSeriesLineChart
==========
main 2014-08-11 10:47:47,726 INFO [disttest.charting.writer.ChartWriter] Set chart directory:
/tmp/charts-1407754067726
main 2014-08-11 10:47:47,799 INFO [disttest.charting.writer.ChartWriter] Written /tmp/charts-1407754067726/testTimeSeriesLineChart.png
chart
main 2014-08-11 10:47:47,800 INFO [qpid.test.utils.QpidTestCase] ========== tearDown ChartProductionTest.testTimeSeriesLineChart
==========
main 2014-08-11 10:47:47,800 INFO [qpid.test.utils.QpidTestCase] ========== start ChartProductionTest.testXYLineChartWithColourAndWidth
==========
main 2014-08-11 10:47:47,800 INFO [disttest.charting.writer.ChartWriter] Set chart directory:
/tmp/charts-1407754067800
main 2014-08-11 10:47:47,910 INFO [disttest.charting.writer.ChartWriter] Written /tmp/charts-1407754067800/testXYLineChartWithColourAndWidth.png
chart
main 2014-08-11 10:47:47,910 INFO [qpid.test.utils.QpidTestCase] ========== tearDown ChartProductionTest.testXYLineChartWithColourAndWidth
==========
Tests run: 8, Failures: 0, Errors: 0, Skipped: 0, Time elapsed: 1.071 sec - in org.apache.qpid.disttest.charting.chartbuilder.ChartProductionTest
Running org.apache.qpid.disttest.charting.definition.SeriesDefinitionCreatorTest
main 2014-08-11 10:47:47,913 INFO [qpid.test.utils.QpidTestCase] ========== start SeriesDefinitionCreatorTest.testSeriesDirectoryAndNameSubstitution
==========
main 2014-08-11 10:47:47,913 INFO [qpid.test.utils.QpidTestCase] Set system property "SeriesDefinitionProp"
to: "propValue"
main 2014-08-11 10:47:47,921 INFO [qpid.test.utils.QpidTestCase] ========== tearDown SeriesDefinitionCreatorTest.testSeriesDirectoryAndNameSubstitution
==========
main 2014-08-11 10:47:47,921 DEBUG [qpid.test.utils.QpidTestCase] reverting 1 test properties
main 2014-08-11 10:47:47,921 INFO [qpid.test.utils.QpidTestCase] ========== start SeriesDefinitionCreatorTest.testTwoSeriesDefinitions
==========
main 2014-08-11 10:47:47,923 INFO [qpid.test.utils.QpidTestCase] ========== tearDown SeriesDefinitionCreatorTest.testTwoSeriesDefinitions
==========
main 2014-08-11 10:47:47,924 INFO [qpid.test.utils.QpidTestCase] ========== start SeriesDefinitionCreatorTest.testOneSeriesDefinition
==========
main 2014-08-11 10:47:47,925 INFO [qpid.test.utils.QpidTestCase] ========== tearDown SeriesDefinitionCreatorTest.testOneSeriesDefinition
==========
main 2014-08-11 10:47:47,925 INFO [qpid.test.utils.QpidTestCase] ========== start SeriesDefinitionCreatorTest.testNonSequentialSeriesDefinitionsIgnored
==========
main 2014-08-11 10:47:47,926 INFO [qpid.test.utils.QpidTestCase] ========== tearDown SeriesDefinitionCreatorTest.testNonSequentialSeriesDefinitionsIgnored
==========
Tests run: 4, Failures: 0, Errors: 0, Skipped: 0, Time elapsed: 0.016 sec - in org.apache.qpid.disttest.charting.definition.SeriesDefinitionCreatorTest
Running org.apache.qpid.disttest.charting.definition.ChartingDefinitionCreatorTest
main 2014-08-11 10:47:47,929 INFO [qpid.test.utils.QpidTestCase] ========== start ChartingDefinitionCreatorTest.testLoadTwoDefinitionsFromDirectory
==========
main 2014-08-11 10:47:47,939 INFO [qpid.test.utils.QpidTestCase] ========== tearDown ChartingDefinitionCreatorTest.testLoadTwoDefinitionsFromDirectory
==========
main 2014-08-11 10:47:47,939 INFO [qpid.test.utils.QpidTestCase] ========== start ChartingDefinitionCreatorTest.testLoadOneDefinitionFromFile
==========
main 2014-08-11 10:47:47,941 INFO [qpid.test.utils.QpidTestCase] ========== tearDown ChartingDefinitionCreatorTest.testLoadOneDefinitionFromFile
==========
main 2014-08-11 10:47:47,942 INFO [qpid.test.utils.QpidTestCase] ========== start ChartingDefinitionCreatorTest.testDefinitionsProperties
==========
main 2014-08-11 10:47:47,942 INFO [qpid.test.utils.QpidTestCase] Set system property "ChartingDefinitionSysProp"
to: "propValue"
main 2014-08-11 10:47:47,943 INFO [qpid.test.utils.QpidTestCase] ========== tearDown ChartingDefinitionCreatorTest.testDefinitionsProperties
==========
main 2014-08-11 10:47:47,944 DEBUG [qpid.test.utils.QpidTestCase] reverting 1 test properties
main 2014-08-11 10:47:47,944 INFO [qpid.test.utils.QpidTestCase] ========== start ChartingDefinitionCreatorTest.testDefinitionFileNotFound
==========
main 2014-08-11 10:47:47,945 INFO [qpid.test.utils.QpidTestCase] ========== tearDown ChartingDefinitionCreatorTest.testDefinitionFileNotFound
==========
Tests run: 4, Failures: 0, Errors: 0, Skipped: 0, Time elapsed: 0.018 sec - in org.apache.qpid.disttest.charting.definition.ChartingDefinitionCreatorTest
Running org.apache.qpid.disttest.charting.writer.ChartWriterTest
main 2014-08-11 10:47:47,961 INFO [disttest.charting.writer.ChartWriter] Set chart directory:
/tmp/TestFileUtils-testDir-1407754067961
main 2014-08-11 10:47:48,063 INFO [disttest.charting.writer.ChartWriter] Written /tmp/TestFileUtils-testDir-1407754067961/chart1.png
chart
main 2014-08-11 10:47:48,063 INFO [disttest.charting.writer.ChartWriter] Only 1 chart image(s)
have been written so no HTML summary file will be produced
main 2014-08-11 10:47:48,063 INFO [qpid.test.utils.QpidTestCase] ========== tearDown null
==========
main 2014-08-11 10:47:48,064 INFO [disttest.charting.writer.ChartWriter] Set chart directory:
/tmp/TestFileUtils-testDir-1407754068064
main 2014-08-11 10:47:48,115 INFO [disttest.charting.writer.ChartWriter] Written /tmp/TestFileUtils-testDir-1407754068064/chart1.png
chart
main 2014-08-11 10:47:48,115 INFO [qpid.test.utils.QpidTestCase] ========== tearDown null
==========
main 2014-08-11 10:47:48,116 INFO [disttest.charting.writer.ChartWriter] Set chart directory:
/tmp/TestFileUtils-testDir-1407754068116
main 2014-08-11 10:47:48,168 INFO [disttest.charting.writer.ChartWriter] Written /tmp/TestFileUtils-testDir-1407754068116/chart2.png
chart
main 2014-08-11 10:47:48,220 INFO [disttest.charting.writer.ChartWriter] Written /tmp/TestFileUtils-testDir-1407754068116/chart1.png
chart
main 2014-08-11 10:47:48,220 DEBUG [disttest.charting.writer.ChartWriter] About to produce
HTML summary file /tmp/TestFileUtils-testDir-1407754068116/chart-summary.html from charts
{/tmp/TestFileUtils-testDir-1407754068116/chart1.png=Mock for ChartingDefinition, hashCode:
28363848, /tmp/TestFileUtils-testDir-1407754068116/chart2.png=Mock for ChartingDefinition,
hashCode: 3380234}
main 2014-08-11 10:47:48,226 INFO [qpid.test.utils.QpidTestCase] ========== tearDown null
==========
Tests run: 3, Failures: 0, Errors: 0, Skipped: 0, Time elapsed: 0.281 sec - in org.apache.qpid.disttest.charting.writer.ChartWriterTest

Results :

Tests run: 39, Failures: 0, Errors: 0, Skipped: 0

[INFO] 
[INFO] --- maven-jar-plugin:2.4:jar (default-jar) @ qpid-perftests-visualisation-jfc ---
[INFO] Building jar: /x1/jenkins/jenkins-slave/workspace/Qpid-Java-Cpp-Test/trunk/qpid/java/perftests/visualisation-jfc/target/qpid-perftests-visualisation-jfc-0.32-SNAPSHOT.jar
[INFO] 
[INFO] --- maven-site-plugin:3.3:attach-descriptor (attach-descriptor) @ qpid-perftests-visualisation-jfc
---
[INFO] 
[INFO] --- maven-antrun-plugin:1.7:run (create-qbtc-output-dir) @ qpid-perftests-visualisation-jfc
---
[INFO] Executing tasks

main:
    [mkdir] Created dir: /x1/jenkins/jenkins-slave/workspace/Qpid-Java-Cpp-Test/trunk/qpid/java/perftests/visualisation-jfc/target/qbtc-output
[INFO] Executed tasks
[INFO]                                                                         
[INFO] ------------------------------------------------------------------------
[INFO] Skipping Qpid BDB Store System Tests
[INFO] This project has been banned from the build due to previous failures.
[INFO] ------------------------------------------------------------------------
[INFO] ------------------------------------------------------------------------
[INFO] Reactor Summary:
[INFO] 
[INFO] Qpid Java Build ................................... SUCCESS [1.818s]
[INFO] Qpid AMQP 1.0 Common .............................. SUCCESS [10.223s]
[INFO] Qpid AMQP 1.0 Client .............................. SUCCESS [1.371s]
[INFO] Qpid AMQP 1.0 Client JMS .......................... SUCCESS [3.009s]
[INFO] Qpid AMQP 1.0 JMS Client Examples ................. SUCCESS [0.263s]
[INFO] Qpid AMQP 1.0 Client WebSocket .................... SUCCESS [1.541s]
[INFO] Qpid Broker Code Generation ....................... SUCCESS [0.751s]
[INFO] Qpid Test Utilities ............................... SUCCESS [0.794s]
[INFO] Qpid Common ....................................... SUCCESS [38.503s]
[INFO] Qpid Management Common ............................ SUCCESS [1.362s]
[INFO] Qpid Java Broker Core ............................. SUCCESS [1:29.750s]
[INFO] Qpid Access Control Broker Plug-in ................ SUCCESS [2.650s]
[INFO] Qpid AMQP 0-8 Protocol Broker Plug-in ............. SUCCESS [19.078s]
[INFO] Qpid AMQP 0-10 Protocol Plug-in ................... SUCCESS [1.981s]
[INFO] Qpid AMQP 1-0 Protocol Broker Plug-in ............. SUCCESS [0.441s]
[INFO] Qpid AMQP 0-8 to 0-10 Message Conversion Broker Plug-in  SUCCESS [0.261s]
[INFO] Qpid AMQP 0-8 to 1-0 Message Conversion Broker Plug-in  SUCCESS [0.289s]
[INFO] Qpid AMQP 0-10 to 1-0 Message Conversion Broker Plug-in  SUCCESS [0.257s]
[INFO] Qpid Derby Message Store .......................... SUCCESS [1:38.184s]
[INFO] Qpid JDBC Message Store Connection Pooling Plug-in  SUCCESS [0.481s]
[INFO] Qpid JDBC Message Store Broker Plug-in ............ SUCCESS [6.566s]
[INFO] Qpid HTTP Management Broker Plug-in ............... SUCCESS [3.252s]
[INFO] Qpid JMX Management Broker Plug-in ................ SUCCESS [2.464s]
[INFO] Qpid Memory Message Store Broker Plug-in .......... SUCCESS [0.996s]
[INFO] Qpid AMQP 0-x JMS Client .......................... SUCCESS [7.312s]
[INFO] Qpid BDB Message Store ............................ SUCCESS [2:01.537s]
[INFO] Qpid BDB Message Store JMX ........................ SUCCESS [1.113s]
[INFO] Qpid Java Broker .................................. SUCCESS [3.986s]
[INFO] Qpid AMQP Management Protocol Broker Plug-in ...... SUCCESS [0.230s]
[INFO] Qpid WebSocket Broker Plug-in ..................... SUCCESS [0.247s]
[INFO] Qpid AMQP 0-x JMS Client Examples ................. SUCCESS [0.155s]
[INFO] Qpid JCA .......................................... SUCCESS [1.177s]
[INFO] Qpid Resource Adaptor ............................. SUCCESS [0.523s]
[INFO] Qpid Tools ........................................ SUCCESS [0.481s]
[INFO] Qpid Management Examples .......................... SUCCESS [0.148s]
[INFO] Qpid Java System Test Parent ...................... SUCCESS [0.769s]
[INFO] Qpid System Tests ................................. FAILURE [6:13.793s]
[INFO] Qpid Performance Tests ............................ SUCCESS [14.572s]
[INFO] Qpid Performance Test System Tests ................ SKIPPED
[INFO] Qpid Performance Tests Visualisation JFC .......... SUCCESS [2.702s]
[INFO] Qpid BDB Store System Tests ....................... SKIPPED
[INFO] ------------------------------------------------------------------------
[INFO] BUILD FAILURE
[INFO] ------------------------------------------------------------------------
[INFO] Total time: 13:35.899s
[INFO] Finished at: Mon Aug 11 10:47:48 UTC 2014
[INFO] Final Memory: 68M/382M
[INFO] ------------------------------------------------------------------------
[ERROR] Failed to execute goal org.apache.maven.plugins:maven-surefire-plugin:2.16:test (integration-test)
on project qpid-systests: There are test failures.
[ERROR] 
[ERROR] Please refer to /x1/jenkins/jenkins-slave/workspace/Qpid-Java-Cpp-Test/trunk/qpid/java/systests/target/surefire-reports
for the individual test results.
[ERROR] -> [Help 1]
[ERROR] 
[ERROR] To see the full stack trace of the errors, re-run Maven with the -e switch.
[ERROR] Re-run Maven using the -X switch to enable full debug logging.
[ERROR] 
[ERROR] For more information about the errors and possible solutions, please read the following
articles:
[ERROR] [Help 1] http://cwiki.apache.org/confluence/display/MAVEN/MojoFailureException
[ERROR] 
[ERROR] After correcting the problems, you can resume the build with the command
[ERROR]   mvn <goals> -rf :qpid-systests
Build step 'Invoke top-level Maven targets' marked build as failure
[locks-and-latches] Releasing all the locks
[locks-and-latches] All the locks released
Recording test results

Mime
View raw message