qpid-notifications mailing list archives

Site index · List index
Message view « Date » · « Thread »
Top « Date » · « Thread »
From Apache Jenkins Server <jenk...@builds.apache.org>
Subject Build failed in Jenkins: Qpid-Java-Cpp-Test #2046
Date Wed, 06 Aug 2014 19:01:52 GMT
See <https://builds.apache.org/job/Qpid-Java-Cpp-Test/2046/changes>

Changes:

[gsim] QPID-5948: prevent creation of durable topic backed by non-durable exchange; add exception
handling to object recovery.
           (Based on patch from Kim van der Riet).

------------------------------------------
[...truncated 16801 lines...]
[INFO] skip non existing resourceDirectory /x1/jenkins/jenkins-slave/workspace/Qpid-Java-Cpp-Test/trunk/qpid/java/perftests/visualisation-jfc/src/main/resources
[INFO] Copying 0 resource
[INFO] Copying 3 resources
[INFO] 
[INFO] --- maven-compiler-plugin:3.1:compile (default-compile) @ qpid-perftests-visualisation-jfc
---
[INFO] Changes detected - recompiling the module!
[INFO] Compiling 30 source files to /x1/jenkins/jenkins-slave/workspace/Qpid-Java-Cpp-Test/trunk/qpid/java/perftests/visualisation-jfc/target/classes
[INFO] 
[INFO] --- maven-resources-plugin:2.6:testResources (default-testResources) @ qpid-perftests-visualisation-jfc
---
[INFO] Using 'UTF-8' encoding to copy filtered resources.
[INFO] Copying 1 resource
[INFO] skip non existing resourceDirectory /x1/jenkins/jenkins-slave/workspace/Qpid-Java-Cpp-Test/trunk/qpid/java/perftests/visualisation-jfc/src/test/resources
[INFO] Copying 3 resources
[INFO] 
[INFO] --- maven-compiler-plugin:3.1:testCompile (default-testCompile) @ qpid-perftests-visualisation-jfc
---
[INFO] Changes detected - recompiling the module!
[INFO] Compiling 11 source files to /x1/jenkins/jenkins-slave/workspace/Qpid-Java-Cpp-Test/trunk/qpid/java/perftests/visualisation-jfc/target/test-classes
[INFO] 
[INFO] --- maven-surefire-plugin:2.16:test (default-test) @ qpid-perftests-visualisation-jfc
---
[INFO] Surefire report directory: /x1/jenkins/jenkins-slave/workspace/Qpid-Java-Cpp-Test/trunk/qpid/java/perftests/visualisation-jfc/target/surefire-reports

-------------------------------------------------------
 T E S T S
-------------------------------------------------------
Running org.apache.qpid.disttest.charting.seriesbuilder.SeriesRowTest
main 2014-08-06 19:01:34,766 INFO [qpid.test.utils.QpidTestCase] Some tests should be excluded,
building the exclude list
main 2014-08-06 19:01:34,768 INFO [qpid.test.utils.QpidTestCase] Specified exclude file does
not exist: /x1/jenkins/jenkins-slave/workspace/Qpid-Java-Cpp-Test/trunk/qpid/java/perftests/visualisation-jfc/../test-profiles//Excludes
main 2014-08-06 19:01:34,768 INFO [qpid.test.utils.QpidTestCase] Specified exclude file does
not exist: /x1/jenkins/jenkins-slave/workspace/Qpid-Java-Cpp-Test/trunk/qpid/java/perftests/visualisation-jfc/../test-profiles//CPPExcludes
main 2014-08-06 19:01:34,768 INFO [qpid.test.utils.QpidTestCase] Specified exclude file does
not exist: /x1/jenkins/jenkins-slave/workspace/Qpid-Java-Cpp-Test/trunk/qpid/java/perftests/visualisation-jfc/../test-profiles//cpp.excludes
main 2014-08-06 19:01:34,768 INFO [qpid.test.utils.QpidTestCase] Specified exclude file does
not exist: /x1/jenkins/jenkins-slave/workspace/Qpid-Java-Cpp-Test/trunk/qpid/java/perftests/visualisation-jfc/../test-profiles//CPPPrefetchExcludes
main 2014-08-06 19:01:34,769 INFO [qpid.test.utils.QpidTestCase] Specified exclude file does
not exist: /x1/jenkins/jenkins-slave/workspace/Qpid-Java-Cpp-Test/trunk/qpid/java/perftests/visualisation-jfc/../test-profiles//CPPTransientExcludes
main 2014-08-06 19:01:34,769 INFO [qpid.test.utils.QpidTestCase] Specified exclude file does
not exist: /x1/jenkins/jenkins-slave/workspace/Qpid-Java-Cpp-Test/trunk/qpid/java/perftests/visualisation-jfc/../test-profiles//cpp.excludes
main 2014-08-06 19:01:34,778 INFO [qpid.test.utils.QpidTestCase] ========== start SeriesRowTest.testValidSeriesRowThrowsExceptionIfArrayTooSmall
==========
main 2014-08-06 19:01:34,779 INFO [qpid.test.utils.QpidTestCase] ========== tearDown SeriesRowTest.testValidSeriesRowThrowsExceptionIfArrayTooSmall
==========
main 2014-08-06 19:01:34,781 INFO [qpid.test.utils.QpidTestCase] ========== start SeriesRowTest.testDimension
==========
main 2014-08-06 19:01:34,781 INFO [qpid.test.utils.QpidTestCase] ========== tearDown SeriesRowTest.testDimension
==========
main 2014-08-06 19:01:34,782 INFO [qpid.test.utils.QpidTestCase] ========== start SeriesRowTest.testDimensionAsDouble
==========
main 2014-08-06 19:01:34,783 INFO [qpid.test.utils.QpidTestCase] ========== tearDown SeriesRowTest.testDimensionAsDouble
==========
main 2014-08-06 19:01:34,784 INFO [qpid.test.utils.QpidTestCase] ========== start SeriesRowTest.testDimensionAsString
==========
main 2014-08-06 19:01:34,784 INFO [qpid.test.utils.QpidTestCase] ========== tearDown SeriesRowTest.testDimensionAsString
==========
main 2014-08-06 19:01:34,785 INFO [qpid.test.utils.QpidTestCase] ========== start SeriesRowTest.testValidSeriesRow
==========
main 2014-08-06 19:01:34,785 INFO [qpid.test.utils.QpidTestCase] ========== tearDown SeriesRowTest.testValidSeriesRow
==========
Tests run: 5, Failures: 0, Errors: 0, Skipped: 0, Time elapsed: 0.192 sec - in org.apache.qpid.disttest.charting.seriesbuilder.SeriesRowTest
Running org.apache.qpid.disttest.charting.seriesbuilder.JdbcSeriesBuilderTest
main 2014-08-06 19:01:35,055 INFO [qpid.test.utils.QpidTestCase] ========== start JdbcSeriesBuilderTest.testBuildOneSeries
==========
main 2014-08-06 19:01:35,272 INFO [disttest.charting.seriesbuilder.JdbcSeriesBuilder] Loaded
JDBC driver class org.relique.jdbc.csv.CsvDriver
main 2014-08-06 19:01:35,306 INFO [disttest.charting.seriesbuilder.JdbcSeriesBuilder] Created:
JdbcSeriesBuilder[jdbcUrlGenerator=JdbcUrlGenerator[providedJdbdUrl=<null>]]
main 2014-08-06 19:01:35,386 INFO [qpid.test.utils.QpidTestCase] ========== tearDown JdbcSeriesBuilderTest.testBuildOneSeries
==========
Tests run: 1, Failures: 0, Errors: 0, Skipped: 0, Time elapsed: 0.603 sec - in org.apache.qpid.disttest.charting.seriesbuilder.JdbcSeriesBuilderTest
Running org.apache.qpid.disttest.charting.seriesbuilder.JdbcUrlGeneratorTest
main 2014-08-06 19:01:35,388 INFO [qpid.test.utils.QpidTestCase] ========== start JdbcUrlGeneratorTest.testGetJdbcUrlWithoutProvidingAUrlReturnsCsvUrlWithCorrectDirectory
==========
main 2014-08-06 19:01:35,397 INFO [qpid.test.utils.QpidTestCase] ========== tearDown JdbcUrlGeneratorTest.testGetJdbcUrlWithoutProvidingAUrlReturnsCsvUrlWithCorrectDirectory
==========
main 2014-08-06 19:01:35,397 INFO [qpid.test.utils.QpidTestCase] ========== start JdbcUrlGeneratorTest.testGetJdbcUrlThrowsExceptionWithoutAProvidedUrlOrSeriesDirectory
==========
main 2014-08-06 19:01:35,398 INFO [qpid.test.utils.QpidTestCase] ========== tearDown JdbcUrlGeneratorTest.testGetJdbcUrlThrowsExceptionWithoutAProvidedUrlOrSeriesDirectory
==========
main 2014-08-06 19:01:35,399 INFO [qpid.test.utils.QpidTestCase] ========== start JdbcUrlGeneratorTest.testGetJdbcUrlThrowsExceptionIfUrlProvidedAndSeriesDirectorySpecified
==========
main 2014-08-06 19:01:35,400 INFO [qpid.test.utils.QpidTestCase] ========== tearDown JdbcUrlGeneratorTest.testGetJdbcUrlThrowsExceptionIfUrlProvidedAndSeriesDirectorySpecified
==========
main 2014-08-06 19:01:35,400 INFO [qpid.test.utils.QpidTestCase] ========== start JdbcUrlGeneratorTest.testGetJdbcUrlReturnsProvidedUrl
==========
main 2014-08-06 19:01:35,401 INFO [qpid.test.utils.QpidTestCase] ========== tearDown JdbcUrlGeneratorTest.testGetJdbcUrlReturnsProvidedUrl
==========
Tests run: 4, Failures: 0, Errors: 0, Skipped: 0, Time elapsed: 0.007 sec - in org.apache.qpid.disttest.charting.seriesbuilder.JdbcUrlGeneratorTest
Running org.apache.qpid.disttest.charting.chartbuilder.ColorFactoryTest
main 2014-08-06 19:01:35,403 INFO [qpid.test.utils.QpidTestCase] ========== start ColorFactoryTest.testDarkBlue
==========
main 2014-08-06 19:01:35,443 INFO [qpid.test.utils.QpidTestCase] ========== tearDown ColorFactoryTest.testDarkBlue
==========
main 2014-08-06 19:01:35,443 INFO [qpid.test.utils.QpidTestCase] ========== start ColorFactoryTest.testBlue
==========
main 2014-08-06 19:01:35,444 INFO [qpid.test.utils.QpidTestCase] ========== tearDown ColorFactoryTest.testBlue
==========
Tests run: 2, Failures: 0, Errors: 0, Skipped: 0, Time elapsed: 0.043 sec - in org.apache.qpid.disttest.charting.chartbuilder.ColorFactoryTest
Running org.apache.qpid.disttest.charting.chartbuilder.BaseChartBuilderTest
main 2014-08-06 19:01:35,540 INFO [qpid.test.utils.QpidTestCase] ========== start BaseChartBuilderTest.testBuildChart
==========
main 2014-08-06 19:01:36,108 INFO [qpid.test.utils.QpidTestCase] ========== tearDown BaseChartBuilderTest.testBuildChart
==========
Tests run: 1, Failures: 0, Errors: 0, Skipped: 0, Time elapsed: 0.663 sec - in org.apache.qpid.disttest.charting.chartbuilder.BaseChartBuilderTest
Running org.apache.qpid.disttest.charting.chartbuilder.ChartBuilderFactoryTest
main 2014-08-06 19:01:36,112 INFO [qpid.test.utils.QpidTestCase] ========== start ChartBuilderFactoryTest.testXYLineChart
==========
main 2014-08-06 19:01:36,114 INFO [qpid.test.utils.QpidTestCase] ========== tearDown ChartBuilderFactoryTest.testXYLineChart
==========
main 2014-08-06 19:01:36,115 INFO [qpid.test.utils.QpidTestCase] ========== start ChartBuilderFactoryTest.testLineChart
==========
main 2014-08-06 19:01:36,115 INFO [qpid.test.utils.QpidTestCase] ========== tearDown ChartBuilderFactoryTest.testLineChart
==========
main 2014-08-06 19:01:36,116 INFO [qpid.test.utils.QpidTestCase] ========== start ChartBuilderFactoryTest.testBarChart
==========
main 2014-08-06 19:01:36,117 INFO [qpid.test.utils.QpidTestCase] ========== tearDown ChartBuilderFactoryTest.testBarChart
==========
main 2014-08-06 19:01:36,118 INFO [qpid.test.utils.QpidTestCase] ========== start ChartBuilderFactoryTest.testTimeSeriesLineChart
==========
main 2014-08-06 19:01:36,118 INFO [qpid.test.utils.QpidTestCase] ========== tearDown ChartBuilderFactoryTest.testTimeSeriesLineChart
==========
main 2014-08-06 19:01:36,119 INFO [qpid.test.utils.QpidTestCase] ========== start ChartBuilderFactoryTest.testLineChart3D
==========
main 2014-08-06 19:01:36,120 INFO [qpid.test.utils.QpidTestCase] ========== tearDown ChartBuilderFactoryTest.testLineChart3D
==========
main 2014-08-06 19:01:36,121 INFO [qpid.test.utils.QpidTestCase] ========== start ChartBuilderFactoryTest.testBarChart3D
==========
main 2014-08-06 19:01:36,121 INFO [qpid.test.utils.QpidTestCase] ========== tearDown ChartBuilderFactoryTest.testBarChart3D
==========
Tests run: 6, Failures: 0, Errors: 0, Skipped: 0, Time elapsed: 0.013 sec - in org.apache.qpid.disttest.charting.chartbuilder.ChartBuilderFactoryTest
Running org.apache.qpid.disttest.charting.chartbuilder.TimeSeriesBuilderCallbackTest
main 2014-08-06 19:01:36,124 INFO [qpid.test.utils.QpidTestCase] ========== start TimeSeriesBuilderCallbackTest.testAddPointToSeries
==========
main 2014-08-06 19:01:36,167 INFO [qpid.test.utils.QpidTestCase] ========== tearDown TimeSeriesBuilderCallbackTest.testAddPointToSeries
==========
Tests run: 1, Failures: 0, Errors: 0, Skipped: 0, Time elapsed: 0.045 sec - in org.apache.qpid.disttest.charting.chartbuilder.TimeSeriesBuilderCallbackTest
Running org.apache.qpid.disttest.charting.chartbuilder.ChartProductionTest
main 2014-08-06 19:01:36,173 INFO [qpid.test.utils.QpidTestCase] ========== start ChartProductionTest.testLine3DChart
==========
main 2014-08-06 19:01:36,177 INFO [disttest.charting.writer.ChartWriter] Set chart directory:
/tmp/charts-1407351696175
main 2014-08-06 19:01:38,535 INFO [disttest.charting.writer.ChartWriter] Written /tmp/charts-1407351696175/testLine3DChart.png
chart
main 2014-08-06 19:01:38,535 INFO [qpid.test.utils.QpidTestCase] ========== tearDown ChartProductionTest.testLine3DChart
==========
main 2014-08-06 19:01:38,536 INFO [qpid.test.utils.QpidTestCase] ========== start ChartProductionTest.testXYLineChart
==========
main 2014-08-06 19:01:38,537 INFO [disttest.charting.writer.ChartWriter] Set chart directory:
/tmp/charts-1407351698537
main 2014-08-06 19:01:38,701 INFO [disttest.charting.writer.ChartWriter] Written /tmp/charts-1407351698537/testXYLineChart.png
chart
main 2014-08-06 19:01:38,701 INFO [qpid.test.utils.QpidTestCase] ========== tearDown ChartProductionTest.testXYLineChart
==========
main 2014-08-06 19:01:38,702 INFO [qpid.test.utils.QpidTestCase] ========== start ChartProductionTest.testStatisticalBarChart
==========
main 2014-08-06 19:01:38,703 INFO [disttest.charting.writer.ChartWriter] Set chart directory:
/tmp/charts-1407351698703
main 2014-08-06 19:01:38,818 INFO [disttest.charting.writer.ChartWriter] Written /tmp/charts-1407351698703/testStatisticalBarChart.png
chart
main 2014-08-06 19:01:38,818 INFO [qpid.test.utils.QpidTestCase] ========== tearDown ChartProductionTest.testStatisticalBarChart
==========
main 2014-08-06 19:01:38,819 INFO [qpid.test.utils.QpidTestCase] ========== start ChartProductionTest.testLineChart
==========
main 2014-08-06 19:01:38,820 INFO [disttest.charting.writer.ChartWriter] Set chart directory:
/tmp/charts-1407351698820
main 2014-08-06 19:01:38,922 INFO [disttest.charting.writer.ChartWriter] Written /tmp/charts-1407351698820/testLineChart.png
chart
main 2014-08-06 19:01:38,922 INFO [qpid.test.utils.QpidTestCase] ========== tearDown ChartProductionTest.testLineChart
==========
main 2014-08-06 19:01:38,923 INFO [qpid.test.utils.QpidTestCase] ========== start ChartProductionTest.testBarChart
==========
main 2014-08-06 19:01:38,924 INFO [disttest.charting.writer.ChartWriter] Set chart directory:
/tmp/charts-1407351698924
main 2014-08-06 19:01:39,028 INFO [disttest.charting.writer.ChartWriter] Written /tmp/charts-1407351698924/testBarChart.png
chart
main 2014-08-06 19:01:39,028 INFO [qpid.test.utils.QpidTestCase] ========== tearDown ChartProductionTest.testBarChart
==========
main 2014-08-06 19:01:39,029 INFO [qpid.test.utils.QpidTestCase] ========== start ChartProductionTest.testBar3DChart
==========
main 2014-08-06 19:01:39,030 INFO [disttest.charting.writer.ChartWriter] Set chart directory:
/tmp/charts-1407351699030
main 2014-08-06 19:01:39,133 INFO [disttest.charting.writer.ChartWriter] Written /tmp/charts-1407351699030/testBar3DChart.png
chart
main 2014-08-06 19:01:39,133 INFO [qpid.test.utils.QpidTestCase] ========== tearDown ChartProductionTest.testBar3DChart
==========
main 2014-08-06 19:01:39,133 INFO [qpid.test.utils.QpidTestCase] ========== start ChartProductionTest.testTimeSeriesLineChart
==========
main 2014-08-06 19:01:39,134 INFO [disttest.charting.writer.ChartWriter] Set chart directory:
/tmp/charts-1407351699134
main 2014-08-06 19:01:39,252 INFO [disttest.charting.writer.ChartWriter] Written /tmp/charts-1407351699134/testTimeSeriesLineChart.png
chart
main 2014-08-06 19:01:39,252 INFO [qpid.test.utils.QpidTestCase] ========== tearDown ChartProductionTest.testTimeSeriesLineChart
==========
main 2014-08-06 19:01:39,253 INFO [qpid.test.utils.QpidTestCase] ========== start ChartProductionTest.testXYLineChartWithColourAndWidth
==========
main 2014-08-06 19:01:39,254 INFO [disttest.charting.writer.ChartWriter] Set chart directory:
/tmp/charts-1407351699254
main 2014-08-06 19:01:39,523 INFO [disttest.charting.writer.ChartWriter] Written /tmp/charts-1407351699254/testXYLineChartWithColourAndWidth.png
chart
main 2014-08-06 19:01:39,523 INFO [qpid.test.utils.QpidTestCase] ========== tearDown ChartProductionTest.testXYLineChartWithColourAndWidth
==========
Tests run: 8, Failures: 0, Errors: 0, Skipped: 0, Time elapsed: 3.357 sec - in org.apache.qpid.disttest.charting.chartbuilder.ChartProductionTest
Running org.apache.qpid.disttest.charting.definition.SeriesDefinitionCreatorTest
main 2014-08-06 19:01:39,526 INFO [qpid.test.utils.QpidTestCase] ========== start SeriesDefinitionCreatorTest.testSeriesDirectoryAndNameSubstitution
==========
main 2014-08-06 19:01:39,526 INFO [qpid.test.utils.QpidTestCase] Set system property "SeriesDefinitionProp"
to: "propValue"
main 2014-08-06 19:01:39,543 INFO [qpid.test.utils.QpidTestCase] ========== tearDown SeriesDefinitionCreatorTest.testSeriesDirectoryAndNameSubstitution
==========
main 2014-08-06 19:01:39,543 DEBUG [qpid.test.utils.QpidTestCase] reverting 1 test properties
main 2014-08-06 19:01:39,544 INFO [qpid.test.utils.QpidTestCase] ========== start SeriesDefinitionCreatorTest.testTwoSeriesDefinitions
==========
main 2014-08-06 19:01:39,545 INFO [qpid.test.utils.QpidTestCase] ========== tearDown SeriesDefinitionCreatorTest.testTwoSeriesDefinitions
==========
main 2014-08-06 19:01:39,561 INFO [qpid.test.utils.QpidTestCase] ========== start SeriesDefinitionCreatorTest.testOneSeriesDefinition
==========
main 2014-08-06 19:01:39,562 INFO [qpid.test.utils.QpidTestCase] ========== tearDown SeriesDefinitionCreatorTest.testOneSeriesDefinition
==========
main 2014-08-06 19:01:39,563 INFO [qpid.test.utils.QpidTestCase] ========== start SeriesDefinitionCreatorTest.testNonSequentialSeriesDefinitionsIgnored
==========
main 2014-08-06 19:01:39,563 INFO [qpid.test.utils.QpidTestCase] ========== tearDown SeriesDefinitionCreatorTest.testNonSequentialSeriesDefinitionsIgnored
==========
Tests run: 4, Failures: 0, Errors: 0, Skipped: 0, Time elapsed: 0.043 sec - in org.apache.qpid.disttest.charting.definition.SeriesDefinitionCreatorTest
Running org.apache.qpid.disttest.charting.definition.ChartingDefinitionCreatorTest
main 2014-08-06 19:01:39,566 INFO [qpid.test.utils.QpidTestCase] ========== start ChartingDefinitionCreatorTest.testLoadTwoDefinitionsFromDirectory
==========
main 2014-08-06 19:01:39,609 INFO [qpid.test.utils.QpidTestCase] ========== tearDown ChartingDefinitionCreatorTest.testLoadTwoDefinitionsFromDirectory
==========
main 2014-08-06 19:01:39,630 INFO [qpid.test.utils.QpidTestCase] ========== start ChartingDefinitionCreatorTest.testLoadOneDefinitionFromFile
==========
main 2014-08-06 19:01:39,631 INFO [qpid.test.utils.QpidTestCase] ========== tearDown ChartingDefinitionCreatorTest.testLoadOneDefinitionFromFile
==========
main 2014-08-06 19:01:39,632 INFO [qpid.test.utils.QpidTestCase] ========== start ChartingDefinitionCreatorTest.testDefinitionsProperties
==========
main 2014-08-06 19:01:39,632 INFO [qpid.test.utils.QpidTestCase] Set system property "ChartingDefinitionSysProp"
to: "propValue"
main 2014-08-06 19:01:39,633 INFO [qpid.test.utils.QpidTestCase] ========== tearDown ChartingDefinitionCreatorTest.testDefinitionsProperties
==========
main 2014-08-06 19:01:39,633 DEBUG [qpid.test.utils.QpidTestCase] reverting 1 test properties
main 2014-08-06 19:01:39,678 INFO [qpid.test.utils.QpidTestCase] ========== start ChartingDefinitionCreatorTest.testDefinitionFileNotFound
==========
main 2014-08-06 19:01:39,690 INFO [qpid.test.utils.QpidTestCase] ========== tearDown ChartingDefinitionCreatorTest.testDefinitionFileNotFound
==========
Tests run: 4, Failures: 0, Errors: 0, Skipped: 0, Time elapsed: 0.127 sec - in org.apache.qpid.disttest.charting.definition.ChartingDefinitionCreatorTest
Running org.apache.qpid.disttest.charting.writer.ChartWriterTest
main 2014-08-06 19:01:39,760 INFO [disttest.charting.writer.ChartWriter] Set chart directory:
/tmp/TestFileUtils-testDir-1407351699760
main 2014-08-06 19:01:39,861 INFO [disttest.charting.writer.ChartWriter] Written /tmp/TestFileUtils-testDir-1407351699760/chart1.png
chart
main 2014-08-06 19:01:39,861 INFO [disttest.charting.writer.ChartWriter] Only 1 chart image(s)
have been written so no HTML summary file will be produced
main 2014-08-06 19:01:39,862 INFO [qpid.test.utils.QpidTestCase] ========== tearDown null
==========
main 2014-08-06 19:01:39,863 INFO [disttest.charting.writer.ChartWriter] Set chart directory:
/tmp/TestFileUtils-testDir-1407351699863
main 2014-08-06 19:01:39,950 INFO [disttest.charting.writer.ChartWriter] Written /tmp/TestFileUtils-testDir-1407351699863/chart1.png
chart
main 2014-08-06 19:01:39,950 INFO [qpid.test.utils.QpidTestCase] ========== tearDown null
==========
main 2014-08-06 19:01:39,952 INFO [disttest.charting.writer.ChartWriter] Set chart directory:
/tmp/TestFileUtils-testDir-1407351699952
main 2014-08-06 19:01:40,064 INFO [disttest.charting.writer.ChartWriter] Written /tmp/TestFileUtils-testDir-1407351699952/chart2.png
chart
main 2014-08-06 19:01:40,154 INFO [disttest.charting.writer.ChartWriter] Written /tmp/TestFileUtils-testDir-1407351699952/chart1.png
chart
main 2014-08-06 19:01:40,155 DEBUG [disttest.charting.writer.ChartWriter] About to produce
HTML summary file /tmp/TestFileUtils-testDir-1407351699952/chart-summary.html from charts
{/tmp/TestFileUtils-testDir-1407351699952/chart1.png=Mock for ChartingDefinition, hashCode:
31985040, /tmp/TestFileUtils-testDir-1407351699952/chart2.png=Mock for ChartingDefinition,
hashCode: 30572930}
main 2014-08-06 19:01:40,182 INFO [qpid.test.utils.QpidTestCase] ========== tearDown null
==========
Tests run: 3, Failures: 0, Errors: 0, Skipped: 0, Time elapsed: 0.491 sec - in org.apache.qpid.disttest.charting.writer.ChartWriterTest

Results :

Tests run: 39, Failures: 0, Errors: 0, Skipped: 0

[INFO] 
[INFO] --- maven-jar-plugin:2.4:jar (default-jar) @ qpid-perftests-visualisation-jfc ---
[INFO] Building jar: /x1/jenkins/jenkins-slave/workspace/Qpid-Java-Cpp-Test/trunk/qpid/java/perftests/visualisation-jfc/target/qpid-perftests-visualisation-jfc-0.30-SNAPSHOT.jar
[INFO] 
[INFO] --- maven-site-plugin:3.3:attach-descriptor (attach-descriptor) @ qpid-perftests-visualisation-jfc
---
[INFO] 
[INFO] --- maven-antrun-plugin:1.7:run (create-qbtc-output-dir) @ qpid-perftests-visualisation-jfc
---
[INFO] Executing tasks

main:
    [mkdir] Created dir: /x1/jenkins/jenkins-slave/workspace/Qpid-Java-Cpp-Test/trunk/qpid/java/perftests/visualisation-jfc/target/qbtc-output
[INFO] Executed tasks
[INFO]                                                                         
[INFO] ------------------------------------------------------------------------
[INFO] Skipping Qpid BDB Store System Tests
[INFO] This project has been banned from the build due to previous failures.
[INFO] ------------------------------------------------------------------------
[INFO] ------------------------------------------------------------------------
[INFO] Reactor Summary:
[INFO] 
[INFO] Qpid Java Build ................................... SUCCESS [6.366s]
[INFO] Qpid AMQP 1.0 Common .............................. SUCCESS [9.986s]
[INFO] Qpid AMQP 1.0 Client .............................. SUCCESS [1.362s]
[INFO] Qpid AMQP 1.0 Client JMS .......................... SUCCESS [2.121s]
[INFO] Qpid AMQP 1.0 JMS Client Examples ................. SUCCESS [0.324s]
[INFO] Qpid AMQP 1.0 Client WebSocket .................... SUCCESS [1.059s]
[INFO] Qpid Broker Code Generation ....................... SUCCESS [0.515s]
[INFO] Qpid Test Utilities ............................... SUCCESS [0.434s]
[INFO] Qpid Common ....................................... SUCCESS [26.112s]
[INFO] Qpid Management Common ............................ SUCCESS [1.008s]
[INFO] Qpid Java Broker Core ............................. SUCCESS [1:16.422s]
[INFO] Qpid Access Control Broker Plug-in ................ SUCCESS [4.430s]
[INFO] Qpid AMQP 0-8 Protocol Broker Plug-in ............. SUCCESS [23.560s]
[INFO] Qpid AMQP 0-10 Protocol Plug-in ................... SUCCESS [3.438s]
[INFO] Qpid AMQP 1-0 Protocol Broker Plug-in ............. SUCCESS [1.444s]
[INFO] Qpid AMQP 0-8 to 0-10 Message Conversion Broker Plug-in  SUCCESS [4.236s]
[INFO] Qpid AMQP 0-8 to 1-0 Message Conversion Broker Plug-in  SUCCESS [4.274s]
[INFO] Qpid AMQP 0-10 to 1-0 Message Conversion Broker Plug-in  SUCCESS [0.511s]
[INFO] Qpid Derby Message Store .......................... SUCCESS [1:47.310s]
[INFO] Qpid JDBC Message Store Connection Pooling Plug-in  SUCCESS [1.168s]
[INFO] Qpid JDBC Message Store Broker Plug-in ............ SUCCESS [10.178s]
[INFO] Qpid HTTP Management Broker Plug-in ............... SUCCESS [9.431s]
[INFO] Qpid JMX Management Broker Plug-in ................ SUCCESS [3.921s]
[INFO] Qpid Memory Message Store Broker Plug-in .......... SUCCESS [0.681s]
[INFO] Qpid AMQP 0-x JMS Client .......................... SUCCESS [7.972s]
[INFO] Qpid BDB Message Store ............................ SUCCESS [2:34.985s]
[INFO] Qpid BDB Message Store JMX ........................ SUCCESS [2.288s]
[INFO] Qpid Java Broker .................................. SUCCESS [6.493s]
[INFO] Qpid AMQP Management Protocol Broker Plug-in ...... SUCCESS [0.466s]
[INFO] Qpid WebSocket Broker Plug-in ..................... SUCCESS [0.482s]
[INFO] Qpid AMQP 0-x JMS Client Examples ................. SUCCESS [0.247s]
[INFO] Qpid JCA .......................................... SUCCESS [1.895s]
[INFO] Qpid Resource Adaptor ............................. SUCCESS [0.779s]
[INFO] Qpid Tools ........................................ SUCCESS [0.621s]
[INFO] Qpid Management Examples .......................... SUCCESS [0.232s]
[INFO] Qpid Java System Test Parent ...................... SUCCESS [2.109s]
[INFO] Qpid System Tests ................................. FAILURE [18:19.745s]
[INFO] Qpid Performance Tests ............................ SUCCESS [18.424s]
[INFO] Qpid Performance Test System Tests ................ SKIPPED
[INFO] Qpid Performance Tests Visualisation JFC .......... SUCCESS [7.106s]
[INFO] Qpid BDB Store System Tests ....................... SKIPPED
[INFO] ------------------------------------------------------------------------
[INFO] BUILD FAILURE
[INFO] ------------------------------------------------------------------------
[INFO] Total time: 26:45.729s
[INFO] Finished at: Wed Aug 06 19:01:40 UTC 2014
[INFO] Final Memory: 37M/429M
[INFO] ------------------------------------------------------------------------
[ERROR] Failed to execute goal org.apache.maven.plugins:maven-surefire-plugin:2.16:test (integration-test)
on project qpid-systests: There are test failures.
[ERROR] 
[ERROR] Please refer to /x1/jenkins/jenkins-slave/workspace/Qpid-Java-Cpp-Test/trunk/qpid/java/systests/target/surefire-reports
for the individual test results.
[ERROR] -> [Help 1]
[ERROR] 
[ERROR] To see the full stack trace of the errors, re-run Maven with the -e switch.
[ERROR] Re-run Maven using the -X switch to enable full debug logging.
[ERROR] 
[ERROR] For more information about the errors and possible solutions, please read the following
articles:
[ERROR] [Help 1] http://cwiki.apache.org/confluence/display/MAVEN/MojoFailureException
[ERROR] 
[ERROR] After correcting the problems, you can resume the build with the command
[ERROR]   mvn <goals> -rf :qpid-systests
Build step 'Invoke top-level Maven targets' marked build as failure
[locks-and-latches] Releasing all the locks
[locks-and-latches] All the locks released
Recording test results

Mime
View raw message