qpid-notifications mailing list archives

Site index · List index
Message view « Date » · « Thread »
Top « Date » · « Thread »
From Apache Jenkins Server <jenk...@builds.apache.org>
Subject Build failed in Jenkins: Qpid-Java-Cpp-Test #2066
Date Mon, 11 Aug 2014 15:16:01 GMT
See <https://builds.apache.org/job/Qpid-Java-Cpp-Test/2066/changes>

Changes:

[aconway] NO-JIRA: Remove annoying '*' in cmake build type message.

------------------------------------------
[...truncated 17148 lines...]
[INFO] skip non existing resourceDirectory /x1/jenkins/jenkins-slave/workspace/Qpid-Java-Cpp-Test/trunk/qpid/java/perftests/visualisation-jfc/src/main/resources
[INFO] Copying 0 resource
[INFO] Copying 3 resources
[INFO] 
[INFO] --- maven-compiler-plugin:3.1:compile (default-compile) @ qpid-perftests-visualisation-jfc
---
[INFO] Changes detected - recompiling the module!
[INFO] Compiling 30 source files to /x1/jenkins/jenkins-slave/workspace/Qpid-Java-Cpp-Test/trunk/qpid/java/perftests/visualisation-jfc/target/classes
[INFO] 
[INFO] --- maven-resources-plugin:2.6:testResources (default-testResources) @ qpid-perftests-visualisation-jfc
---
[INFO] Using 'UTF-8' encoding to copy filtered resources.
[INFO] Copying 1 resource
[INFO] skip non existing resourceDirectory /x1/jenkins/jenkins-slave/workspace/Qpid-Java-Cpp-Test/trunk/qpid/java/perftests/visualisation-jfc/src/test/resources
[INFO] Copying 3 resources
[INFO] 
[INFO] --- maven-compiler-plugin:3.1:testCompile (default-testCompile) @ qpid-perftests-visualisation-jfc
---
[INFO] Changes detected - recompiling the module!
[INFO] Compiling 11 source files to /x1/jenkins/jenkins-slave/workspace/Qpid-Java-Cpp-Test/trunk/qpid/java/perftests/visualisation-jfc/target/test-classes
[INFO] 
[INFO] --- maven-surefire-plugin:2.16:test (default-test) @ qpid-perftests-visualisation-jfc
---
[INFO] Surefire report directory: /x1/jenkins/jenkins-slave/workspace/Qpid-Java-Cpp-Test/trunk/qpid/java/perftests/visualisation-jfc/target/surefire-reports

-------------------------------------------------------
 T E S T S
-------------------------------------------------------
Running org.apache.qpid.disttest.charting.seriesbuilder.SeriesRowTest
main 2014-08-11 15:15:52,763 INFO [qpid.test.utils.QpidTestCase] Some tests should be excluded,
building the exclude list
main 2014-08-11 15:15:52,764 INFO [qpid.test.utils.QpidTestCase] Specified exclude file does
not exist: /x1/jenkins/jenkins-slave/workspace/Qpid-Java-Cpp-Test/trunk/qpid/java/perftests/visualisation-jfc/../test-profiles//Excludes
main 2014-08-11 15:15:52,764 INFO [qpid.test.utils.QpidTestCase] Specified exclude file does
not exist: /x1/jenkins/jenkins-slave/workspace/Qpid-Java-Cpp-Test/trunk/qpid/java/perftests/visualisation-jfc/../test-profiles//CPPExcludes
main 2014-08-11 15:15:52,765 INFO [qpid.test.utils.QpidTestCase] Specified exclude file does
not exist: /x1/jenkins/jenkins-slave/workspace/Qpid-Java-Cpp-Test/trunk/qpid/java/perftests/visualisation-jfc/../test-profiles//cpp.excludes
main 2014-08-11 15:15:52,765 INFO [qpid.test.utils.QpidTestCase] Specified exclude file does
not exist: /x1/jenkins/jenkins-slave/workspace/Qpid-Java-Cpp-Test/trunk/qpid/java/perftests/visualisation-jfc/../test-profiles//CPPPrefetchExcludes
main 2014-08-11 15:15:52,765 INFO [qpid.test.utils.QpidTestCase] Specified exclude file does
not exist: /x1/jenkins/jenkins-slave/workspace/Qpid-Java-Cpp-Test/trunk/qpid/java/perftests/visualisation-jfc/../test-profiles//CPPTransientExcludes
main 2014-08-11 15:15:52,765 INFO [qpid.test.utils.QpidTestCase] Specified exclude file does
not exist: /x1/jenkins/jenkins-slave/workspace/Qpid-Java-Cpp-Test/trunk/qpid/java/perftests/visualisation-jfc/../test-profiles//cpp.excludes
main 2014-08-11 15:15:52,772 INFO [qpid.test.utils.QpidTestCase] ========== start SeriesRowTest.testValidSeriesRowThrowsExceptionIfArrayTooSmall
==========
main 2014-08-11 15:15:52,772 INFO [qpid.test.utils.QpidTestCase] ========== tearDown SeriesRowTest.testValidSeriesRowThrowsExceptionIfArrayTooSmall
==========
main 2014-08-11 15:15:52,774 INFO [qpid.test.utils.QpidTestCase] ========== start SeriesRowTest.testDimension
==========
main 2014-08-11 15:15:52,774 INFO [qpid.test.utils.QpidTestCase] ========== tearDown SeriesRowTest.testDimension
==========
main 2014-08-11 15:15:52,774 INFO [qpid.test.utils.QpidTestCase] ========== start SeriesRowTest.testDimensionAsDouble
==========
main 2014-08-11 15:15:52,775 INFO [qpid.test.utils.QpidTestCase] ========== tearDown SeriesRowTest.testDimensionAsDouble
==========
main 2014-08-11 15:15:52,776 INFO [qpid.test.utils.QpidTestCase] ========== start SeriesRowTest.testDimensionAsString
==========
main 2014-08-11 15:15:52,776 INFO [qpid.test.utils.QpidTestCase] ========== tearDown SeriesRowTest.testDimensionAsString
==========
main 2014-08-11 15:15:52,776 INFO [qpid.test.utils.QpidTestCase] ========== start SeriesRowTest.testValidSeriesRow
==========
main 2014-08-11 15:15:52,776 INFO [qpid.test.utils.QpidTestCase] ========== tearDown SeriesRowTest.testValidSeriesRow
==========
Tests run: 5, Failures: 0, Errors: 0, Skipped: 0, Time elapsed: 0.144 sec - in org.apache.qpid.disttest.charting.seriesbuilder.SeriesRowTest
Running org.apache.qpid.disttest.charting.seriesbuilder.JdbcSeriesBuilderTest
main 2014-08-11 15:15:52,914 INFO [qpid.test.utils.QpidTestCase] ========== start JdbcSeriesBuilderTest.testBuildOneSeries
==========
main 2014-08-11 15:15:52,969 INFO [disttest.charting.seriesbuilder.JdbcSeriesBuilder] Loaded
JDBC driver class org.relique.jdbc.csv.CsvDriver
main 2014-08-11 15:15:52,987 INFO [disttest.charting.seriesbuilder.JdbcSeriesBuilder] Created:
JdbcSeriesBuilder[jdbcUrlGenerator=JdbcUrlGenerator[providedJdbdUrl=<null>]]
main 2014-08-11 15:15:53,067 INFO [qpid.test.utils.QpidTestCase] ========== tearDown JdbcSeriesBuilderTest.testBuildOneSeries
==========
Tests run: 1, Failures: 0, Errors: 0, Skipped: 0, Time elapsed: 0.29 sec - in org.apache.qpid.disttest.charting.seriesbuilder.JdbcSeriesBuilderTest
Running org.apache.qpid.disttest.charting.seriesbuilder.JdbcUrlGeneratorTest
main 2014-08-11 15:15:53,070 INFO [qpid.test.utils.QpidTestCase] ========== start JdbcUrlGeneratorTest.testGetJdbcUrlWithoutProvidingAUrlReturnsCsvUrlWithCorrectDirectory
==========
main 2014-08-11 15:15:53,079 INFO [qpid.test.utils.QpidTestCase] ========== tearDown JdbcUrlGeneratorTest.testGetJdbcUrlWithoutProvidingAUrlReturnsCsvUrlWithCorrectDirectory
==========
main 2014-08-11 15:15:53,080 INFO [qpid.test.utils.QpidTestCase] ========== start JdbcUrlGeneratorTest.testGetJdbcUrlThrowsExceptionWithoutAProvidedUrlOrSeriesDirectory
==========
main 2014-08-11 15:15:53,081 INFO [qpid.test.utils.QpidTestCase] ========== tearDown JdbcUrlGeneratorTest.testGetJdbcUrlThrowsExceptionWithoutAProvidedUrlOrSeriesDirectory
==========
main 2014-08-11 15:15:53,082 INFO [qpid.test.utils.QpidTestCase] ========== start JdbcUrlGeneratorTest.testGetJdbcUrlThrowsExceptionIfUrlProvidedAndSeriesDirectorySpecified
==========
main 2014-08-11 15:15:53,083 INFO [qpid.test.utils.QpidTestCase] ========== tearDown JdbcUrlGeneratorTest.testGetJdbcUrlThrowsExceptionIfUrlProvidedAndSeriesDirectorySpecified
==========
main 2014-08-11 15:15:53,084 INFO [qpid.test.utils.QpidTestCase] ========== start JdbcUrlGeneratorTest.testGetJdbcUrlReturnsProvidedUrl
==========
main 2014-08-11 15:15:53,084 INFO [qpid.test.utils.QpidTestCase] ========== tearDown JdbcUrlGeneratorTest.testGetJdbcUrlReturnsProvidedUrl
==========
Tests run: 4, Failures: 0, Errors: 0, Skipped: 0, Time elapsed: 0.017 sec - in org.apache.qpid.disttest.charting.seriesbuilder.JdbcUrlGeneratorTest
Running org.apache.qpid.disttest.charting.chartbuilder.ColorFactoryTest
main 2014-08-11 15:15:53,086 INFO [qpid.test.utils.QpidTestCase] ========== start ColorFactoryTest.testDarkBlue
==========
main 2014-08-11 15:15:53,093 INFO [qpid.test.utils.QpidTestCase] ========== tearDown ColorFactoryTest.testDarkBlue
==========
main 2014-08-11 15:15:53,094 INFO [qpid.test.utils.QpidTestCase] ========== start ColorFactoryTest.testBlue
==========
main 2014-08-11 15:15:53,094 INFO [qpid.test.utils.QpidTestCase] ========== tearDown ColorFactoryTest.testBlue
==========
Tests run: 2, Failures: 0, Errors: 0, Skipped: 0, Time elapsed: 0.01 sec - in org.apache.qpid.disttest.charting.chartbuilder.ColorFactoryTest
Running org.apache.qpid.disttest.charting.chartbuilder.BaseChartBuilderTest
main 2014-08-11 15:15:53,163 INFO [qpid.test.utils.QpidTestCase] ========== start BaseChartBuilderTest.testBuildChart
==========
main 2014-08-11 15:15:53,419 INFO [qpid.test.utils.QpidTestCase] ========== tearDown BaseChartBuilderTest.testBuildChart
==========
Tests run: 1, Failures: 0, Errors: 0, Skipped: 0, Time elapsed: 0.324 sec - in org.apache.qpid.disttest.charting.chartbuilder.BaseChartBuilderTest
Running org.apache.qpid.disttest.charting.chartbuilder.ChartBuilderFactoryTest
main 2014-08-11 15:15:53,422 INFO [qpid.test.utils.QpidTestCase] ========== start ChartBuilderFactoryTest.testXYLineChart
==========
main 2014-08-11 15:15:53,424 INFO [qpid.test.utils.QpidTestCase] ========== tearDown ChartBuilderFactoryTest.testXYLineChart
==========
main 2014-08-11 15:15:53,425 INFO [qpid.test.utils.QpidTestCase] ========== start ChartBuilderFactoryTest.testLineChart
==========
main 2014-08-11 15:15:53,426 INFO [qpid.test.utils.QpidTestCase] ========== tearDown ChartBuilderFactoryTest.testLineChart
==========
main 2014-08-11 15:15:53,427 INFO [qpid.test.utils.QpidTestCase] ========== start ChartBuilderFactoryTest.testBarChart
==========
main 2014-08-11 15:15:53,428 INFO [qpid.test.utils.QpidTestCase] ========== tearDown ChartBuilderFactoryTest.testBarChart
==========
main 2014-08-11 15:15:53,428 INFO [qpid.test.utils.QpidTestCase] ========== start ChartBuilderFactoryTest.testTimeSeriesLineChart
==========
main 2014-08-11 15:15:53,429 INFO [qpid.test.utils.QpidTestCase] ========== tearDown ChartBuilderFactoryTest.testTimeSeriesLineChart
==========
main 2014-08-11 15:15:53,430 INFO [qpid.test.utils.QpidTestCase] ========== start ChartBuilderFactoryTest.testLineChart3D
==========
main 2014-08-11 15:15:53,430 INFO [qpid.test.utils.QpidTestCase] ========== tearDown ChartBuilderFactoryTest.testLineChart3D
==========
main 2014-08-11 15:15:53,431 INFO [qpid.test.utils.QpidTestCase] ========== start ChartBuilderFactoryTest.testBarChart3D
==========
main 2014-08-11 15:15:53,432 INFO [qpid.test.utils.QpidTestCase] ========== tearDown ChartBuilderFactoryTest.testBarChart3D
==========
Tests run: 6, Failures: 0, Errors: 0, Skipped: 0, Time elapsed: 0.012 sec - in org.apache.qpid.disttest.charting.chartbuilder.ChartBuilderFactoryTest
Running org.apache.qpid.disttest.charting.chartbuilder.TimeSeriesBuilderCallbackTest
main 2014-08-11 15:15:53,434 INFO [qpid.test.utils.QpidTestCase] ========== start TimeSeriesBuilderCallbackTest.testAddPointToSeries
==========
main 2014-08-11 15:15:53,466 INFO [qpid.test.utils.QpidTestCase] ========== tearDown TimeSeriesBuilderCallbackTest.testAddPointToSeries
==========
Tests run: 1, Failures: 0, Errors: 0, Skipped: 0, Time elapsed: 0.034 sec - in org.apache.qpid.disttest.charting.chartbuilder.TimeSeriesBuilderCallbackTest
Running org.apache.qpid.disttest.charting.chartbuilder.ChartProductionTest
main 2014-08-11 15:15:53,472 INFO [qpid.test.utils.QpidTestCase] ========== start ChartProductionTest.testLine3DChart
==========
main 2014-08-11 15:15:53,477 INFO [disttest.charting.writer.ChartWriter] Set chart directory:
/tmp/charts-1407770153474
main 2014-08-11 15:15:54,277 INFO [disttest.charting.writer.ChartWriter] Written /tmp/charts-1407770153474/testLine3DChart.png
chart
main 2014-08-11 15:15:54,277 INFO [qpid.test.utils.QpidTestCase] ========== tearDown ChartProductionTest.testLine3DChart
==========
main 2014-08-11 15:15:54,277 INFO [qpid.test.utils.QpidTestCase] ========== start ChartProductionTest.testXYLineChart
==========
main 2014-08-11 15:15:54,278 INFO [disttest.charting.writer.ChartWriter] Set chart directory:
/tmp/charts-1407770154278
main 2014-08-11 15:15:54,368 INFO [disttest.charting.writer.ChartWriter] Written /tmp/charts-1407770154278/testXYLineChart.png
chart
main 2014-08-11 15:15:54,368 INFO [qpid.test.utils.QpidTestCase] ========== tearDown ChartProductionTest.testXYLineChart
==========
main 2014-08-11 15:15:54,368 INFO [qpid.test.utils.QpidTestCase] ========== start ChartProductionTest.testStatisticalBarChart
==========
main 2014-08-11 15:15:54,369 INFO [disttest.charting.writer.ChartWriter] Set chart directory:
/tmp/charts-1407770154369
main 2014-08-11 15:15:54,441 INFO [disttest.charting.writer.ChartWriter] Written /tmp/charts-1407770154369/testStatisticalBarChart.png
chart
main 2014-08-11 15:15:54,441 INFO [qpid.test.utils.QpidTestCase] ========== tearDown ChartProductionTest.testStatisticalBarChart
==========
main 2014-08-11 15:15:54,442 INFO [qpid.test.utils.QpidTestCase] ========== start ChartProductionTest.testLineChart
==========
main 2014-08-11 15:15:54,442 INFO [disttest.charting.writer.ChartWriter] Set chart directory:
/tmp/charts-1407770154442
main 2014-08-11 15:15:54,506 INFO [disttest.charting.writer.ChartWriter] Written /tmp/charts-1407770154442/testLineChart.png
chart
main 2014-08-11 15:15:54,506 INFO [qpid.test.utils.QpidTestCase] ========== tearDown ChartProductionTest.testLineChart
==========
main 2014-08-11 15:15:54,507 INFO [qpid.test.utils.QpidTestCase] ========== start ChartProductionTest.testBarChart
==========
main 2014-08-11 15:15:54,507 INFO [disttest.charting.writer.ChartWriter] Set chart directory:
/tmp/charts-1407770154507
main 2014-08-11 15:15:54,573 INFO [disttest.charting.writer.ChartWriter] Written /tmp/charts-1407770154507/testBarChart.png
chart
main 2014-08-11 15:15:54,573 INFO [qpid.test.utils.QpidTestCase] ========== tearDown ChartProductionTest.testBarChart
==========
main 2014-08-11 15:15:54,573 INFO [qpid.test.utils.QpidTestCase] ========== start ChartProductionTest.testBar3DChart
==========
main 2014-08-11 15:15:54,574 INFO [disttest.charting.writer.ChartWriter] Set chart directory:
/tmp/charts-1407770154574
main 2014-08-11 15:15:54,637 INFO [disttest.charting.writer.ChartWriter] Written /tmp/charts-1407770154574/testBar3DChart.png
chart
main 2014-08-11 15:15:54,637 INFO [qpid.test.utils.QpidTestCase] ========== tearDown ChartProductionTest.testBar3DChart
==========
main 2014-08-11 15:15:54,638 INFO [qpid.test.utils.QpidTestCase] ========== start ChartProductionTest.testTimeSeriesLineChart
==========
main 2014-08-11 15:15:54,638 INFO [disttest.charting.writer.ChartWriter] Set chart directory:
/tmp/charts-1407770154638
main 2014-08-11 15:15:54,713 INFO [disttest.charting.writer.ChartWriter] Written /tmp/charts-1407770154638/testTimeSeriesLineChart.png
chart
main 2014-08-11 15:15:54,713 INFO [qpid.test.utils.QpidTestCase] ========== tearDown ChartProductionTest.testTimeSeriesLineChart
==========
main 2014-08-11 15:15:54,713 INFO [qpid.test.utils.QpidTestCase] ========== start ChartProductionTest.testXYLineChartWithColourAndWidth
==========
main 2014-08-11 15:15:54,714 INFO [disttest.charting.writer.ChartWriter] Set chart directory:
/tmp/charts-1407770154714
main 2014-08-11 15:15:54,792 INFO [disttest.charting.writer.ChartWriter] Written /tmp/charts-1407770154714/testXYLineChartWithColourAndWidth.png
chart
main 2014-08-11 15:15:54,792 INFO [qpid.test.utils.QpidTestCase] ========== tearDown ChartProductionTest.testXYLineChartWithColourAndWidth
==========
Tests run: 8, Failures: 0, Errors: 0, Skipped: 0, Time elapsed: 1.325 sec - in org.apache.qpid.disttest.charting.chartbuilder.ChartProductionTest
Running org.apache.qpid.disttest.charting.definition.SeriesDefinitionCreatorTest
main 2014-08-11 15:15:54,794 INFO [qpid.test.utils.QpidTestCase] ========== start SeriesDefinitionCreatorTest.testSeriesDirectoryAndNameSubstitution
==========
main 2014-08-11 15:15:54,794 INFO [qpid.test.utils.QpidTestCase] Set system property "SeriesDefinitionProp"
to: "propValue"
main 2014-08-11 15:15:54,799 INFO [qpid.test.utils.QpidTestCase] ========== tearDown SeriesDefinitionCreatorTest.testSeriesDirectoryAndNameSubstitution
==========
main 2014-08-11 15:15:54,799 DEBUG [qpid.test.utils.QpidTestCase] reverting 1 test properties
main 2014-08-11 15:15:54,799 INFO [qpid.test.utils.QpidTestCase] ========== start SeriesDefinitionCreatorTest.testTwoSeriesDefinitions
==========
main 2014-08-11 15:15:54,800 INFO [qpid.test.utils.QpidTestCase] ========== tearDown SeriesDefinitionCreatorTest.testTwoSeriesDefinitions
==========
main 2014-08-11 15:15:54,801 INFO [qpid.test.utils.QpidTestCase] ========== start SeriesDefinitionCreatorTest.testOneSeriesDefinition
==========
main 2014-08-11 15:15:54,801 INFO [qpid.test.utils.QpidTestCase] ========== tearDown SeriesDefinitionCreatorTest.testOneSeriesDefinition
==========
main 2014-08-11 15:15:54,801 INFO [qpid.test.utils.QpidTestCase] ========== start SeriesDefinitionCreatorTest.testNonSequentialSeriesDefinitionsIgnored
==========
main 2014-08-11 15:15:54,802 INFO [qpid.test.utils.QpidTestCase] ========== tearDown SeriesDefinitionCreatorTest.testNonSequentialSeriesDefinitionsIgnored
==========
Tests run: 4, Failures: 0, Errors: 0, Skipped: 0, Time elapsed: 0.008 sec - in org.apache.qpid.disttest.charting.definition.SeriesDefinitionCreatorTest
Running org.apache.qpid.disttest.charting.definition.ChartingDefinitionCreatorTest
main 2014-08-11 15:15:54,804 INFO [qpid.test.utils.QpidTestCase] ========== start ChartingDefinitionCreatorTest.testLoadTwoDefinitionsFromDirectory
==========
main 2014-08-11 15:15:54,809 INFO [qpid.test.utils.QpidTestCase] ========== tearDown ChartingDefinitionCreatorTest.testLoadTwoDefinitionsFromDirectory
==========
main 2014-08-11 15:15:54,810 INFO [qpid.test.utils.QpidTestCase] ========== start ChartingDefinitionCreatorTest.testLoadOneDefinitionFromFile
==========
main 2014-08-11 15:15:54,811 INFO [qpid.test.utils.QpidTestCase] ========== tearDown ChartingDefinitionCreatorTest.testLoadOneDefinitionFromFile
==========
main 2014-08-11 15:15:54,811 INFO [qpid.test.utils.QpidTestCase] ========== start ChartingDefinitionCreatorTest.testDefinitionsProperties
==========
main 2014-08-11 15:15:54,811 INFO [qpid.test.utils.QpidTestCase] Set system property "ChartingDefinitionSysProp"
to: "propValue"
main 2014-08-11 15:15:54,812 INFO [qpid.test.utils.QpidTestCase] ========== tearDown ChartingDefinitionCreatorTest.testDefinitionsProperties
==========
main 2014-08-11 15:15:54,812 DEBUG [qpid.test.utils.QpidTestCase] reverting 1 test properties
main 2014-08-11 15:15:54,813 INFO [qpid.test.utils.QpidTestCase] ========== start ChartingDefinitionCreatorTest.testDefinitionFileNotFound
==========
main 2014-08-11 15:15:54,813 INFO [qpid.test.utils.QpidTestCase] ========== tearDown ChartingDefinitionCreatorTest.testDefinitionFileNotFound
==========
Tests run: 4, Failures: 0, Errors: 0, Skipped: 0, Time elapsed: 0.01 sec - in org.apache.qpid.disttest.charting.definition.ChartingDefinitionCreatorTest
Running org.apache.qpid.disttest.charting.writer.ChartWriterTest
main 2014-08-11 15:15:54,823 INFO [disttest.charting.writer.ChartWriter] Set chart directory:
/tmp/TestFileUtils-testDir-1407770154822
main 2014-08-11 15:15:54,879 INFO [disttest.charting.writer.ChartWriter] Written /tmp/TestFileUtils-testDir-1407770154822/chart1.png
chart
main 2014-08-11 15:15:54,879 INFO [disttest.charting.writer.ChartWriter] Only 1 chart image(s)
have been written so no HTML summary file will be produced
main 2014-08-11 15:15:54,879 INFO [qpid.test.utils.QpidTestCase] ========== tearDown null
==========
main 2014-08-11 15:15:54,880 INFO [disttest.charting.writer.ChartWriter] Set chart directory:
/tmp/TestFileUtils-testDir-1407770154880
main 2014-08-11 15:15:54,933 INFO [disttest.charting.writer.ChartWriter] Written /tmp/TestFileUtils-testDir-1407770154880/chart1.png
chart
main 2014-08-11 15:15:54,933 INFO [qpid.test.utils.QpidTestCase] ========== tearDown null
==========
main 2014-08-11 15:15:54,934 INFO [disttest.charting.writer.ChartWriter] Set chart directory:
/tmp/TestFileUtils-testDir-1407770154934
main 2014-08-11 15:15:54,987 INFO [disttest.charting.writer.ChartWriter] Written /tmp/TestFileUtils-testDir-1407770154934/chart2.png
chart
main 2014-08-11 15:15:55,040 INFO [disttest.charting.writer.ChartWriter] Written /tmp/TestFileUtils-testDir-1407770154934/chart1.png
chart
main 2014-08-11 15:15:55,041 DEBUG [disttest.charting.writer.ChartWriter] About to produce
HTML summary file /tmp/TestFileUtils-testDir-1407770154934/chart-summary.html from charts
{/tmp/TestFileUtils-testDir-1407770154934/chart1.png=Mock for ChartingDefinition, hashCode:
16508388, /tmp/TestFileUtils-testDir-1407770154934/chart2.png=Mock for ChartingDefinition,
hashCode: 28444761}
main 2014-08-11 15:15:55,047 INFO [qpid.test.utils.QpidTestCase] ========== tearDown null
==========
Tests run: 3, Failures: 0, Errors: 0, Skipped: 0, Time elapsed: 0.233 sec - in org.apache.qpid.disttest.charting.writer.ChartWriterTest

Results :

Tests run: 39, Failures: 0, Errors: 0, Skipped: 0

[INFO] 
[INFO] --- maven-jar-plugin:2.4:jar (default-jar) @ qpid-perftests-visualisation-jfc ---
[INFO] Building jar: /x1/jenkins/jenkins-slave/workspace/Qpid-Java-Cpp-Test/trunk/qpid/java/perftests/visualisation-jfc/target/qpid-perftests-visualisation-jfc-0.32-SNAPSHOT.jar
[INFO] 
[INFO] --- maven-site-plugin:3.3:attach-descriptor (attach-descriptor) @ qpid-perftests-visualisation-jfc
---
[INFO] 
[INFO] --- maven-antrun-plugin:1.7:run (create-qbtc-output-dir) @ qpid-perftests-visualisation-jfc
---
[INFO] Executing tasks

main:
    [mkdir] Created dir: /x1/jenkins/jenkins-slave/workspace/Qpid-Java-Cpp-Test/trunk/qpid/java/perftests/visualisation-jfc/target/qbtc-output
[INFO] Executed tasks
[INFO]                                                                         
[INFO] ------------------------------------------------------------------------
[INFO] Skipping Qpid BDB Store System Tests
[INFO] This project has been banned from the build due to previous failures.
[INFO] ------------------------------------------------------------------------
[INFO] ------------------------------------------------------------------------
[INFO] Reactor Summary:
[INFO] 
[INFO] Qpid Java Build ................................... SUCCESS [2.914s]
[INFO] Qpid AMQP 1.0 Common .............................. SUCCESS [4.473s]
[INFO] Qpid AMQP 1.0 Client .............................. SUCCESS [0.635s]
[INFO] Qpid AMQP 1.0 Client JMS .......................... SUCCESS [2.281s]
[INFO] Qpid AMQP 1.0 JMS Client Examples ................. SUCCESS [0.235s]
[INFO] Qpid AMQP 1.0 Client WebSocket .................... SUCCESS [0.970s]
[INFO] Qpid Broker Code Generation ....................... SUCCESS [0.204s]
[INFO] Qpid Test Utilities ............................... SUCCESS [0.213s]
[INFO] Qpid Common ....................................... SUCCESS [19.171s]
[INFO] Qpid Management Common ............................ SUCCESS [0.761s]
[INFO] Qpid Java Broker Core ............................. SUCCESS [1:15.752s]
[INFO] Qpid Access Control Broker Plug-in ................ SUCCESS [2.289s]
[INFO] Qpid AMQP 0-8 Protocol Broker Plug-in ............. SUCCESS [18.566s]
[INFO] Qpid AMQP 0-10 Protocol Plug-in ................... SUCCESS [2.015s]
[INFO] Qpid AMQP 1-0 Protocol Broker Plug-in ............. SUCCESS [0.660s]
[INFO] Qpid AMQP 0-8 to 0-10 Message Conversion Broker Plug-in  SUCCESS [0.296s]
[INFO] Qpid AMQP 0-8 to 1-0 Message Conversion Broker Plug-in  SUCCESS [0.183s]
[INFO] Qpid AMQP 0-10 to 1-0 Message Conversion Broker Plug-in  SUCCESS [0.160s]
[INFO] Qpid Derby Message Store .......................... SUCCESS [1:29.933s]
[INFO] Qpid JDBC Message Store Connection Pooling Plug-in  SUCCESS [0.502s]
[INFO] Qpid JDBC Message Store Broker Plug-in ............ SUCCESS [5.430s]
[INFO] Qpid HTTP Management Broker Plug-in ............... SUCCESS [2.835s]
[INFO] Qpid JMX Management Broker Plug-in ................ SUCCESS [1.991s]
[INFO] Qpid Memory Message Store Broker Plug-in .......... SUCCESS [0.299s]
[INFO] Qpid AMQP 0-x JMS Client .......................... SUCCESS [4.935s]
[INFO] Qpid BDB Message Store ............................ SUCCESS [1:58.807s]
[INFO] Qpid BDB Message Store JMX ........................ SUCCESS [0.932s]
[INFO] Qpid Java Broker .................................. SUCCESS [3.908s]
[INFO] Qpid AMQP Management Protocol Broker Plug-in ...... SUCCESS [0.280s]
[INFO] Qpid WebSocket Broker Plug-in ..................... SUCCESS [0.268s]
[INFO] Qpid AMQP 0-x JMS Client Examples ................. SUCCESS [0.117s]
[INFO] Qpid JCA .......................................... SUCCESS [0.963s]
[INFO] Qpid Resource Adaptor ............................. SUCCESS [0.457s]
[INFO] Qpid Tools ........................................ SUCCESS [0.847s]
[INFO] Qpid Management Examples .......................... SUCCESS [0.127s]
[INFO] Qpid Java System Test Parent ...................... SUCCESS [0.786s]
[INFO] Qpid System Tests ................................. FAILURE [6:20.457s]
[INFO] Qpid Performance Tests ............................ SUCCESS [13.957s]
[INFO] Qpid Performance Test System Tests ................ SKIPPED
[INFO] Qpid Performance Tests Visualisation JFC .......... SUCCESS [3.195s]
[INFO] Qpid BDB Store System Tests ....................... SKIPPED
[INFO] ------------------------------------------------------------------------
[INFO] BUILD FAILURE
[INFO] ------------------------------------------------------------------------
[INFO] Total time: 12:43.628s
[INFO] Finished at: Mon Aug 11 15:15:55 UTC 2014
[INFO] Final Memory: 70M/373M
[INFO] ------------------------------------------------------------------------
[ERROR] Failed to execute goal org.apache.maven.plugins:maven-surefire-plugin:2.16:test (integration-test)
on project qpid-systests: There are test failures.
[ERROR] 
[ERROR] Please refer to /x1/jenkins/jenkins-slave/workspace/Qpid-Java-Cpp-Test/trunk/qpid/java/systests/target/surefire-reports
for the individual test results.
[ERROR] -> [Help 1]
[ERROR] 
[ERROR] To see the full stack trace of the errors, re-run Maven with the -e switch.
[ERROR] Re-run Maven using the -X switch to enable full debug logging.
[ERROR] 
[ERROR] For more information about the errors and possible solutions, please read the following
articles:
[ERROR] [Help 1] http://cwiki.apache.org/confluence/display/MAVEN/MojoFailureException
[ERROR] 
[ERROR] After correcting the problems, you can resume the build with the command
[ERROR]   mvn <goals> -rf :qpid-systests
Build step 'Invoke top-level Maven targets' marked build as failure
[locks-and-latches] Releasing all the locks
[locks-and-latches] All the locks released
Recording test results

Mime
View raw message