qpid-notifications mailing list archives

Site index · List index
Message view « Date » · « Thread »
Top « Date » · « Thread »
From Apache Jenkins Server <jenk...@builds.apache.org>
Subject Build failed in Jenkins: Qpid-Java-Java-Test-IBMJDK1.7 #797
Date Tue, 05 Aug 2014 07:31:01 GMT
See <https://builds.apache.org/job/Qpid-Java-Java-Test-IBMJDK1.7/797/changes>

Changes:

[gsim] QPID-5959: allow content encoding to be read

[orudyy] QPID-5928: [Java Broker] Modify web management console to hide queues and exchanges
when virtualhost host is stopped or unavailable

[rgodfrey] QPID-5639, QPID-5878 : Ensure that the client gets a chance to evaluate the server
proof for SCRAM-SHA* mechanisms

[macbean] QPID-5935: [Java Broker] Web Management UI style refactor to remove html inline
styles and standardise via css

[kwall] QPID-5958: [Java Broker UI] Add missing panel surrounding connection attributes.

[aconway] NO-JIRA: HA doc - added note management must be enabled.

------------------------------------------
[...truncated 13275 lines...]
main 2014-08-05 07:29:22,441 INFO [qpid.test.utils.QpidTestCase] ========== tearDown JdbcUrlGeneratorTest.testGetJdbcUrlWithoutProvidingAUrlReturnsCsvUrlWithCorrectDirectory
==========
main 2014-08-05 07:29:22,443 INFO [qpid.test.utils.QpidTestCase] ========== start JdbcUrlGeneratorTest.testGetJdbcUrlThrowsExceptionWithoutAProvidedUrlOrSeriesDirectory
==========
main 2014-08-05 07:29:22,444 INFO [qpid.test.utils.QpidTestCase] ========== tearDown JdbcUrlGeneratorTest.testGetJdbcUrlThrowsExceptionWithoutAProvidedUrlOrSeriesDirectory
==========
main 2014-08-05 07:29:22,445 INFO [qpid.test.utils.QpidTestCase] ========== start JdbcUrlGeneratorTest.testGetJdbcUrlThrowsExceptionIfUrlProvidedAndSeriesDirectorySpecified
==========
main 2014-08-05 07:29:22,446 INFO [qpid.test.utils.QpidTestCase] ========== tearDown JdbcUrlGeneratorTest.testGetJdbcUrlThrowsExceptionIfUrlProvidedAndSeriesDirectorySpecified
==========
main 2014-08-05 07:29:22,447 INFO [qpid.test.utils.QpidTestCase] ========== start JdbcUrlGeneratorTest.testGetJdbcUrlReturnsProvidedUrl
==========
main 2014-08-05 07:29:22,448 INFO [qpid.test.utils.QpidTestCase] ========== tearDown JdbcUrlGeneratorTest.testGetJdbcUrlReturnsProvidedUrl
==========
Tests run: 4, Failures: 0, Errors: 0, Skipped: 0, Time elapsed: 0.03 sec - in org.apache.qpid.disttest.charting.seriesbuilder.JdbcUrlGeneratorTest
Running org.apache.qpid.disttest.charting.seriesbuilder.JdbcSeriesBuilderTest
main 2014-08-05 07:29:22,462 INFO [qpid.test.utils.QpidTestCase] ========== start JdbcSeriesBuilderTest.testBuildOneSeries
==========
main 2014-08-05 07:29:22,535 INFO [disttest.charting.seriesbuilder.JdbcSeriesBuilder] Loaded
JDBC driver class org.relique.jdbc.csv.CsvDriver
main 2014-08-05 07:29:22,551 INFO [disttest.charting.seriesbuilder.JdbcSeriesBuilder] Created:
JdbcSeriesBuilder[jdbcUrlGenerator=JdbcUrlGenerator[providedJdbdUrl=<null>]]
main 2014-08-05 07:29:22,633 INFO [qpid.test.utils.QpidTestCase] ========== tearDown JdbcSeriesBuilderTest.testBuildOneSeries
==========
Tests run: 1, Failures: 0, Errors: 0, Skipped: 0, Time elapsed: 0.184 sec - in org.apache.qpid.disttest.charting.seriesbuilder.JdbcSeriesBuilderTest
Running org.apache.qpid.disttest.charting.seriesbuilder.SeriesRowTest
main 2014-08-05 07:29:22,639 INFO [qpid.test.utils.QpidTestCase] ========== start SeriesRowTest.testValidSeriesRowThrowsExceptionIfArrayTooSmall
==========
main 2014-08-05 07:29:22,640 INFO [qpid.test.utils.QpidTestCase] ========== tearDown SeriesRowTest.testValidSeriesRowThrowsExceptionIfArrayTooSmall
==========
main 2014-08-05 07:29:22,641 INFO [qpid.test.utils.QpidTestCase] ========== start SeriesRowTest.testDimension
==========
main 2014-08-05 07:29:22,642 INFO [qpid.test.utils.QpidTestCase] ========== tearDown SeriesRowTest.testDimension
==========
main 2014-08-05 07:29:22,643 INFO [qpid.test.utils.QpidTestCase] ========== start SeriesRowTest.testDimensionAsDouble
==========
main 2014-08-05 07:29:22,643 INFO [qpid.test.utils.QpidTestCase] ========== tearDown SeriesRowTest.testDimensionAsDouble
==========
main 2014-08-05 07:29:22,645 INFO [qpid.test.utils.QpidTestCase] ========== start SeriesRowTest.testDimensionAsString
==========
main 2014-08-05 07:29:22,645 INFO [qpid.test.utils.QpidTestCase] ========== tearDown SeriesRowTest.testDimensionAsString
==========
main 2014-08-05 07:29:22,647 INFO [qpid.test.utils.QpidTestCase] ========== start SeriesRowTest.testValidSeriesRow
==========
main 2014-08-05 07:29:22,647 INFO [qpid.test.utils.QpidTestCase] ========== tearDown SeriesRowTest.testValidSeriesRow
==========
Tests run: 5, Failures: 0, Errors: 0, Skipped: 0, Time elapsed: 0.013 sec - in org.apache.qpid.disttest.charting.seriesbuilder.SeriesRowTest
Running org.apache.qpid.disttest.charting.definition.SeriesDefinitionCreatorTest
main 2014-08-05 07:29:22,654 INFO [qpid.test.utils.QpidTestCase] ========== start SeriesDefinitionCreatorTest.testSeriesDirectoryAndNameSubstitution
==========
main 2014-08-05 07:29:22,654 INFO [qpid.test.utils.QpidTestCase] Set system property "SeriesDefinitionProp"
to: "propValue"
main 2014-08-05 07:29:22,662 INFO [qpid.test.utils.QpidTestCase] ========== tearDown SeriesDefinitionCreatorTest.testSeriesDirectoryAndNameSubstitution
==========
main 2014-08-05 07:29:22,662 DEBUG [qpid.test.utils.QpidTestCase] reverting 1 test properties
main 2014-08-05 07:29:22,663 INFO [qpid.test.utils.QpidTestCase] ========== start SeriesDefinitionCreatorTest.testTwoSeriesDefinitions
==========
main 2014-08-05 07:29:22,666 INFO [qpid.test.utils.QpidTestCase] ========== tearDown SeriesDefinitionCreatorTest.testTwoSeriesDefinitions
==========
main 2014-08-05 07:29:22,667 INFO [qpid.test.utils.QpidTestCase] ========== start SeriesDefinitionCreatorTest.testOneSeriesDefinition
==========
main 2014-08-05 07:29:22,669 INFO [qpid.test.utils.QpidTestCase] ========== tearDown SeriesDefinitionCreatorTest.testOneSeriesDefinition
==========
main 2014-08-05 07:29:22,671 INFO [qpid.test.utils.QpidTestCase] ========== start SeriesDefinitionCreatorTest.testNonSequentialSeriesDefinitionsIgnored
==========
main 2014-08-05 07:29:22,673 INFO [qpid.test.utils.QpidTestCase] ========== tearDown SeriesDefinitionCreatorTest.testNonSequentialSeriesDefinitionsIgnored
==========
Tests run: 4, Failures: 0, Errors: 0, Skipped: 0, Time elapsed: 0.025 sec - in org.apache.qpid.disttest.charting.definition.SeriesDefinitionCreatorTest
Running org.apache.qpid.disttest.charting.definition.ChartingDefinitionCreatorTest
main 2014-08-05 07:29:22,680 INFO [qpid.test.utils.QpidTestCase] ========== start ChartingDefinitionCreatorTest.testLoadTwoDefinitionsFromDirectory
==========
main 2014-08-05 07:29:22,686 INFO [qpid.test.utils.QpidTestCase] ========== tearDown ChartingDefinitionCreatorTest.testLoadTwoDefinitionsFromDirectory
==========
main 2014-08-05 07:29:22,687 INFO [qpid.test.utils.QpidTestCase] ========== start ChartingDefinitionCreatorTest.testLoadOneDefinitionFromFile
==========
main 2014-08-05 07:29:22,689 INFO [qpid.test.utils.QpidTestCase] ========== tearDown ChartingDefinitionCreatorTest.testLoadOneDefinitionFromFile
==========
main 2014-08-05 07:29:22,690 INFO [qpid.test.utils.QpidTestCase] ========== start ChartingDefinitionCreatorTest.testDefinitionsProperties
==========
main 2014-08-05 07:29:22,690 INFO [qpid.test.utils.QpidTestCase] Set system property "ChartingDefinitionSysProp"
to: "propValue"
main 2014-08-05 07:29:22,693 INFO [qpid.test.utils.QpidTestCase] ========== tearDown ChartingDefinitionCreatorTest.testDefinitionsProperties
==========
main 2014-08-05 07:29:22,693 DEBUG [qpid.test.utils.QpidTestCase] reverting 1 test properties
main 2014-08-05 07:29:22,694 INFO [qpid.test.utils.QpidTestCase] ========== start ChartingDefinitionCreatorTest.testDefinitionFileNotFound
==========
main 2014-08-05 07:29:22,695 INFO [qpid.test.utils.QpidTestCase] ========== tearDown ChartingDefinitionCreatorTest.testDefinitionFileNotFound
==========
Tests run: 4, Failures: 0, Errors: 0, Skipped: 0, Time elapsed: 0.02 sec - in org.apache.qpid.disttest.charting.definition.ChartingDefinitionCreatorTest
Running org.apache.qpid.disttest.charting.chartbuilder.TimeSeriesBuilderCallbackTest
main 2014-08-05 07:29:22,700 INFO [qpid.test.utils.QpidTestCase] ========== start TimeSeriesBuilderCallbackTest.testAddPointToSeries
==========
main 2014-08-05 07:29:22,719 INFO [qpid.test.utils.QpidTestCase] ========== tearDown TimeSeriesBuilderCallbackTest.testAddPointToSeries
==========
Tests run: 1, Failures: 0, Errors: 0, Skipped: 0, Time elapsed: 0.022 sec - in org.apache.qpid.disttest.charting.chartbuilder.TimeSeriesBuilderCallbackTest
Running org.apache.qpid.disttest.charting.chartbuilder.ChartProductionTest
main 2014-08-05 07:29:22,766 INFO [qpid.test.utils.QpidTestCase] ========== start ChartProductionTest.testLine3DChart
==========
main 2014-08-05 07:29:22,767 INFO [disttest.charting.writer.ChartWriter] Set chart directory:
/tmp/charts-1407223762767
main 2014-08-05 07:29:23,101 INFO [disttest.charting.writer.ChartWriter] Written /tmp/charts-1407223762767/testLine3DChart.png
chart
main 2014-08-05 07:29:23,101 INFO [qpid.test.utils.QpidTestCase] ========== tearDown ChartProductionTest.testLine3DChart
==========
main 2014-08-05 07:29:23,102 INFO [qpid.test.utils.QpidTestCase] ========== start ChartProductionTest.testXYLineChart
==========
main 2014-08-05 07:29:23,103 INFO [disttest.charting.writer.ChartWriter] Set chart directory:
/tmp/charts-1407223763102
main 2014-08-05 07:29:23,283 INFO [disttest.charting.writer.ChartWriter] Written /tmp/charts-1407223763102/testXYLineChart.png
chart
main 2014-08-05 07:29:23,283 INFO [qpid.test.utils.QpidTestCase] ========== tearDown ChartProductionTest.testXYLineChart
==========
main 2014-08-05 07:29:23,284 INFO [qpid.test.utils.QpidTestCase] ========== start ChartProductionTest.testStatisticalBarChart
==========
main 2014-08-05 07:29:23,285 INFO [disttest.charting.writer.ChartWriter] Set chart directory:
/tmp/charts-1407223763285
main 2014-08-05 07:29:23,427 INFO [disttest.charting.writer.ChartWriter] Written /tmp/charts-1407223763285/testStatisticalBarChart.png
chart
main 2014-08-05 07:29:23,428 INFO [qpid.test.utils.QpidTestCase] ========== tearDown ChartProductionTest.testStatisticalBarChart
==========
main 2014-08-05 07:29:23,429 INFO [qpid.test.utils.QpidTestCase] ========== start ChartProductionTest.testLineChart
==========
main 2014-08-05 07:29:23,430 INFO [disttest.charting.writer.ChartWriter] Set chart directory:
/tmp/charts-1407223763430
main 2014-08-05 07:29:23,572 INFO [disttest.charting.writer.ChartWriter] Written /tmp/charts-1407223763430/testLineChart.png
chart
main 2014-08-05 07:29:23,572 INFO [qpid.test.utils.QpidTestCase] ========== tearDown ChartProductionTest.testLineChart
==========
main 2014-08-05 07:29:23,574 INFO [qpid.test.utils.QpidTestCase] ========== start ChartProductionTest.testBarChart
==========
main 2014-08-05 07:29:23,575 INFO [disttest.charting.writer.ChartWriter] Set chart directory:
/tmp/charts-1407223763575
main 2014-08-05 07:29:23,694 INFO [disttest.charting.writer.ChartWriter] Written /tmp/charts-1407223763575/testBarChart.png
chart
main 2014-08-05 07:29:23,694 INFO [qpid.test.utils.QpidTestCase] ========== tearDown ChartProductionTest.testBarChart
==========
main 2014-08-05 07:29:23,695 INFO [qpid.test.utils.QpidTestCase] ========== start ChartProductionTest.testBar3DChart
==========
main 2014-08-05 07:29:23,697 INFO [disttest.charting.writer.ChartWriter] Set chart directory:
/tmp/charts-1407223763697
main 2014-08-05 07:29:23,831 INFO [disttest.charting.writer.ChartWriter] Written /tmp/charts-1407223763697/testBar3DChart.png
chart
main 2014-08-05 07:29:23,831 INFO [qpid.test.utils.QpidTestCase] ========== tearDown ChartProductionTest.testBar3DChart
==========
main 2014-08-05 07:29:23,832 INFO [qpid.test.utils.QpidTestCase] ========== start ChartProductionTest.testTimeSeriesLineChart
==========
main 2014-08-05 07:29:23,833 INFO [disttest.charting.writer.ChartWriter] Set chart directory:
/tmp/charts-1407223763833
main 2014-08-05 07:29:24,010 INFO [disttest.charting.writer.ChartWriter] Written /tmp/charts-1407223763833/testTimeSeriesLineChart.png
chart
main 2014-08-05 07:29:24,010 INFO [qpid.test.utils.QpidTestCase] ========== tearDown ChartProductionTest.testTimeSeriesLineChart
==========
main 2014-08-05 07:29:24,013 INFO [qpid.test.utils.QpidTestCase] ========== start ChartProductionTest.testXYLineChartWithColourAndWidth
==========
main 2014-08-05 07:29:24,014 INFO [disttest.charting.writer.ChartWriter] Set chart directory:
/tmp/charts-1407223764014
main 2014-08-05 07:29:24,135 INFO [disttest.charting.writer.ChartWriter] Written /tmp/charts-1407223764014/testXYLineChartWithColourAndWidth.png
chart
main 2014-08-05 07:29:24,135 INFO [qpid.test.utils.QpidTestCase] ========== tearDown ChartProductionTest.testXYLineChartWithColourAndWidth
==========
Tests run: 8, Failures: 0, Errors: 0, Skipped: 0, Time elapsed: 1.42 sec - in org.apache.qpid.disttest.charting.chartbuilder.ChartProductionTest
Running org.apache.qpid.disttest.charting.chartbuilder.BaseChartBuilderTest
main 2014-08-05 07:29:24,202 INFO [qpid.test.utils.QpidTestCase] ========== start BaseChartBuilderTest.testBuildChart
==========
main 2014-08-05 07:29:24,204 INFO [qpid.test.utils.QpidTestCase] ========== tearDown BaseChartBuilderTest.testBuildChart
==========
Tests run: 1, Failures: 0, Errors: 0, Skipped: 0, Time elapsed: 0.065 sec - in org.apache.qpid.disttest.charting.chartbuilder.BaseChartBuilderTest
Running org.apache.qpid.disttest.charting.chartbuilder.ColorFactoryTest
main 2014-08-05 07:29:24,208 INFO [qpid.test.utils.QpidTestCase] ========== start ColorFactoryTest.testDarkBlue
==========
main 2014-08-05 07:29:24,209 INFO [qpid.test.utils.QpidTestCase] ========== tearDown ColorFactoryTest.testDarkBlue
==========
main 2014-08-05 07:29:24,210 INFO [qpid.test.utils.QpidTestCase] ========== start ColorFactoryTest.testBlue
==========
main 2014-08-05 07:29:24,210 INFO [qpid.test.utils.QpidTestCase] ========== tearDown ColorFactoryTest.testBlue
==========
Tests run: 2, Failures: 0, Errors: 0, Skipped: 0, Time elapsed: 0.005 sec - in org.apache.qpid.disttest.charting.chartbuilder.ColorFactoryTest
Running org.apache.qpid.disttest.charting.chartbuilder.ChartBuilderFactoryTest
main 2014-08-05 07:29:24,216 INFO [qpid.test.utils.QpidTestCase] ========== start ChartBuilderFactoryTest.testXYLineChart
==========
main 2014-08-05 07:29:24,216 INFO [qpid.test.utils.QpidTestCase] ========== tearDown ChartBuilderFactoryTest.testXYLineChart
==========
main 2014-08-05 07:29:24,217 INFO [qpid.test.utils.QpidTestCase] ========== start ChartBuilderFactoryTest.testLineChart
==========
main 2014-08-05 07:29:24,217 INFO [qpid.test.utils.QpidTestCase] ========== tearDown ChartBuilderFactoryTest.testLineChart
==========
main 2014-08-05 07:29:24,219 INFO [qpid.test.utils.QpidTestCase] ========== start ChartBuilderFactoryTest.testBarChart
==========
main 2014-08-05 07:29:24,219 INFO [qpid.test.utils.QpidTestCase] ========== tearDown ChartBuilderFactoryTest.testBarChart
==========
main 2014-08-05 07:29:24,220 INFO [qpid.test.utils.QpidTestCase] ========== start ChartBuilderFactoryTest.testTimeSeriesLineChart
==========
main 2014-08-05 07:29:24,220 INFO [qpid.test.utils.QpidTestCase] ========== tearDown ChartBuilderFactoryTest.testTimeSeriesLineChart
==========
main 2014-08-05 07:29:24,221 INFO [qpid.test.utils.QpidTestCase] ========== start ChartBuilderFactoryTest.testLineChart3D
==========
main 2014-08-05 07:29:24,222 INFO [qpid.test.utils.QpidTestCase] ========== tearDown ChartBuilderFactoryTest.testLineChart3D
==========
main 2014-08-05 07:29:24,223 INFO [qpid.test.utils.QpidTestCase] ========== start ChartBuilderFactoryTest.testBarChart3D
==========
main 2014-08-05 07:29:24,223 INFO [qpid.test.utils.QpidTestCase] ========== tearDown ChartBuilderFactoryTest.testBarChart3D
==========
Tests run: 6, Failures: 0, Errors: 0, Skipped: 0, Time elapsed: 0.011 sec - in org.apache.qpid.disttest.charting.chartbuilder.ChartBuilderFactoryTest

Results :

Tests run: 39, Failures: 0, Errors: 0, Skipped: 0

[INFO] 
[INFO] --- maven-jar-plugin:2.4:jar (default-jar) @ qpid-perftests-visualisation-jfc ---
[INFO] Building jar: <https://builds.apache.org/job/Qpid-Java-Java-Test-IBMJDK1.7/ws/trunk/qpid/java/perftests/visualisation-jfc/target/qpid-perftests-visualisation-jfc-0.30-SNAPSHOT.jar>
[INFO] 
[INFO] --- maven-site-plugin:3.3:attach-descriptor (attach-descriptor) @ qpid-perftests-visualisation-jfc
---
[INFO] 
[INFO] --- maven-antrun-plugin:1.7:run (create-qbtc-output-dir) @ qpid-perftests-visualisation-jfc
---
[INFO] Executing tasks

main:
    [mkdir] Created dir: <https://builds.apache.org/job/Qpid-Java-Java-Test-IBMJDK1.7/ws/trunk/qpid/java/perftests/visualisation-jfc/target/qbtc-output>
[INFO] Executed tasks
[INFO] 
[INFO] --- maven-site-plugin:3.3:site (default-site) @ qpid-perftests-visualisation-jfc ---
[INFO] configuring report plugin org.apache.maven.plugins:maven-project-info-reports-plugin:2.7
[INFO] configuring report plugin org.codehaus.mojo:license-maven-plugin:1.6
[INFO] configuring report plugin org.apache.maven.plugins:maven-surefire-report-plugin:2.16
[INFO] configuring report plugin org.apache.maven.plugins:maven-jxr-plugin:2.3
[INFO] configuring report plugin org.jacoco:jacoco-maven-plugin:0.7.0.201403182114
[INFO] Skipping JaCoCo execution due to missing execution data <https://builds.apache.org/job/Qpid-Java-Java-Test-IBMJDK1.7/ws/trunk/qpid/java/perftests/visualisation-jfc/target/jacoco-it.exec>
[INFO] Skipping JaCoCo execution due to missing execution data <https://builds.apache.org/job/Qpid-Java-Java-Test-IBMJDK1.7/ws/trunk/qpid/java/perftests/visualisation-jfc/target/jacoco.exec>
[INFO] configuring report plugin org.apache.rat:apache-rat-plugin:0.10
[INFO] Parent project loaded from repository: org.apache.qpid:qpid-parent:pom:1.0
[INFO] Parent project loaded from repository: org.apache:apache:pom:14
[INFO] Relativizing decoration links with respect to project URL: http://qpid.apache.org/qpid-java-build/perftests/qpid-perftests-visualisation-jfc
[INFO] Rendering site with org.apache.maven.skins:maven-default-skin:jar:1.0 skin.
[INFO] Generating "About" report    --- maven-project-info-reports-plugin:2.7
[INFO] Generating "Plugin Management" report    --- maven-project-info-reports-plugin:2.7
[INFO] Generating "Distribution Management" report    --- maven-project-info-reports-plugin:2.7
[INFO] Generating "Dependency Information" report    --- maven-project-info-reports-plugin:2.7
[INFO] Generating "Dependency Convergence" report    --- maven-project-info-reports-plugin:2.7
[INFO] Generating "Source Repository" report    --- maven-project-info-reports-plugin:2.7
[INFO] Generating "Mailing Lists" report    --- maven-project-info-reports-plugin:2.7
[INFO] Generating "Issue Tracking" report    --- maven-project-info-reports-plugin:2.7
[INFO] Generating "Continuous Integration" report    --- maven-project-info-reports-plugin:2.7
[INFO] Generating "Project Plugins" report    --- maven-project-info-reports-plugin:2.7
[INFO] Generating "Project License" report    --- maven-project-info-reports-plugin:2.7
[INFO] Generating "Dependency Management" report    --- maven-project-info-reports-plugin:2.7
[INFO] Generating "Project Team" report    --- maven-project-info-reports-plugin:2.7
[INFO] Generating "Project Summary" report    --- maven-project-info-reports-plugin:2.7
[INFO] Generating "Dependencies" report    --- maven-project-info-reports-plugin:2.7
[INFO] Generating "Third Parties" report    --- license-maven-plugin:1.6
[INFO] Generating "Surefire Report" report    --- maven-surefire-report-plugin:2.16
[INFO] Generating "Source Xref" report    --- maven-jxr-plugin:2.3
[INFO] Generating "Test Source Xref" report    --- maven-jxr-plugin:2.3
[INFO] Generating "Rat Report" report    --- apache-rat-plugin:0.10
[INFO] 51 implicit excludes (use -debug for more details).
[INFO] Exclude: build/**
[INFO] Exclude: lib/**
[INFO] Exclude: test-profiles/test_resources/ssl/**
[INFO] 43 resources included (use -debug for more details)
[INFO] 
[INFO] --- maven-site-plugin:3.3:stage (default-cli) @ qpid-perftests-visualisation-jfc ---
[INFO] Using this base directory for staging: <https://builds.apache.org/job/Qpid-Java-Java-Test-IBMJDK1.7/ws/trunk/qpid/java/target/staging>
[INFO] Parent project loaded from repository: org.apache.qpid:qpid-parent:pom:1.0
file://<https://builds.apache.org/job/Qpid-Java-Java-Test-IBMJDK1.7/ws/trunk/qpid/java/target/staging/>
- Session: Opened  
[INFO] Pushing <https://builds.apache.org/job/Qpid-Java-Java-Test-IBMJDK1.7/ws/trunk/qpid/java/perftests/visualisation-jfc/target/site>
[INFO]    >>> to file://<https://builds.apache.org/job/Qpid-Java-Java-Test-IBMJDK1.7/ws/trunk/qpid/java/target/staging/perftests/visualisation-jfc/perftests/qpid-perftests-visualisation-jfc>
file://<https://builds.apache.org/job/Qpid-Java-Java-Test-IBMJDK1.7/ws/trunk/qpid/java/target/staging/>
- Session: Disconnecting  
file://<https://builds.apache.org/job/Qpid-Java-Java-Test-IBMJDK1.7/ws/trunk/qpid/java/target/staging/>
- Session: Disconnected
[INFO]                                                                         
[INFO] ------------------------------------------------------------------------
[INFO] Skipping Qpid BDB Store System Tests
[INFO] This project has been banned from the build due to previous failures.
[INFO] ------------------------------------------------------------------------
[INFO] ------------------------------------------------------------------------
[INFO] Reactor Summary:
[INFO] 
[INFO] Qpid Java Build ................................... SUCCESS [55.563s]
[INFO] Qpid AMQP 1.0 Common .............................. SUCCESS [16.932s]
[INFO] Qpid AMQP 1.0 Client .............................. SUCCESS [6.277s]
[INFO] Qpid AMQP 1.0 Client JMS .......................... SUCCESS [7.029s]
[INFO] Qpid AMQP 1.0 Client WebSocket .................... SUCCESS [5.122s]
[INFO] Qpid Broker Code Generation ....................... SUCCESS [4.192s]
[INFO] Qpid Test Utilities ............................... SUCCESS [3.446s]
[INFO] Qpid Common ....................................... SUCCESS [39.750s]
[INFO] Qpid Management Common ............................ SUCCESS [5.495s]
[INFO] Qpid Java Broker Core ............................. SUCCESS [1:27.298s]
[INFO] Qpid Access Control Broker Plug-in ................ SUCCESS [9.953s]
[INFO] Qpid AMQP 0-8 Protocol Broker Plug-in ............. SUCCESS [28.215s]
[INFO] Qpid AMQP 0-10 Protocol Plug-in ................... SUCCESS [7.976s]
[INFO] Qpid AMQP 1-0 Protocol Broker Plug-in ............. SUCCESS [4.072s]
[INFO] Qpid AMQP 0-8 to 0-10 Message Conversion Broker Plug-in  SUCCESS [3.428s]
[INFO] Qpid AMQP 0-8 to 1-0 Message Conversion Broker Plug-in  SUCCESS [3.738s]
[INFO] Qpid AMQP 0-10 to 1-0 Message Conversion Broker Plug-in  SUCCESS [3.668s]
[INFO] Qpid Derby Message Store .......................... SUCCESS [21.636s]
[INFO] Qpid JDBC Message Store Connection Pooling Plug-in  SUCCESS [3.244s]
[INFO] Qpid JDBC Message Store Broker Plug-in ............ SUCCESS [14.878s]
[INFO] Qpid HTTP Management Broker Plug-in ............... SUCCESS [9.997s]
[INFO] Qpid JMX Management Broker Plug-in ................ SUCCESS [7.149s]
[INFO] Qpid Memory Message Store Broker Plug-in .......... SUCCESS [3.084s]
[INFO] Qpid AMQP 0-x JMS Client .......................... SUCCESS [15.078s]
[INFO] Qpid BDB Message Store ............................ SUCCESS [50.876s]
[INFO] Qpid BDB Message Store JMX ........................ SUCCESS [6.588s]
[INFO] Qpid Java Broker .................................. SUCCESS [11.217s]
[INFO] Qpid AMQP Management Protocol Broker Plug-in ...... SUCCESS [2.890s]
[INFO] Qpid WebSocket Broker Plug-in ..................... SUCCESS [3.301s]
[INFO] Qpid AMQP 0-x JMS Client Examples ................. SUCCESS [3.155s]
[INFO] Qpid JCA .......................................... SUCCESS [7.753s]
[INFO] Qpid Resource Adaptor ............................. SUCCESS [3.150s]
[INFO] Qpid Tools ........................................ SUCCESS [3.027s]
[INFO] Qpid Management Examples .......................... SUCCESS [2.929s]
[INFO] Qpid Java System Test Parent ...................... SUCCESS [3.422s]
[INFO] Qpid System Tests ................................. FAILURE [23:28.447s]
[INFO] Qpid Performance Tests ............................ SUCCESS [29.777s]
[INFO] Qpid Performance Test System Tests ................ SKIPPED
[INFO] Qpid Performance Tests Visualisation JFC .......... SUCCESS [9.969s]
[INFO] Qpid BDB Store System Tests ....................... SKIPPED
[INFO] ------------------------------------------------------------------------
[INFO] BUILD FAILURE
[INFO] ------------------------------------------------------------------------
[INFO] Total time: 31:57.012s
[INFO] Finished at: Tue Aug 05 07:29:27 UTC 2014
[INFO] Final Memory: 98M/278M
[INFO] ------------------------------------------------------------------------
[ERROR] Failed to execute goal org.apache.maven.plugins:maven-surefire-plugin:2.16:test (integration-test)
on project qpid-systests: There are test failures.
[ERROR] 
[ERROR] Please refer to <https://builds.apache.org/job/Qpid-Java-Java-Test-IBMJDK1.7/ws/trunk/qpid/java/systests/target/surefire-reports>
for the individual test results.
[ERROR] -> [Help 1]
[ERROR] 
[ERROR] To see the full stack trace of the errors, re-run Maven with the -e switch.
[ERROR] Re-run Maven using the -X switch to enable full debug logging.
[ERROR] 
[ERROR] For more information about the errors and possible solutions, please read the following
articles:
[ERROR] [Help 1] http://cwiki.apache.org/confluence/display/MAVEN/MojoFailureException
[ERROR] 
[ERROR] After correcting the problems, you can resume the build with the command
[ERROR]   mvn <goals> -rf :qpid-systests
Build step 'Invoke top-level Maven targets' marked build as failure
[locks-and-latches] Releasing all the locks
[locks-and-latches] All the locks released
Recording test results

Mime
View raw message