qpid-notifications mailing list archives

Site index · List index
Message view « Date » · « Thread »
Top « Date » · « Thread »
From Apache Jenkins Server <jenk...@builds.apache.org>
Subject Build failed in Jenkins: Qpid-Java-Java-Test-JDK1.8 #818
Date Sat, 09 Aug 2014 07:33:01 GMT
See <https://builds.apache.org/job/Qpid-Java-Java-Test-JDK1.8/818/changes>

Changes:

[rgodfrey] QPID-5878 : Address review comments from [~k-wall]

[rgodfrey] QPID-5745 : [Java Broker] enforce disconnect of AMQP 0-x connections when authentication
is not performed in a timely manner

[rgodfrey] QPID-5746 : [Java Broker] enforce idle disconnect of AMQP 0-8/9/9-1 connections

[robbie] QPID-5610: add a profile override to the QMF build to disable the apache-release
source assembly creation

[robbie] QPID-5980: tweak javadoc for QMF2 bits to remove errors (but not warnings), allow
success when processing with the strict new Java8 tooling

[orudyy] QPID-5981: [Java Broker] Add ability to set binding arguments in web management console

[robbie] QPID-5980: final tweaks to resolve javadoc errors and allow use of the apache-release
profile

[rgodfrey] QPID-4307 : [Java Broker] prevent the copying/moving of messages onto queues on
which the message already exists

[robbie] QPID-5980: javadoc fixups continue

[robbie] QPID-5980: continued javadoc fixups

[kwall] QPID-5979: Derby/JDBC logs unnecessary "message not found" at WARN on rollback.

[robbie] QPID-5980: yet more javadoc fixups

[robbie] QPID-5980: more javadoc fixups

[robbie] QPID-5980: revert exclusion of selector parser from javadoc run, it is only emitting
warnings

[robbie] QPID-5980: exclude selector parser from javadoc, its full of generated incomplete
javadoc

[robbie] QPID-5980: more javadoc fixups

[robbie] QPID-5980: initial javadoc fixups

[rgodfrey] QPID-3978 : [Java Broker] Allow for acquired messages to be removed from a queue
due to TTL or management actions

[rgodfrey] QPID-5978 : [Java Client] fail faster when a TCP connection is established, but
the AMQP layer is not - e.g. due to SSL negotiation failure

[kwall] QPID-5976: [Java Broker] The file keystore/truststore objects should not try to validate
external file when transitioning to deleted state.

[robbie] QPID-5813: advance version numbers on trunk to 0.32-SNAPSHOT

[macbean] NO_JIRA: update docbook version variables to match that of the maven poms

[aconway] QPID-5966: HA mixing tx enqueue and non-tx dequeue leaves extra messages on backup.

There were several problems:

1. Positions of transactionally enqueued messages not known to QueueReplicator, so not dequeued
   on backup if dequeued outside a TX on primary.

2. Race condition if tx created immediately after queue could cause duplication of TX message.

3. Replication IDs were not being set during recovery from store (regression, store change?)

Fix:

1. Update positions QueueReplicator positions via QueueObserver::enqueued to see all enqueues.
2. Check for duplicate replication-ids on backup in QueueReplicator::route.
3. Set replication-id in publish() if not already set in record().

[aconway] QPID-5974: HA qpid-txtest2 can bring down a cluster (JERR_MAP_LOCKED))

Problem: transactional dequeues can be sent via two paths as part of the transaction and
via the normal queue replication. If journal is involved this can result result in store errors
if the normal replication path attempts to dequeue before the transaction.

Solution: this is also the case for enqueues, and we already have code in place to skip replication
of tx enqueues via the normal route. Copied the same logic for dequeues.

[aconway] QPID-5973: HA cluster state may get stuck in recovering

A backup queue is considered "ready" when all messages up to the first guarded
position have either been replicated and acknowledged or dequeued.

Previously this was implemented by waiting for the replicationg subscription to
advance to the first guarded position and wating for all expected acks. However
if messages are dequeued out-of-order (which happens with transactions) there
can be a gap at the tail of the queue. The replicating subscription will not
advance past this gap because it only advances when there are messages to
consume. This resulted in backups stuck in catch-up. The recovering primary has
a time-out for backups that never re-connect, but if they connect sucessfully
and don't disconnect, the primary assumes they will become ready and waits -
causing the primary to be stuck in "recovering".

The fixes is to notify a replicating subscription if it becomes "stopped"
because there are no more messages available on the queue. This implies that
either it is at the tail OR there are no more messags until the tail. Either way
we should consider this "ready" from the point of view of HA catch-up.

[jross] QPID-5813: Advance version numbers on trunk to 0.29

[jross] QPID-5813: Advance version numbers on trunk to 0.29 or 0.32-SNAPSHOT as appropriate

[kwall] QPID-5972: [Java Broker] Web UI to edit actual attribute values rather than effective
values

Work completed by Andrew MacBean <macbean@apache.org> and me.

[rgodfrey] QPID-5957 : fix race condition which can cause test to fail

[rgodfrey] QPID-5971 : [Java Broker] enable long running transaction warnings by default

[rgodfrey] QPID-5970 : [Java Broker] Expose "age of oldest message on queue" to management
apis

------------------------------------------
[...truncated 22865 lines...]
main 2014-08-09 07:32:10,284 INFO [qpid.test.utils.QpidTestCase] ========== start JdbcUrlGeneratorTest.testGetJdbcUrlThrowsExceptionIfUrlProvidedAndSeriesDirectorySpecified
==========
main 2014-08-09 07:32:10,285 INFO [qpid.test.utils.QpidTestCase] ========== tearDown JdbcUrlGeneratorTest.testGetJdbcUrlThrowsExceptionIfUrlProvidedAndSeriesDirectorySpecified
==========
main 2014-08-09 07:32:10,286 INFO [qpid.test.utils.QpidTestCase] ========== start JdbcUrlGeneratorTest.testGetJdbcUrlReturnsProvidedUrl
==========
main 2014-08-09 07:32:10,286 INFO [qpid.test.utils.QpidTestCase] ========== tearDown JdbcUrlGeneratorTest.testGetJdbcUrlReturnsProvidedUrl
==========
Tests run: 4, Failures: 0, Errors: 0, Skipped: 0, Time elapsed: 0.044 sec - in org.apache.qpid.disttest.charting.seriesbuilder.JdbcUrlGeneratorTest
Running org.apache.qpid.disttest.charting.chartbuilder.ColorFactoryTest
main 2014-08-09 07:32:10,288 INFO [qpid.test.utils.QpidTestCase] ========== start ColorFactoryTest.testDarkBlue
==========
main 2014-08-09 07:32:10,392 INFO [qpid.test.utils.QpidTestCase] ========== tearDown ColorFactoryTest.testDarkBlue
==========
main 2014-08-09 07:32:10,393 INFO [qpid.test.utils.QpidTestCase] ========== start ColorFactoryTest.testBlue
==========
main 2014-08-09 07:32:10,393 INFO [qpid.test.utils.QpidTestCase] ========== tearDown ColorFactoryTest.testBlue
==========
Tests run: 2, Failures: 0, Errors: 0, Skipped: 0, Time elapsed: 0.11 sec - in org.apache.qpid.disttest.charting.chartbuilder.ColorFactoryTest
Running org.apache.qpid.disttest.charting.chartbuilder.BaseChartBuilderTest
main 2014-08-09 07:32:10,542 INFO [qpid.test.utils.QpidTestCase] ========== start BaseChartBuilderTest.testBuildChart
==========
main 2014-08-09 07:32:11,178 INFO [qpid.test.utils.QpidTestCase] ========== tearDown BaseChartBuilderTest.testBuildChart
==========
Tests run: 1, Failures: 0, Errors: 0, Skipped: 0, Time elapsed: 0.786 sec - in org.apache.qpid.disttest.charting.chartbuilder.BaseChartBuilderTest
Running org.apache.qpid.disttest.charting.chartbuilder.ChartBuilderFactoryTest
main 2014-08-09 07:32:11,183 INFO [qpid.test.utils.QpidTestCase] ========== start ChartBuilderFactoryTest.testXYLineChart
==========
main 2014-08-09 07:32:11,184 INFO [qpid.test.utils.QpidTestCase] ========== tearDown ChartBuilderFactoryTest.testXYLineChart
==========
main 2014-08-09 07:32:11,185 INFO [qpid.test.utils.QpidTestCase] ========== start ChartBuilderFactoryTest.testLineChart
==========
main 2014-08-09 07:32:11,185 INFO [qpid.test.utils.QpidTestCase] ========== tearDown ChartBuilderFactoryTest.testLineChart
==========
main 2014-08-09 07:32:11,186 INFO [qpid.test.utils.QpidTestCase] ========== start ChartBuilderFactoryTest.testBarChart
==========
main 2014-08-09 07:32:11,186 INFO [qpid.test.utils.QpidTestCase] ========== tearDown ChartBuilderFactoryTest.testBarChart
==========
main 2014-08-09 07:32:11,187 INFO [qpid.test.utils.QpidTestCase] ========== start ChartBuilderFactoryTest.testTimeSeriesLineChart
==========
main 2014-08-09 07:32:11,187 INFO [qpid.test.utils.QpidTestCase] ========== tearDown ChartBuilderFactoryTest.testTimeSeriesLineChart
==========
main 2014-08-09 07:32:11,188 INFO [qpid.test.utils.QpidTestCase] ========== start ChartBuilderFactoryTest.testLineChart3D
==========
main 2014-08-09 07:32:11,188 INFO [qpid.test.utils.QpidTestCase] ========== tearDown ChartBuilderFactoryTest.testLineChart3D
==========
main 2014-08-09 07:32:11,189 INFO [qpid.test.utils.QpidTestCase] ========== start ChartBuilderFactoryTest.testBarChart3D
==========
main 2014-08-09 07:32:11,189 INFO [qpid.test.utils.QpidTestCase] ========== tearDown ChartBuilderFactoryTest.testBarChart3D
==========
Tests run: 6, Failures: 0, Errors: 0, Skipped: 0, Time elapsed: 0 sec - in org.apache.qpid.disttest.charting.chartbuilder.ChartBuilderFactoryTest
Running org.apache.qpid.disttest.charting.chartbuilder.TimeSeriesBuilderCallbackTest
main 2014-08-09 07:32:11,191 INFO [qpid.test.utils.QpidTestCase] ========== start TimeSeriesBuilderCallbackTest.testAddPointToSeries
==========
main 2014-08-09 07:32:11,297 INFO [qpid.test.utils.QpidTestCase] ========== tearDown TimeSeriesBuilderCallbackTest.testAddPointToSeries
==========
Tests run: 1, Failures: 0, Errors: 0, Skipped: 0, Time elapsed: 0 sec - in org.apache.qpid.disttest.charting.chartbuilder.TimeSeriesBuilderCallbackTest
Running org.apache.qpid.disttest.charting.chartbuilder.ChartProductionTest
main 2014-08-09 07:32:11,302 INFO [qpid.test.utils.QpidTestCase] ========== start ChartProductionTest.testLine3DChart
==========
main 2014-08-09 07:32:11,305 INFO [disttest.charting.writer.ChartWriter] Set chart directory:
/tmp/charts-1407569531304
main 2014-08-09 07:32:13,785 INFO [disttest.charting.writer.ChartWriter] Written /tmp/charts-1407569531304/testLine3DChart.png
chart
main 2014-08-09 07:32:13,785 INFO [qpid.test.utils.QpidTestCase] ========== tearDown ChartProductionTest.testLine3DChart
==========
main 2014-08-09 07:32:13,786 INFO [qpid.test.utils.QpidTestCase] ========== start ChartProductionTest.testXYLineChart
==========
main 2014-08-09 07:32:13,787 INFO [disttest.charting.writer.ChartWriter] Set chart directory:
/tmp/charts-1407569533786
main 2014-08-09 07:32:13,997 INFO [disttest.charting.writer.ChartWriter] Written /tmp/charts-1407569533786/testXYLineChart.png
chart
main 2014-08-09 07:32:13,998 INFO [qpid.test.utils.QpidTestCase] ========== tearDown ChartProductionTest.testXYLineChart
==========
main 2014-08-09 07:32:13,998 INFO [qpid.test.utils.QpidTestCase] ========== start ChartProductionTest.testStatisticalBarChart
==========
main 2014-08-09 07:32:13,999 INFO [disttest.charting.writer.ChartWriter] Set chart directory:
/tmp/charts-1407569533999
main 2014-08-09 07:32:14,123 INFO [disttest.charting.writer.ChartWriter] Written /tmp/charts-1407569533999/testStatisticalBarChart.png
chart
main 2014-08-09 07:32:14,123 INFO [qpid.test.utils.QpidTestCase] ========== tearDown ChartProductionTest.testStatisticalBarChart
==========
main 2014-08-09 07:32:14,123 INFO [qpid.test.utils.QpidTestCase] ========== start ChartProductionTest.testLineChart
==========
main 2014-08-09 07:32:14,124 INFO [disttest.charting.writer.ChartWriter] Set chart directory:
/tmp/charts-1407569534124
main 2014-08-09 07:32:14,347 INFO [disttest.charting.writer.ChartWriter] Written /tmp/charts-1407569534124/testLineChart.png
chart
main 2014-08-09 07:32:14,347 INFO [qpid.test.utils.QpidTestCase] ========== tearDown ChartProductionTest.testLineChart
==========
main 2014-08-09 07:32:14,347 INFO [qpid.test.utils.QpidTestCase] ========== start ChartProductionTest.testBarChart
==========
main 2014-08-09 07:32:14,348 INFO [disttest.charting.writer.ChartWriter] Set chart directory:
/tmp/charts-1407569534348
main 2014-08-09 07:32:14,485 INFO [disttest.charting.writer.ChartWriter] Written /tmp/charts-1407569534348/testBarChart.png
chart
main 2014-08-09 07:32:14,485 INFO [qpid.test.utils.QpidTestCase] ========== tearDown ChartProductionTest.testBarChart
==========
main 2014-08-09 07:32:14,487 INFO [qpid.test.utils.QpidTestCase] ========== start ChartProductionTest.testBar3DChart
==========
main 2014-08-09 07:32:14,488 INFO [disttest.charting.writer.ChartWriter] Set chart directory:
/tmp/charts-1407569534488
main 2014-08-09 07:32:14,659 INFO [disttest.charting.writer.ChartWriter] Written /tmp/charts-1407569534488/testBar3DChart.png
chart
main 2014-08-09 07:32:14,659 INFO [qpid.test.utils.QpidTestCase] ========== tearDown ChartProductionTest.testBar3DChart
==========
main 2014-08-09 07:32:14,660 INFO [qpid.test.utils.QpidTestCase] ========== start ChartProductionTest.testTimeSeriesLineChart
==========
main 2014-08-09 07:32:14,665 INFO [disttest.charting.writer.ChartWriter] Set chart directory:
/tmp/charts-1407569534665
main 2014-08-09 07:32:14,853 INFO [disttest.charting.writer.ChartWriter] Written /tmp/charts-1407569534665/testTimeSeriesLineChart.png
chart
main 2014-08-09 07:32:14,853 INFO [qpid.test.utils.QpidTestCase] ========== tearDown ChartProductionTest.testTimeSeriesLineChart
==========
main 2014-08-09 07:32:14,854 INFO [qpid.test.utils.QpidTestCase] ========== start ChartProductionTest.testXYLineChartWithColourAndWidth
==========
main 2014-08-09 07:32:14,855 INFO [disttest.charting.writer.ChartWriter] Set chart directory:
/tmp/charts-1407569534855
main 2014-08-09 07:32:15,025 INFO [disttest.charting.writer.ChartWriter] Written /tmp/charts-1407569534855/testXYLineChartWithColourAndWidth.png
chart
main 2014-08-09 07:32:15,026 INFO [qpid.test.utils.QpidTestCase] ========== tearDown ChartProductionTest.testXYLineChartWithColourAndWidth
==========
Tests run: 8, Failures: 0, Errors: 0, Skipped: 0, Time elapsed: 3.713 sec - in org.apache.qpid.disttest.charting.chartbuilder.ChartProductionTest
Running org.apache.qpid.disttest.charting.definition.SeriesDefinitionCreatorTest
main 2014-08-09 07:32:15,029 INFO [qpid.test.utils.QpidTestCase] ========== start SeriesDefinitionCreatorTest.testSeriesDirectoryAndNameSubstitution
==========
main 2014-08-09 07:32:15,029 INFO [qpid.test.utils.QpidTestCase] Set system property "SeriesDefinitionProp"
to: "propValue"
main 2014-08-09 07:32:15,071 INFO [qpid.test.utils.QpidTestCase] ========== tearDown SeriesDefinitionCreatorTest.testSeriesDirectoryAndNameSubstitution
==========
main 2014-08-09 07:32:15,071 DEBUG [qpid.test.utils.QpidTestCase] reverting 1 test properties
main 2014-08-09 07:32:15,071 INFO [qpid.test.utils.QpidTestCase] ========== start SeriesDefinitionCreatorTest.testTwoSeriesDefinitions
==========
main 2014-08-09 07:32:15,073 INFO [qpid.test.utils.QpidTestCase] ========== tearDown SeriesDefinitionCreatorTest.testTwoSeriesDefinitions
==========
main 2014-08-09 07:32:15,073 INFO [qpid.test.utils.QpidTestCase] ========== start SeriesDefinitionCreatorTest.testOneSeriesDefinition
==========
main 2014-08-09 07:32:15,074 INFO [qpid.test.utils.QpidTestCase] ========== tearDown SeriesDefinitionCreatorTest.testOneSeriesDefinition
==========
main 2014-08-09 07:32:15,075 INFO [qpid.test.utils.QpidTestCase] ========== start SeriesDefinitionCreatorTest.testNonSequentialSeriesDefinitionsIgnored
==========
main 2014-08-09 07:32:15,090 INFO [qpid.test.utils.QpidTestCase] ========== tearDown SeriesDefinitionCreatorTest.testNonSequentialSeriesDefinitionsIgnored
==========
Tests run: 4, Failures: 0, Errors: 0, Skipped: 0, Time elapsed: 0.063 sec - in org.apache.qpid.disttest.charting.definition.SeriesDefinitionCreatorTest
Running org.apache.qpid.disttest.charting.definition.ChartingDefinitionCreatorTest
main 2014-08-09 07:32:15,093 INFO [qpid.test.utils.QpidTestCase] ========== start ChartingDefinitionCreatorTest.testLoadTwoDefinitionsFromDirectory
==========
main 2014-08-09 07:32:15,200 INFO [qpid.test.utils.QpidTestCase] ========== tearDown ChartingDefinitionCreatorTest.testLoadTwoDefinitionsFromDirectory
==========
main 2014-08-09 07:32:15,200 INFO [qpid.test.utils.QpidTestCase] ========== start ChartingDefinitionCreatorTest.testLoadOneDefinitionFromFile
==========
main 2014-08-09 07:32:15,201 INFO [qpid.test.utils.QpidTestCase] ========== tearDown ChartingDefinitionCreatorTest.testLoadOneDefinitionFromFile
==========
main 2014-08-09 07:32:15,202 INFO [qpid.test.utils.QpidTestCase] ========== start ChartingDefinitionCreatorTest.testDefinitionsProperties
==========
main 2014-08-09 07:32:15,205 INFO [qpid.test.utils.QpidTestCase] Set system property "ChartingDefinitionSysProp"
to: "propValue"
main 2014-08-09 07:32:15,207 INFO [qpid.test.utils.QpidTestCase] ========== tearDown ChartingDefinitionCreatorTest.testDefinitionsProperties
==========
main 2014-08-09 07:32:15,207 DEBUG [qpid.test.utils.QpidTestCase] reverting 1 test properties
main 2014-08-09 07:32:15,207 INFO [qpid.test.utils.QpidTestCase] ========== start ChartingDefinitionCreatorTest.testDefinitionFileNotFound
==========
main 2014-08-09 07:32:15,207 INFO [qpid.test.utils.QpidTestCase] ========== tearDown ChartingDefinitionCreatorTest.testDefinitionFileNotFound
==========
Tests run: 4, Failures: 0, Errors: 0, Skipped: 0, Time elapsed: 0.122 sec - in org.apache.qpid.disttest.charting.definition.ChartingDefinitionCreatorTest
Running org.apache.qpid.disttest.charting.writer.ChartWriterTest
main 2014-08-09 07:32:15,262 INFO [disttest.charting.writer.ChartWriter] Set chart directory:
/tmp/TestFileUtils-testDir-1407569535262
main 2014-08-09 07:32:15,362 INFO [disttest.charting.writer.ChartWriter] Written /tmp/TestFileUtils-testDir-1407569535262/chart1.png
chart
main 2014-08-09 07:32:15,362 INFO [disttest.charting.writer.ChartWriter] Only 1 chart image(s)
have been written so no HTML summary file will be produced
main 2014-08-09 07:32:15,362 INFO [qpid.test.utils.QpidTestCase] ========== tearDown null
==========
main 2014-08-09 07:32:15,363 INFO [disttest.charting.writer.ChartWriter] Set chart directory:
/tmp/TestFileUtils-testDir-1407569535363
main 2014-08-09 07:32:15,467 INFO [disttest.charting.writer.ChartWriter] Written /tmp/TestFileUtils-testDir-1407569535363/chart1.png
chart
main 2014-08-09 07:32:15,467 INFO [qpid.test.utils.QpidTestCase] ========== tearDown null
==========
main 2014-08-09 07:32:15,469 INFO [disttest.charting.writer.ChartWriter] Set chart directory:
/tmp/TestFileUtils-testDir-1407569535469
main 2014-08-09 07:32:15,557 INFO [disttest.charting.writer.ChartWriter] Written /tmp/TestFileUtils-testDir-1407569535469/chart2.png
chart
main 2014-08-09 07:32:15,667 INFO [disttest.charting.writer.ChartWriter] Written /tmp/TestFileUtils-testDir-1407569535469/chart1.png
chart
main 2014-08-09 07:32:15,668 DEBUG [disttest.charting.writer.ChartWriter] About to produce
HTML summary file /tmp/TestFileUtils-testDir-1407569535469/chart-summary.html from charts
{/tmp/TestFileUtils-testDir-1407569535469/chart1.png=Mock for ChartingDefinition, hashCode:
76432244, /tmp/TestFileUtils-testDir-1407569535469/chart2.png=Mock for ChartingDefinition,
hashCode: 1030228826}
main 2014-08-09 07:32:15,687 INFO [qpid.test.utils.QpidTestCase] ========== tearDown null
==========
Tests run: 3, Failures: 0, Errors: 0, Skipped: 0, Time elapsed: 0.479 sec - in org.apache.qpid.disttest.charting.writer.ChartWriterTest

Results :

Tests run: 39, Failures: 0, Errors: 0, Skipped: 0

[INFO] 
[INFO] --- maven-jar-plugin:2.4:jar (default-jar) @ qpid-perftests-visualisation-jfc ---
[INFO] Building jar: /x1/jenkins/jenkins-slave/workspace/Qpid-Java-Java-Test-JDK1.8/trunk/qpid/java/perftests/visualisation-jfc/target/qpid-perftests-visualisation-jfc-0.32-SNAPSHOT.jar
[INFO] 
[INFO] --- maven-site-plugin:3.3:attach-descriptor (attach-descriptor) @ qpid-perftests-visualisation-jfc
---
[INFO] 
[INFO] --- maven-antrun-plugin:1.7:run (create-qbtc-output-dir) @ qpid-perftests-visualisation-jfc
---
[INFO] Executing tasks

main:
    [mkdir] Created dir: /x1/jenkins/jenkins-slave/workspace/Qpid-Java-Java-Test-JDK1.8/trunk/qpid/java/perftests/visualisation-jfc/target/qbtc-output
[INFO] Executed tasks
[INFO] 
[INFO] --- maven-site-plugin:3.3:site (default-site) @ qpid-perftests-visualisation-jfc ---
[INFO] configuring report plugin org.apache.maven.plugins:maven-project-info-reports-plugin:2.7
[INFO] configuring report plugin org.codehaus.mojo:license-maven-plugin:1.6
[INFO] configuring report plugin org.apache.maven.plugins:maven-surefire-report-plugin:2.16
[INFO] configuring report plugin org.apache.maven.plugins:maven-jxr-plugin:2.3
[INFO] configuring report plugin org.jacoco:jacoco-maven-plugin:0.7.0.201403182114
[INFO] Skipping JaCoCo execution due to missing execution data file:/x1/jenkins/jenkins-slave/workspace/Qpid-Java-Java-Test-JDK1.8/trunk/qpid/java/perftests/visualisation-jfc/target/jacoco-it.exec
[INFO] Skipping JaCoCo execution due to missing execution data file:/x1/jenkins/jenkins-slave/workspace/Qpid-Java-Java-Test-JDK1.8/trunk/qpid/java/perftests/visualisation-jfc/target/jacoco.exec
[INFO] configuring report plugin org.apache.rat:apache-rat-plugin:0.10
[INFO] Parent project loaded from repository: org.apache.qpid:qpid-parent:pom:1.0
[INFO] Parent project loaded from repository: org.apache:apache:pom:14
[INFO] Relativizing decoration links with respect to project URL: http://qpid.apache.org/qpid-java-build/perftests/qpid-perftests-visualisation-jfc
[INFO] Rendering site with org.apache.maven.skins:maven-default-skin:jar:1.0 skin.
[INFO] Generating "About" report    --- maven-project-info-reports-plugin:2.7
[INFO] Generating "Plugin Management" report    --- maven-project-info-reports-plugin:2.7
[INFO] Generating "Distribution Management" report    --- maven-project-info-reports-plugin:2.7
[INFO] Generating "Dependency Information" report    --- maven-project-info-reports-plugin:2.7
[INFO] Generating "Dependency Convergence" report    --- maven-project-info-reports-plugin:2.7
[INFO] Generating "Source Repository" report    --- maven-project-info-reports-plugin:2.7
[INFO] Generating "Mailing Lists" report    --- maven-project-info-reports-plugin:2.7
[INFO] Generating "Issue Tracking" report    --- maven-project-info-reports-plugin:2.7
[INFO] Generating "Continuous Integration" report    --- maven-project-info-reports-plugin:2.7
[INFO] Generating "Project Plugins" report    --- maven-project-info-reports-plugin:2.7
[INFO] Generating "Project License" report    --- maven-project-info-reports-plugin:2.7
[INFO] Generating "Dependency Management" report    --- maven-project-info-reports-plugin:2.7
[INFO] Generating "Project Team" report    --- maven-project-info-reports-plugin:2.7
[INFO] Generating "Project Summary" report    --- maven-project-info-reports-plugin:2.7
[INFO] Generating "Dependencies" report    --- maven-project-info-reports-plugin:2.7
[INFO] Generating "Third Parties" report    --- license-maven-plugin:1.6
[INFO] Generating "Surefire Report" report    --- maven-surefire-report-plugin:2.16
[INFO] Generating "Source Xref" report    --- maven-jxr-plugin:2.3
[INFO] Generating "Test Source Xref" report    --- maven-jxr-plugin:2.3
[INFO] Generating "Rat Report" report    --- apache-rat-plugin:0.10
[INFO] 51 implicit excludes (use -debug for more details).
[INFO] Exclude: build/**
[INFO] Exclude: lib/**
[INFO] Exclude: test-profiles/test_resources/ssl/**
[INFO] 43 resources included (use -debug for more details)
Warning:  org.apache.xerces.jaxp.SAXParserImpl$JAXPSAXParser: Property 'http://www.oracle.com/xml/jaxp/properties/entityExpansionLimit'
is not recognized.
Compiler warnings:
  WARNING:  'org.apache.xerces.jaxp.SAXParserImpl: Property 'http://javax.xml.XMLConstants/property/accessExternalDTD'
is not recognized.'
Warning:  org.apache.xerces.parsers.SAXParser: Feature 'http://javax.xml.XMLConstants/feature/secure-processing'
is not recognized.
Warning:  org.apache.xerces.parsers.SAXParser: Property 'http://javax.xml.XMLConstants/property/accessExternalDTD'
is not recognized.
Warning:  org.apache.xerces.parsers.SAXParser: Property 'http://www.oracle.com/xml/jaxp/properties/entityExpansionLimit'
is not recognized.
[INFO] 
[INFO] --- maven-site-plugin:3.3:stage (default-cli) @ qpid-perftests-visualisation-jfc ---
[INFO] Using this base directory for staging: /x1/jenkins/jenkins-slave/workspace/Qpid-Java-Java-Test-JDK1.8/trunk/qpid/java/target/staging
[INFO] Parent project loaded from repository: org.apache.qpid:qpid-parent:pom:1.0
file:///x1/jenkins/jenkins-slave/workspace/Qpid-Java-Java-Test-JDK1.8/trunk/qpid/java/target/staging/
- Session: Opened  
[INFO] Pushing /x1/jenkins/jenkins-slave/workspace/Qpid-Java-Java-Test-JDK1.8/trunk/qpid/java/perftests/visualisation-jfc/target/site
[INFO]    >>> to file:///x1/jenkins/jenkins-slave/workspace/Qpid-Java-Java-Test-JDK1.8/trunk/qpid/java/target/staging/perftests/visualisation-jfc/perftests/qpid-perftests-visualisation-jfc
file:///x1/jenkins/jenkins-slave/workspace/Qpid-Java-Java-Test-JDK1.8/trunk/qpid/java/target/staging/
- Session: Disconnecting  
file:///x1/jenkins/jenkins-slave/workspace/Qpid-Java-Java-Test-JDK1.8/trunk/qpid/java/target/staging/
- Session: Disconnected
[INFO]                                                                         
[INFO] ------------------------------------------------------------------------
[INFO] Skipping Qpid BDB Store System Tests
[INFO] This project has been banned from the build due to previous failures.
[INFO] ------------------------------------------------------------------------
[INFO] ------------------------------------------------------------------------
[INFO] Reactor Summary:
[INFO] 
[INFO] Qpid Java Build ................................... SUCCESS [50.245s]
[INFO] Qpid AMQP 1.0 Common .............................. SUCCESS [16.947s]
[INFO] Qpid AMQP 1.0 Client .............................. SUCCESS [6.146s]
[INFO] Qpid AMQP 1.0 Client JMS .......................... SUCCESS [8.554s]
[INFO] Qpid AMQP 1.0 JMS Client Examples ................. SUCCESS [5.320s]
[INFO] Qpid AMQP 1.0 Client WebSocket .................... SUCCESS [4.322s]
[INFO] Qpid Broker Code Generation ....................... SUCCESS [3.352s]
[INFO] Qpid Test Utilities ............................... SUCCESS [3.036s]
[INFO] Qpid Common ....................................... SUCCESS [48.757s]
[INFO] Qpid Management Common ............................ SUCCESS [4.280s]
[INFO] Qpid Java Broker Core ............................. SUCCESS [2:10.315s]
[INFO] Qpid Access Control Broker Plug-in ................ SUCCESS [13.024s]
[INFO] Qpid AMQP 0-8 Protocol Broker Plug-in ............. SUCCESS [30.161s]
[INFO] Qpid AMQP 0-10 Protocol Plug-in ................... SUCCESS [12.785s]
[INFO] Qpid AMQP 1-0 Protocol Broker Plug-in ............. SUCCESS [3.079s]
[INFO] Qpid AMQP 0-8 to 0-10 Message Conversion Broker Plug-in  SUCCESS [3.645s]
[INFO] Qpid AMQP 0-8 to 1-0 Message Conversion Broker Plug-in  SUCCESS [3.342s]
[INFO] Qpid AMQP 0-10 to 1-0 Message Conversion Broker Plug-in  SUCCESS [2.701s]
[INFO] Qpid Derby Message Store .......................... SUCCESS [1:46.387s]
[INFO] Qpid JDBC Message Store Connection Pooling Plug-in  SUCCESS [3.072s]
[INFO] Qpid JDBC Message Store Broker Plug-in ............ SUCCESS [17.483s]
[INFO] Qpid HTTP Management Broker Plug-in ............... SUCCESS [19.277s]
[INFO] Qpid JMX Management Broker Plug-in ................ SUCCESS [9.183s]
[INFO] Qpid Memory Message Store Broker Plug-in .......... SUCCESS [3.184s]
[INFO] Qpid AMQP 0-x JMS Client .......................... SUCCESS [13.939s]
[INFO] Qpid BDB Message Store ............................ SUCCESS [58.100s]
[INFO] Qpid BDB Message Store JMX ........................ SUCCESS [6.194s]
[INFO] Qpid Java Broker .................................. SUCCESS [10.880s]
[INFO] Qpid AMQP Management Protocol Broker Plug-in ...... SUCCESS [3.457s]
[INFO] Qpid WebSocket Broker Plug-in ..................... SUCCESS [2.643s]
[INFO] Qpid AMQP 0-x JMS Client Examples ................. SUCCESS [2.710s]
[INFO] Qpid JCA .......................................... SUCCESS [6.922s]
[INFO] Qpid Resource Adaptor ............................. SUCCESS [3.246s]
[INFO] Qpid Tools ........................................ SUCCESS [2.960s]
[INFO] Qpid Management Examples .......................... SUCCESS [2.153s]
[INFO] Qpid Java System Test Parent ...................... SUCCESS [5.284s]
[INFO] Qpid System Tests ................................. FAILURE [41:34.400s]
[INFO] Qpid Performance Tests ............................ SUCCESS [52.055s]
[INFO] Qpid Performance Test System Tests ................ SKIPPED
[INFO] Qpid Performance Tests Visualisation JFC .......... SUCCESS [13.465s]
[INFO] Qpid BDB Store System Tests ....................... SKIPPED
[INFO] ------------------------------------------------------------------------
[INFO] BUILD FAILURE
[INFO] ------------------------------------------------------------------------
[INFO] Total time: 53:11.080s
[INFO] Finished at: Sat Aug 09 07:32:19 UTC 2014
[INFO] Final Memory: 113M/1266M
[INFO] ------------------------------------------------------------------------
[ERROR] Failed to execute goal org.apache.maven.plugins:maven-surefire-plugin:2.16:test (integration-test)
on project qpid-systests: There are test failures.
[ERROR] 
[ERROR] Please refer to /x1/jenkins/jenkins-slave/workspace/Qpid-Java-Java-Test-JDK1.8/trunk/qpid/java/systests/target/surefire-reports
for the individual test results.
[ERROR] -> [Help 1]
[ERROR] 
[ERROR] To see the full stack trace of the errors, re-run Maven with the -e switch.
[ERROR] Re-run Maven using the -X switch to enable full debug logging.
[ERROR] 
[ERROR] For more information about the errors and possible solutions, please read the following
articles:
[ERROR] [Help 1] http://cwiki.apache.org/confluence/display/MAVEN/MojoFailureException
[ERROR] 
[ERROR] After correcting the problems, you can resume the build with the command
[ERROR]   mvn <goals> -rf :qpid-systests
Build step 'Invoke top-level Maven targets' marked build as failure
[locks-and-latches] Releasing all the locks
[locks-and-latches] All the locks released
Recording test results

Mime
View raw message