qpid-notifications mailing list archives

Site index · List index
Message view « Date » · « Thread »
Top « Date » · « Thread »
From Apache Jenkins Server <jenk...@builds.apache.org>
Subject Build failed in Jenkins: Qpid-Java-Cpp-Test #2110
Date Thu, 28 Aug 2014 07:54:51 GMT
See <https://builds.apache.org/job/Qpid-Java-Cpp-Test/2110/changes>

Changes:

[rgodfrey] QPID-6050 : [JMS AMQP 1.0 client] Setting system property qpid.sync_publish does
not have the intended effect

[rgodfrey] QPID-6050 : [JMS AMQP 1.0 client] Setting system property qpid.sync_publish does
not have the intended effect

------------------------------------------
[...truncated 632 lines...]
copying qpid/session.py -> /x1/jenkins/jenkins-slave/workspace/Qpid-Java-Cpp-Test/cpp-build/src/tests/python/build/lib.linux-x86_64-2.7/qpid
copying qpid/datatypes.py -> /x1/jenkins/jenkins-slave/workspace/Qpid-Java-Cpp-Test/cpp-build/src/tests/python/build/lib.linux-x86_64-2.7/qpid
copying qpid/util.py -> /x1/jenkins/jenkins-slave/workspace/Qpid-Java-Cpp-Test/cpp-build/src/tests/python/build/lib.linux-x86_64-2.7/qpid
copying qpid/log.py -> /x1/jenkins/jenkins-slave/workspace/Qpid-Java-Cpp-Test/cpp-build/src/tests/python/build/lib.linux-x86_64-2.7/qpid
copying qpid/managementdata.py -> /x1/jenkins/jenkins-slave/workspace/Qpid-Java-Cpp-Test/cpp-build/src/tests/python/build/lib.linux-x86_64-2.7/qpid
copying qpid/disp.py -> /x1/jenkins/jenkins-slave/workspace/Qpid-Java-Cpp-Test/cpp-build/src/tests/python/build/lib.linux-x86_64-2.7/qpid
[  0%] Built target dlclose_noop
copying qpid/debug.py -> /x1/jenkins/jenkins-slave/workspace/Qpid-Java-Cpp-Test/cpp-build/src/tests/python/build/lib.linux-x86_64-2.7/qpid
copying qpid/message.py -> /x1/jenkins/jenkins-slave/workspace/Qpid-Java-Cpp-Test/cpp-build/src/tests/python/build/lib.linux-x86_64-2.7/qpid
copying qpid/spec08.py -> /x1/jenkins/jenkins-slave/workspace/Qpid-Java-Cpp-Test/cpp-build/src/tests/python/build/lib.linux-x86_64-2.7/qpid
[  0%] copying qpid/delegates.py -> /x1/jenkins/jenkins-slave/workspace/Qpid-Java-Cpp-Test/cpp-build/src/tests/python/build/lib.linux-x86_64-2.7/qpid
Building CXX object src/CMakeFiles/qpidtypes.dir/qpid/types/Uuid.cpp.o
copying qpid/harness.py -> /x1/jenkins/jenkins-slave/workspace/Qpid-Java-Cpp-Test/cpp-build/src/tests/python/build/lib.linux-x86_64-2.7/qpid
copying qpid/management.py -> /x1/jenkins/jenkins-slave/workspace/Qpid-Java-Cpp-Test/cpp-build/src/tests/python/build/lib.linux-x86_64-2.7/qpid
copying qpid/specs_config.py -> /x1/jenkins/jenkins-slave/workspace/Qpid-Java-Cpp-Test/cpp-build/src/tests/python/build/lib.linux-x86_64-2.7/qpid
copying qpid/parser.py -> /x1/jenkins/jenkins-slave/workspace/Qpid-Java-Cpp-Test/cpp-build/src/tests/python/build/lib.linux-x86_64-2.7/qpid
copying qpid/peer.py -> /x1/jenkins/jenkins-slave/workspace/Qpid-Java-Cpp-Test/cpp-build/src/tests/python/build/lib.linux-x86_64-2.7/qpid
copying qpid/codec010.py -> /x1/jenkins/jenkins-slave/workspace/Qpid-Java-Cpp-Test/cpp-build/src/tests/python/build/lib.linux-x86_64-2.7/qpid
copying qpid/testlib.py -> /x1/jenkins/jenkins-slave/workspace/Qpid-Java-Cpp-Test/cpp-build/src/tests/python/build/lib.linux-x86_64-2.7/qpid
copying qpid/exceptions.py -> /x1/jenkins/jenkins-slave/workspace/Qpid-Java-Cpp-Test/cpp-build/src/tests/python/build/lib.linux-x86_64-2.7/qpid
copying qpid/framer.py -> /x1/jenkins/jenkins-slave/workspace/Qpid-Java-Cpp-Test/cpp-build/src/tests/python/build/lib.linux-x86_64-2.7/qpid
copying qpid/__init__.py -> /x1/jenkins/jenkins-slave/workspace/Qpid-Java-Cpp-Test/cpp-build/src/tests/python/build/lib.linux-x86_64-2.7/qpid
copying qpid/sasl.py -> /x1/jenkins/jenkins-slave/workspace/Qpid-Java-Cpp-Test/cpp-build/src/tests/python/build/lib.linux-x86_64-2.7/qpid
copying qpid/client.py -> /x1/jenkins/jenkins-slave/workspace/Qpid-Java-Cpp-Test/cpp-build/src/tests/python/build/lib.linux-x86_64-2.7/qpid
copying qpid/packer.py -> /x1/jenkins/jenkins-slave/workspace/Qpid-Java-Cpp-Test/cpp-build/src/tests/python/build/lib.linux-x86_64-2.7/qpid
copying qpid/framing.py -> /x1/jenkins/jenkins-slave/workspace/Qpid-Java-Cpp-Test/cpp-build/src/tests/python/build/lib.linux-x86_64-2.7/qpid
creating /x1/jenkins/jenkins-slave/workspace/Qpid-Java-Cpp-Test/cpp-build/src/tests/python/build/lib.linux-x86_64-2.7/qpid/messaging
copying qpid/messaging/driver.py -> /x1/jenkins/jenkins-slave/workspace/Qpid-Java-Cpp-Test/cpp-build/src/tests/python/build/lib.linux-x86_64-2.7/qpid/messaging
copying qpid/messaging/constants.py -> /x1/jenkins/jenkins-slave/workspace/Qpid-Java-Cpp-Test/cpp-build/src/tests/python/build/lib.linux-x86_64-2.7/qpid/messaging
copying qpid/messaging/util.py -> /x1/jenkins/jenkins-slave/workspace/Qpid-Java-Cpp-Test/cpp-build/src/tests/python/build/lib.linux-x86_64-2.7/qpid/messaging
copying qpid/messaging/endpoints.py -> /x1/jenkins/jenkins-slave/workspace/Qpid-Java-Cpp-Test/cpp-build/src/tests/python/build/lib.linux-x86_64-2.7/qpid/messaging
copying qpid/messaging/message.py -> /x1/jenkins/jenkins-slave/workspace/Qpid-Java-Cpp-Test/cpp-build/src/tests/python/build/lib.linux-x86_64-2.7/qpid/messaging
copying qpid/messaging/address.py -> /x1/jenkins/jenkins-slave/workspace/Qpid-Java-Cpp-Test/cpp-build/src/tests/python/build/lib.linux-x86_64-2.7/qpid/messaging
copying qpid/messaging/exceptions.py -> /x1/jenkins/jenkins-slave/workspace/Qpid-Java-Cpp-Test/cpp-build/src/tests/python/build/lib.linux-x86_64-2.7/qpid/messaging
copying qpid/messaging/transports.py -> /x1/jenkins/jenkins-slave/workspace/Qpid-Java-Cpp-Test/cpp-build/src/tests/python/build/lib.linux-x86_64-2.7/qpid/messaging
copying qpid/messaging/__init__.py -> /x1/jenkins/jenkins-slave/workspace/Qpid-Java-Cpp-Test/cpp-build/src/tests/python/build/lib.linux-x86_64-2.7/qpid/messaging
creating /x1/jenkins/jenkins-slave/workspace/Qpid-Java-Cpp-Test/cpp-build/src/tests/python/build/lib.linux-x86_64-2.7/qpid/tests
copying qpid/tests/connection.py -> /x1/jenkins/jenkins-slave/workspace/Qpid-Java-Cpp-Test/cpp-build/src/tests/python/build/lib.linux-x86_64-2.7/qpid/tests
copying qpid/tests/mimetype.py -> /x1/jenkins/jenkins-slave/workspace/Qpid-Java-Cpp-Test/cpp-build/src/tests/python/build/lib.linux-x86_64-2.7/qpid/tests
copying qpid/tests/queue.py -> /x1/jenkins/jenkins-slave/workspace/Qpid-Java-Cpp-Test/cpp-build/src/tests/python/build/lib.linux-x86_64-2.7/qpid/tests
copying qpid/tests/spec010.py -> /x1/jenkins/jenkins-slave/workspace/Qpid-Java-Cpp-Test/cpp-build/src/tests/python/build/lib.linux-x86_64-2.7/qpid/tests
copying qpid/tests/codec.py -> /x1/jenkins/jenkins-slave/workspace/Qpid-Java-Cpp-Test/cpp-build/src/tests/python/build/lib.linux-x86_64-2.7/qpid/tests
copying qpid/tests/datatypes.py -> /x1/jenkins/jenkins-slave/workspace/Qpid-Java-Cpp-Test/cpp-build/src/tests/python/build/lib.linux-x86_64-2.7/qpid/tests
copying qpid/tests/util.py -> /x1/jenkins/jenkins-slave/workspace/Qpid-Java-Cpp-Test/cpp-build/src/tests/python/build/lib.linux-x86_64-2.7/qpid/tests
copying qpid/tests/parser.py -> /x1/jenkins/jenkins-slave/workspace/Qpid-Java-Cpp-Test/cpp-build/src/tests/python/build/lib.linux-x86_64-2.7/qpid/tests
copying qpid/tests/codec010.py -> /x1/jenkins/jenkins-slave/workspace/Qpid-Java-Cpp-Test/cpp-build/src/tests/python/build/lib.linux-x86_64-2.7/qpid/tests
copying qpid/tests/__init__.py -> /x1/jenkins/jenkins-slave/workspace/Qpid-Java-Cpp-Test/cpp-build/src/tests/python/build/lib.linux-x86_64-2.7/qpid/tests
copying qpid/tests/framing.py -> /x1/jenkins/jenkins-slave/workspace/Qpid-Java-Cpp-Test/cpp-build/src/tests/python/build/lib.linux-x86_64-2.7/qpid/tests
creating /x1/jenkins/jenkins-slave/workspace/Qpid-Java-Cpp-Test/cpp-build/src/tests/python/build/lib.linux-x86_64-2.7/qpid/tests/messaging
copying qpid/tests/messaging/endpoints.py -> /x1/jenkins/jenkins-slave/workspace/Qpid-Java-Cpp-Test/cpp-build/src/tests/python/build/lib.linux-x86_64-2.7/qpid/tests/messaging
copying qpid/tests/messaging/message.py -> /x1/jenkins/jenkins-slave/workspace/Qpid-Java-Cpp-Test/cpp-build/src/tests/python/build/lib.linux-x86_64-2.7/qpid/tests/messaging
copying qpid/tests/messaging/address.py -> /x1/jenkins/jenkins-slave/workspace/Qpid-Java-Cpp-Test/cpp-build/src/tests/python/build/lib.linux-x86_64-2.7/qpid/tests/messaging
copying qpid/tests/messaging/implementation.py -> /x1/jenkins/jenkins-slave/workspace/Qpid-Java-Cpp-Test/cpp-build/src/tests/python/build/lib.linux-x86_64-2.7/qpid/tests/messaging
copying qpid/tests/messaging/__init__.py -> /x1/jenkins/jenkins-slave/workspace/Qpid-Java-Cpp-Test/cpp-build/src/tests/python/build/lib.linux-x86_64-2.7/qpid/tests/messaging
creating /x1/jenkins/jenkins-slave/workspace/Qpid-Java-Cpp-Test/cpp-build/src/tests/python/build/lib.linux-x86_64-2.7/qpid/specs
copying qpid/specs/amqp-0-10.dtd -> /x1/jenkins/jenkins-slave/workspace/Qpid-Java-Cpp-Test/cpp-build/src/tests/python/build/lib.linux-x86_64-2.7/qpid/specs
copying qpid/specs/amqp-0-9-qpid-stripped.xml -> /x1/jenkins/jenkins-slave/workspace/Qpid-Java-Cpp-Test/cpp-build/src/tests/python/build/lib.linux-x86_64-2.7/qpid/specs
copying qpid/specs/amqp-0-9-1-stripped.xml -> /x1/jenkins/jenkins-slave/workspace/Qpid-Java-Cpp-Test/cpp-build/src/tests/python/build/lib.linux-x86_64-2.7/qpid/specs
copying qpid/specs/amqp-0-8-qpid-stripped.xml -> /x1/jenkins/jenkins-slave/workspace/Qpid-Java-Cpp-Test/cpp-build/src/tests/python/build/lib.linux-x86_64-2.7/qpid/specs
copying qpid/specs/amqp-0-10-stripped.xml -> /x1/jenkins/jenkins-slave/workspace/Qpid-Java-Cpp-Test/cpp-build/src/tests/python/build/lib.linux-x86_64-2.7/qpid/specs
copying qpid/specs/amqp-0-10-qpid-errata-stripped.xml -> /x1/jenkins/jenkins-slave/workspace/Qpid-Java-Cpp-Test/cpp-build/src/tests/python/build/lib.linux-x86_64-2.7/qpid/specs
running build_scripts
creating /x1/jenkins/jenkins-slave/workspace/Qpid-Java-Cpp-Test/cpp-build/src/tests/python/build/scripts-2.7
copying and adjusting qpid-python-test -> /x1/jenkins/jenkins-slave/workspace/Qpid-Java-Cpp-Test/cpp-build/src/tests/python/build/scripts-2.7
changing mode of /x1/jenkins/jenkins-slave/workspace/Qpid-Java-Cpp-Test/cpp-build/src/tests/python/build/scripts-2.7/qpid-python-test
from 644 to 755
running build_doc
No module named epydoc.docbuilder -- skipping build_doc
running install
<https://builds.apache.org/job/Qpid-Java-Cpp-Test/ws/trunk/qpid/cpp/src/qpid/types/Exception.cpp>:30:2:
fatal error: error writing to /tmp/ccoTrtoo.s: No space left on device
compilation terminated.
running install_lib
creating /x1/jenkins/jenkins-slave/workspace/Qpid-Java-Cpp-Test/cpp-build/src/tests/python/mllib
copying /x1/jenkins/jenkins-slave/workspace/Qpid-Java-Cpp-Test/cpp-build/src/tests/python/build/lib.linux-x86_64-2.7/mllib/transforms.py
-> /x1/jenkins/jenkins-slave/workspace/Qpid-Java-Cpp-Test/cpp-build/src/tests/python/mllib
copying /x1/jenkins/jenkins-slave/workspace/Qpid-Java-Cpp-Test/cpp-build/src/tests/python/build/lib.linux-x86_64-2.7/mllib/parsers.py
-> /x1/jenkins/jenkins-slave/workspace/Qpid-Java-Cpp-Test/cpp-build/src/tests/python/mllib
copying /x1/jenkins/jenkins-slave/workspace/Qpid-Java-Cpp-Test/cpp-build/src/tests/python/build/lib.linux-x86_64-2.7/mllib/dom.py
-> /x1/jenkins/jenkins-slave/workspace/Qpid-Java-Cpp-Test/cpp-build/src/tests/python/mllib
copying /x1/jenkins/jenkins-slave/workspace/Qpid-Java-Cpp-Test/cpp-build/src/tests/python/build/lib.linux-x86_64-2.7/mllib/__init__.py
-> /x1/jenkins/jenkins-slave/workspace/Qpid-Java-Cpp-Test/cpp-build/src/tests/python/mllib
creating /x1/jenkins/jenkins-slave/workspace/Qpid-Java-Cpp-Test/cpp-build/src/tests/python/qpid
copying /x1/jenkins/jenkins-slave/workspace/Qpid-Java-Cpp-Test/cpp-build/src/tests/python/build/lib.linux-x86_64-2.7/qpid/connection.py
-> /x1/jenkins/jenkins-slave/workspace/Qpid-Java-Cpp-Test/cpp-build/src/tests/python/qpid
copying /x1/jenkins/jenkins-slave/workspace/Qpid-Java-Cpp-Test/cpp-build/src/tests/python/build/lib.linux-x86_64-2.7/qpid/generator.py
-> /x1/jenkins/jenkins-slave/workspace/Qpid-Java-Cpp-Test/cpp-build/src/tests/python/qpid
copying /x1/jenkins/jenkins-slave/workspace/Qpid-Java-Cpp-Test/cpp-build/src/tests/python/build/lib.linux-x86_64-2.7/qpid/mimetype.py
-> /x1/jenkins/jenkins-slave/workspace/Qpid-Java-Cpp-Test/cpp-build/src/tests/python/qpid
copying /x1/jenkins/jenkins-slave/workspace/Qpid-Java-Cpp-Test/cpp-build/src/tests/python/build/lib.linux-x86_64-2.7/qpid/content.py
-> /x1/jenkins/jenkins-slave/workspace/Qpid-Java-Cpp-Test/cpp-build/src/tests/python/qpid
copying /x1/jenkins/jenkins-slave/workspace/Qpid-Java-Cpp-Test/cpp-build/src/tests/python/build/lib.linux-x86_64-2.7/qpid/selector.py
-> /x1/jenkins/jenkins-slave/workspace/Qpid-Java-Cpp-Test/cpp-build/src/tests/python/qpid
creating /x1/jenkins/jenkins-slave/workspace/Qpid-Java-Cpp-Test/cpp-build/src/tests/python/qpid/specs
copying /x1/jenkins/jenkins-slave/workspace/Qpid-Java-Cpp-Test/cpp-build/src/tests/python/build/lib.linux-x86_64-2.7/qpid/specs/amqp-0-9-qpid-stripped.xml
-> /x1/jenkins/jenkins-slave/workspace/Qpid-Java-Cpp-Test/cpp-build/src/tests/python/qpid/specs
copying /x1/jenkins/jenkins-slave/workspace/Qpid-Java-Cpp-Test/cpp-build/src/tests/python/build/lib.linux-x86_64-2.7/qpid/specs/amqp-0-9-1-stripped.xml
-> /x1/jenkins/jenkins-slave/workspace/Qpid-Java-Cpp-Test/cpp-build/src/tests/python/qpid/specs
copying /x1/jenkins/jenkins-slave/workspace/Qpid-Java-Cpp-Test/cpp-build/src/tests/python/build/lib.linux-x86_64-2.7/qpid/specs/amqp-0-8-qpid-stripped.xml
-> /x1/jenkins/jenkins-slave/workspace/Qpid-Java-Cpp-Test/cpp-build/src/tests/python/qpid/specs
copying /x1/jenkins/jenkins-slave/workspace/Qpid-Java-Cpp-Test/cpp-build/src/tests/python/build/lib.linux-x86_64-2.7/qpid/specs/amqp-0-10-stripped.xml
-> /x1/jenkins/jenkins-slave/workspace/Qpid-Java-Cpp-Test/cpp-build/src/tests/python/qpid/specs
copying /x1/jenkins/jenkins-slave/workspace/Qpid-Java-Cpp-Test/cpp-build/src/tests/python/build/lib.linux-x86_64-2.7/qpid/specs/amqp-0-10.dtd
-> /x1/jenkins/jenkins-slave/workspace/Qpid-Java-Cpp-Test/cpp-build/src/tests/python/qpid/specs
copying /x1/jenkins/jenkins-slave/workspace/Qpid-Java-Cpp-Test/cpp-build/src/tests/python/build/lib.linux-x86_64-2.7/qpid/specs/amqp-0-10-qpid-errata-stripped.xml
-> /x1/jenkins/jenkins-slave/workspace/Qpid-Java-Cpp-Test/cpp-build/src/tests/python/qpid/specs
copying /x1/jenkins/jenkins-slave/workspace/Qpid-Java-Cpp-Test/cpp-build/src/tests/python/build/lib.linux-x86_64-2.7/qpid/concurrency.py
-> /x1/jenkins/jenkins-slave/workspace/Qpid-Java-Cpp-Test/cpp-build/src/tests/python/qpid
copying /x1/jenkins/jenkins-slave/workspace/Qpid-Java-Cpp-Test/cpp-build/src/tests/python/build/lib.linux-x86_64-2.7/qpid/validator.py
-> /x1/jenkins/jenkins-slave/workspace/Qpid-Java-Cpp-Test/cpp-build/src/tests/python/qpid
copying /x1/jenkins/jenkins-slave/workspace/Qpid-Java-Cpp-Test/cpp-build/src/tests/python/build/lib.linux-x86_64-2.7/qpid/queue.py
-> /x1/jenkins/jenkins-slave/workspace/Qpid-Java-Cpp-Test/cpp-build/src/tests/python/qpid
copying /x1/jenkins/jenkins-slave/workspace/Qpid-Java-Cpp-Test/cpp-build/src/tests/python/build/lib.linux-x86_64-2.7/qpid/reference.py
-> /x1/jenkins/jenkins-slave/workspace/Qpid-Java-Cpp-Test/cpp-build/src/tests/python/qpid
copying /x1/jenkins/jenkins-slave/workspace/Qpid-Java-Cpp-Test/cpp-build/src/tests/python/build/lib.linux-x86_64-2.7/qpid/delegate.py
-> /x1/jenkins/jenkins-slave/workspace/Qpid-Java-Cpp-Test/cpp-build/src/tests/python/qpid
copying /x1/jenkins/jenkins-slave/workspace/Qpid-Java-Cpp-Test/cpp-build/src/tests/python/build/lib.linux-x86_64-2.7/qpid/ops.py
-> /x1/jenkins/jenkins-slave/workspace/Qpid-Java-Cpp-Test/cpp-build/src/tests/python/qpid
creating /x1/jenkins/jenkins-slave/workspace/Qpid-Java-Cpp-Test/cpp-build/src/tests/python/qpid/tests
copying /x1/jenkins/jenkins-slave/workspace/Qpid-Java-Cpp-Test/cpp-build/src/tests/python/build/lib.linux-x86_64-2.7/qpid/tests/connection.py
-> /x1/jenkins/jenkins-slave/workspace/Qpid-Java-Cpp-Test/cpp-build/src/tests/python/qpid/tests
copying /x1/jenkins/jenkins-slave/workspace/Qpid-Java-Cpp-Test/cpp-build/src/tests/python/build/lib.linux-x86_64-2.7/qpid/tests/mimetype.py
-> /x1/jenkins/jenkins-slave/workspace/Qpid-Java-Cpp-Test/cpp-build/src/tests/python/qpid/tests
copying /x1/jenkins/jenkins-slave/workspace/Qpid-Java-Cpp-Test/cpp-build/src/tests/python/build/lib.linux-x86_64-2.7/qpid/tests/queue.py
-> /x1/jenkins/jenkins-slave/workspace/Qpid-Java-Cpp-Test/cpp-build/src/tests/python/qpid/tests
copying /x1/jenkins/jenkins-slave/workspace/Qpid-Java-Cpp-Test/cpp-build/src/tests/python/build/lib.linux-x86_64-2.7/qpid/tests/spec010.py
-> /x1/jenkins/jenkins-slave/workspace/Qpid-Java-Cpp-Test/cpp-build/src/tests/python/qpid/tests
copying /x1/jenkins/jenkins-slave/workspace/Qpid-Java-Cpp-Test/cpp-build/src/tests/python/build/lib.linux-x86_64-2.7/qpid/tests/codec.py
-> /x1/jenkins/jenkins-slave/workspace/Qpid-Java-Cpp-Test/cpp-build/src/tests/python/qpid/tests
copying /x1/jenkins/jenkins-slave/workspace/Qpid-Java-Cpp-Test/cpp-build/src/tests/python/build/lib.linux-x86_64-2.7/qpid/tests/datatypes.py
-> /x1/jenkins/jenkins-slave/workspace/Qpid-Java-Cpp-Test/cpp-build/src/tests/python/qpid/tests
copying /x1/jenkins/jenkins-slave/workspace/Qpid-Java-Cpp-Test/cpp-build/src/tests/python/build/lib.linux-x86_64-2.7/qpid/tests/util.py
-> /x1/jenkins/jenkins-slave/workspace/Qpid-Java-Cpp-Test/cpp-build/src/tests/python/qpid/tests
copying /x1/jenkins/jenkins-slave/workspace/Qpid-Java-Cpp-Test/cpp-build/src/tests/python/build/lib.linux-x86_64-2.7/qpid/tests/parser.py
-> /x1/jenkins/jenkins-slave/workspace/Qpid-Java-Cpp-Test/cpp-build/src/tests/python/qpid/tests
copying /x1/jenkins/jenkins-slave/workspace/Qpid-Java-Cpp-Test/cpp-build/src/tests/python/build/lib.linux-x86_64-2.7/qpid/tests/codec010.py
-> /x1/jenkins/jenkins-slave/workspace/Qpid-Java-Cpp-Test/cpp-build/src/tests/python/qpid/tests
creating /x1/jenkins/jenkins-slave/workspace/Qpid-Java-Cpp-Test/cpp-build/src/tests/python/qpid/tests/messaging
copying /x1/jenkins/jenkins-slave/workspace/Qpid-Java-Cpp-Test/cpp-build/src/tests/python/build/lib.linux-x86_64-2.7/qpid/tests/messaging/endpoints.py
-> /x1/jenkins/jenkins-slave/workspace/Qpid-Java-Cpp-Test/cpp-build/src/tests/python/qpid/tests/messaging
copying /x1/jenkins/jenkins-slave/workspace/Qpid-Java-Cpp-Test/cpp-build/src/tests/python/build/lib.linux-x86_64-2.7/qpid/tests/messaging/message.py
-> /x1/jenkins/jenkins-slave/workspace/Qpid-Java-Cpp-Test/cpp-build/src/tests/python/qpid/tests/messaging
copying /x1/jenkins/jenkins-slave/workspace/Qpid-Java-Cpp-Test/cpp-build/src/tests/python/build/lib.linux-x86_64-2.7/qpid/tests/messaging/address.py
-> /x1/jenkins/jenkins-slave/workspace/Qpid-Java-Cpp-Test/cpp-build/src/tests/python/qpid/tests/messaging
copying /x1/jenkins/jenkins-slave/workspace/Qpid-Java-Cpp-Test/cpp-build/src/tests/python/build/lib.linux-x86_64-2.7/qpid/tests/messaging/implementation.py
-> /x1/jenkins/jenkins-slave/workspace/Qpid-Java-Cpp-Test/cpp-build/src/tests/python/qpid/tests/messaging
copying /x1/jenkins/jenkins-slave/workspace/Qpid-Java-Cpp-Test/cpp-build/src/tests/python/build/lib.linux-x86_64-2.7/qpid/tests/messaging/__init__.py
-> /x1/jenkins/jenkins-slave/workspace/Qpid-Java-Cpp-Test/cpp-build/src/tests/python/qpid/tests/messaging
copying /x1/jenkins/jenkins-slave/workspace/Qpid-Java-Cpp-Test/cpp-build/src/tests/python/build/lib.linux-x86_64-2.7/qpid/tests/__init__.py
-> /x1/jenkins/jenkins-slave/workspace/Qpid-Java-Cpp-Test/cpp-build/src/tests/python/qpid/tests
copying /x1/jenkins/jenkins-slave/workspace/Qpid-Java-Cpp-Test/cpp-build/src/tests/python/build/lib.linux-x86_64-2.7/qpid/tests/framing.py
-> /x1/jenkins/jenkins-slave/workspace/Qpid-Java-Cpp-Test/cpp-build/src/tests/python/qpid/tests
copying /x1/jenkins/jenkins-slave/workspace/Qpid-Java-Cpp-Test/cpp-build/src/tests/python/build/lib.linux-x86_64-2.7/qpid/compat.py
-> /x1/jenkins/jenkins-slave/workspace/Qpid-Java-Cpp-Test/cpp-build/src/tests/python/qpid
copying /x1/jenkins/jenkins-slave/workspace/Qpid-Java-Cpp-Test/cpp-build/src/tests/python/build/lib.linux-x86_64-2.7/qpid/codec.py
-> /x1/jenkins/jenkins-slave/workspace/Qpid-Java-Cpp-Test/cpp-build/src/tests/python/qpid
<https://builds.apache.org/job/Qpid-Java-Cpp-Test/ws/trunk/qpid/cpp/src/tests/sasl_version.cpp>:44:1:
fatal error: error writing to /tmp/ccEQWJnK.s: No space left on device
compilation terminated.
copying /x1/jenkins/jenkins-slave/workspace/Qpid-Java-Cpp-Test/cpp-build/src/tests/python/build/lib.linux-x86_64-2.7/qpid/lexer.py
-> /x1/jenkins/jenkins-slave/workspace/Qpid-Java-Cpp-Test/cpp-build/src/tests/python/qpid
copying /x1/jenkins/jenkins-slave/workspace/Qpid-Java-Cpp-Test/cpp-build/src/tests/python/build/lib.linux-x86_64-2.7/qpid/connection08.py
-> /x1/jenkins/jenkins-slave/workspace/Qpid-Java-Cpp-Test/cpp-build/src/tests/python/qpid
copying /x1/jenkins/jenkins-slave/workspace/Qpid-Java-Cpp-Test/cpp-build/src/tests/python/build/lib.linux-x86_64-2.7/qpid/session.py
-> /x1/jenkins/jenkins-slave/workspace/Qpid-Java-Cpp-Test/cpp-build/src/tests/python/qpid
copying /x1/jenkins/jenkins-slave/workspace/Qpid-Java-Cpp-Test/cpp-build/src/tests/python/build/lib.linux-x86_64-2.7/qpid/datatypes.py
-> /x1/jenkins/jenkins-slave/workspace/Qpid-Java-Cpp-Test/cpp-build/src/tests/python/qpid
copying /x1/jenkins/jenkins-slave/workspace/Qpid-Java-Cpp-Test/cpp-build/src/tests/python/build/lib.linux-x86_64-2.7/qpid/util.py
-> /x1/jenkins/jenkins-slave/workspace/Qpid-Java-Cpp-Test/cpp-build/src/tests/python/qpid
copying /x1/jenkins/jenkins-slave/workspace/Qpid-Java-Cpp-Test/cpp-build/src/tests/python/build/lib.linux-x86_64-2.7/qpid/log.py
-> /x1/jenkins/jenkins-slave/workspace/Qpid-Java-Cpp-Test/cpp-build/src/tests/python/qpid
copying /x1/jenkins/jenkins-slave/workspace/Qpid-Java-Cpp-Test/cpp-build/src/tests/python/build/lib.linux-x86_64-2.7/qpid/managementdata.py
-> /x1/jenkins/jenkins-slave/workspace/Qpid-Java-Cpp-Test/cpp-build/src/tests/python/qpid
copying /x1/jenkins/jenkins-slave/workspace/Qpid-Java-Cpp-Test/cpp-build/src/tests/python/build/lib.linux-x86_64-2.7/qpid/disp.py
-> /x1/jenkins/jenkins-slave/workspace/Qpid-Java-Cpp-Test/cpp-build/src/tests/python/qpid
copying /x1/jenkins/jenkins-slave/workspace/Qpid-Java-Cpp-Test/cpp-build/src/tests/python/build/lib.linux-x86_64-2.7/qpid/debug.py
-> /x1/jenkins/jenkins-slave/workspace/Qpid-Java-Cpp-Test/cpp-build/src/tests/python/qpid
copying /x1/jenkins/jenkins-slave/workspace/Qpid-Java-Cpp-Test/cpp-build/src/tests/python/build/lib.linux-x86_64-2.7/qpid/message.py
-> /x1/jenkins/jenkins-slave/workspace/Qpid-Java-Cpp-Test/cpp-build/src/tests/python/qpid
copying /x1/jenkins/jenkins-slave/workspace/Qpid-Java-Cpp-Test/cpp-build/src/tests/python/build/lib.linux-x86_64-2.7/qpid/spec08.py
-> /x1/jenkins/jenkins-slave/workspace/Qpid-Java-Cpp-Test/cpp-build/src/tests/python/qpid
copying /x1/jenkins/jenkins-slave/workspace/Qpid-Java-Cpp-Test/cpp-build/src/tests/python/build/lib.linux-x86_64-2.7/qpid/delegates.py
-> /x1/jenkins/jenkins-slave/workspace/Qpid-Java-Cpp-Test/cpp-build/src/tests/python/qpid
copying /x1/jenkins/jenkins-slave/workspace/Qpid-Java-Cpp-Test/cpp-build/src/tests/python/build/lib.linux-x86_64-2.7/qpid/harness.py
-> /x1/jenkins/jenkins-slave/workspace/Qpid-Java-Cpp-Test/cpp-build/src/tests/python/qpid
copying /x1/jenkins/jenkins-slave/workspace/Qpid-Java-Cpp-Test/cpp-build/src/tests/python/build/lib.linux-x86_64-2.7/qpid/management.py
-> /x1/jenkins/jenkins-slave/workspace/Qpid-Java-Cpp-Test/cpp-build/src/tests/python/qpid
copying /x1/jenkins/jenkins-slave/workspace/Qpid-Java-Cpp-Test/cpp-build/src/tests/python/build/lib.linux-x86_64-2.7/qpid/specs_config.py
-> /x1/jenkins/jenkins-slave/workspace/Qpid-Java-Cpp-Test/cpp-build/src/tests/python/qpid
copying /x1/jenkins/jenkins-slave/workspace/Qpid-Java-Cpp-Test/cpp-build/src/tests/python/build/lib.linux-x86_64-2.7/qpid/parser.py
-> /x1/jenkins/jenkins-slave/workspace/Qpid-Java-Cpp-Test/cpp-build/src/tests/python/qpid
copying /x1/jenkins/jenkins-slave/workspace/Qpid-Java-Cpp-Test/cpp-build/src/tests/python/build/lib.linux-x86_64-2.7/qpid/peer.py
-> /x1/jenkins/jenkins-slave/workspace/Qpid-Java-Cpp-Test/cpp-build/src/tests/python/qpid
copying /x1/jenkins/jenkins-slave/workspace/Qpid-Java-Cpp-Test/cpp-build/src/tests/python/build/lib.linux-x86_64-2.7/qpid/codec010.py
-> /x1/jenkins/jenkins-slave/workspace/Qpid-Java-Cpp-Test/cpp-build/src/tests/python/qpid
copying /x1/jenkins/jenkins-slave/workspace/Qpid-Java-Cpp-Test/cpp-build/src/tests/python/build/lib.linux-x86_64-2.7/qpid/testlib.py
-> /x1/jenkins/jenkins-slave/workspace/Qpid-Java-Cpp-Test/cpp-build/src/tests/python/qpid
creating /x1/jenkins/jenkins-slave/workspace/Qpid-Java-Cpp-Test/cpp-build/src/tests/python/qpid/messaging
copying /x1/jenkins/jenkins-slave/workspace/Qpid-Java-Cpp-Test/cpp-build/src/tests/python/build/lib.linux-x86_64-2.7/qpid/messaging/driver.py
-> /x1/jenkins/jenkins-slave/workspace/Qpid-Java-Cpp-Test/cpp-build/src/tests/python/qpid/messaging
copying /x1/jenkins/jenkins-slave/workspace/Qpid-Java-Cpp-Test/cpp-build/src/tests/python/build/lib.linux-x86_64-2.7/qpid/messaging/constants.py
-> /x1/jenkins/jenkins-slave/workspace/Qpid-Java-Cpp-Test/cpp-build/src/tests/python/qpid/messaging
copying /x1/jenkins/jenkins-slave/workspace/Qpid-Java-Cpp-Test/cpp-build/src/tests/python/build/lib.linux-x86_64-2.7/qpid/messaging/util.py
-> /x1/jenkins/jenkins-slave/workspace/Qpid-Java-Cpp-Test/cpp-build/src/tests/python/qpid/messaging
copying /x1/jenkins/jenkins-slave/workspace/Qpid-Java-Cpp-Test/cpp-build/src/tests/python/build/lib.linux-x86_64-2.7/qpid/messaging/endpoints.py
-> /x1/jenkins/jenkins-slave/workspace/Qpid-Java-Cpp-Test/cpp-build/src/tests/python/qpid/messaging
copying /x1/jenkins/jenkins-slave/workspace/Qpid-Java-Cpp-Test/cpp-build/src/tests/python/build/lib.linux-x86_64-2.7/qpid/messaging/message.py
-> /x1/jenkins/jenkins-slave/workspace/Qpid-Java-Cpp-Test/cpp-build/src/tests/python/qpid/messaging
copying /x1/jenkins/jenkins-slave/workspace/Qpid-Java-Cpp-Test/cpp-build/src/tests/python/build/lib.linux-x86_64-2.7/qpid/messaging/address.py
-> /x1/jenkins/jenkins-slave/workspace/Qpid-Java-Cpp-Test/cpp-build/src/tests/python/qpid/messaging
copying /x1/jenkins/jenkins-slave/workspace/Qpid-Java-Cpp-Test/cpp-build/src/tests/python/build/lib.linux-x86_64-2.7/qpid/messaging/exceptions.py
-> /x1/jenkins/jenkins-slave/workspace/Qpid-Java-Cpp-Test/cpp-build/src/tests/python/qpid/messaging
copying /x1/jenkins/jenkins-slave/workspace/Qpid-Java-Cpp-Test/cpp-build/src/tests/python/build/lib.linux-x86_64-2.7/qpid/messaging/transports.py
-> /x1/jenkins/jenkins-slave/workspace/Qpid-Java-Cpp-Test/cpp-build/src/tests/python/qpid/messaging
copying /x1/jenkins/jenkins-slave/workspace/Qpid-Java-Cpp-Test/cpp-build/src/tests/python/build/lib.linux-x86_64-2.7/qpid/messaging/__init__.py
-> /x1/jenkins/jenkins-slave/workspace/Qpid-Java-Cpp-Test/cpp-build/src/tests/python/qpid/messaging
copying /x1/jenkins/jenkins-slave/workspace/Qpid-Java-Cpp-Test/cpp-build/src/tests/python/build/lib.linux-x86_64-2.7/qpid/exceptions.py
-> /x1/jenkins/jenkins-slave/workspace/Qpid-Java-Cpp-Test/cpp-build/src/tests/python/qpid
copying /x1/jenkins/jenkins-slave/workspace/Qpid-Java-Cpp-Test/cpp-build/src/tests/python/build/lib.linux-x86_64-2.7/qpid/framer.py
-> /x1/jenkins/jenkins-slave/workspace/Qpid-Java-Cpp-Test/cpp-build/src/tests/python/qpid
copying /x1/jenkins/jenkins-slave/workspace/Qpid-Java-Cpp-Test/cpp-build/src/tests/python/build/lib.linux-x86_64-2.7/qpid/__init__.py
-> /x1/jenkins/jenkins-slave/workspace/Qpid-Java-Cpp-Test/cpp-build/src/tests/python/qpid
copying /x1/jenkins/jenkins-slave/workspace/Qpid-Java-Cpp-Test/cpp-build/src/tests/python/build/lib.linux-x86_64-2.7/qpid/sasl.py
-> /x1/jenkins/jenkins-slave/workspace/Qpid-Java-Cpp-Test/cpp-build/src/tests/python/qpid
copying /x1/jenkins/jenkins-slave/workspace/Qpid-Java-Cpp-Test/cpp-build/src/tests/python/build/lib.linux-x86_64-2.7/qpid/client.py
-> /x1/jenkins/jenkins-slave/workspace/Qpid-Java-Cpp-Test/cpp-build/src/tests/python/qpid
copying /x1/jenkins/jenkins-slave/workspace/Qpid-Java-Cpp-Test/cpp-build/src/tests/python/build/lib.linux-x86_64-2.7/qpid/packer.py
-> /x1/jenkins/jenkins-slave/workspace/Qpid-Java-Cpp-Test/cpp-build/src/tests/python/qpid
copying /x1/jenkins/jenkins-slave/workspace/Qpid-Java-Cpp-Test/cpp-build/src/tests/python/build/lib.linux-x86_64-2.7/qpid/framing.py
-> /x1/jenkins/jenkins-slave/workspace/Qpid-Java-Cpp-Test/cpp-build/src/tests/python/qpid
caching /x1/jenkins/jenkins-slave/workspace/Qpid-Java-Cpp-Test/cpp-build/src/tests/python/qpid/specs/amqp-0-10-qpid-errata-stripped.xml
to amqp-0-10-qpid-errata-stripped.pcl
<https://builds.apache.org/job/Qpid-Java-Cpp-Test/ws/trunk/qpid/cpp/src/qpid/types/Uuid.cpp>:208:2:
fatal error: error writing to /tmp/cca8kfHX.s: No space left on device
compilation terminated.
make[2]: *** [src/CMakeFiles/qpidtypes.dir/qpid/types/Exception.cpp.o] Error 1
make[2]: *** Waiting for unfinished jobs....
Scanning dependencies of target shlibtest
[  1%] Building CXX object src/tests/CMakeFiles/shlibtest.dir/shlibtest.cpp.o
Linking CXX shared module libshlibtest.so
[  1%] Built target shlibtest
The bug is not reproducible, so it is likely a hardware or OS problem.
make[2]: *** [src/tests/CMakeFiles/sasl_version.dir/sasl_version.cpp.o] Error 1
make[1]: *** [src/tests/CMakeFiles/sasl_version.dir/all] Error 2
make[1]: *** Waiting for unfinished jobs....
byte-compiling /x1/jenkins/jenkins-slave/workspace/Qpid-Java-Cpp-Test/cpp-build/src/tests/python/mllib/transforms.py
to transforms.pyc
byte-compiling /x1/jenkins/jenkins-slave/workspace/Qpid-Java-Cpp-Test/cpp-build/src/tests/python/mllib/parsers.py
to parsers.pyc
byte-compiling /x1/jenkins/jenkins-slave/workspace/Qpid-Java-Cpp-Test/cpp-build/src/tests/python/mllib/dom.py
to dom.pyc
byte-compiling /x1/jenkins/jenkins-slave/workspace/Qpid-Java-Cpp-Test/cpp-build/src/tests/python/mllib/__init__.py
to __init__.pyc
byte-compiling /x1/jenkins/jenkins-slave/workspace/Qpid-Java-Cpp-Test/cpp-build/src/tests/python/qpid/connection.py
to connection.pyc
byte-compiling /x1/jenkins/jenkins-slave/workspace/Qpid-Java-Cpp-Test/cpp-build/src/tests/python/qpid/generator.py
to generator.pyc
byte-compiling /x1/jenkins/jenkins-slave/workspace/Qpid-Java-Cpp-Test/cpp-build/src/tests/python/qpid/mimetype.py
to mimetype.pyc
byte-compiling /x1/jenkins/jenkins-slave/workspace/Qpid-Java-Cpp-Test/cpp-build/src/tests/python/qpid/content.py
to content.pyc
byte-compiling /x1/jenkins/jenkins-slave/workspace/Qpid-Java-Cpp-Test/cpp-build/src/tests/python/qpid/selector.py
to selector.pyc
byte-compiling /x1/jenkins/jenkins-slave/workspace/Qpid-Java-Cpp-Test/cpp-build/src/tests/python/qpid/concurrency.py
to concurrency.pyc
byte-compiling /x1/jenkins/jenkins-slave/workspace/Qpid-Java-Cpp-Test/cpp-build/src/tests/python/qpid/validator.py
to validator.pyc
byte-compiling /x1/jenkins/jenkins-slave/workspace/Qpid-Java-Cpp-Test/cpp-build/src/tests/python/qpid/queue.py
to queue.pyc
byte-compiling /x1/jenkins/jenkins-slave/workspace/Qpid-Java-Cpp-Test/cpp-build/src/tests/python/qpid/reference.py
to reference.pyc
byte-compiling /x1/jenkins/jenkins-slave/workspace/Qpid-Java-Cpp-Test/cpp-build/src/tests/python/qpid/delegate.py
to delegate.pyc
byte-compiling /x1/jenkins/jenkins-slave/workspace/Qpid-Java-Cpp-Test/cpp-build/src/tests/python/qpid/ops.py
to ops.pyc
byte-compiling /x1/jenkins/jenkins-slave/workspace/Qpid-Java-Cpp-Test/cpp-build/src/tests/python/qpid/tests/connection.py
to connection.pyc
byte-compiling /x1/jenkins/jenkins-slave/workspace/Qpid-Java-Cpp-Test/cpp-build/src/tests/python/qpid/tests/mimetype.py
to mimetype.pyc
byte-compiling /x1/jenkins/jenkins-slave/workspace/Qpid-Java-Cpp-Test/cpp-build/src/tests/python/qpid/tests/queue.py
to queue.pyc
byte-compiling /x1/jenkins/jenkins-slave/workspace/Qpid-Java-Cpp-Test/cpp-build/src/tests/python/qpid/tests/spec010.py
to spec010.pyc
byte-compiling /x1/jenkins/jenkins-slave/workspace/Qpid-Java-Cpp-Test/cpp-build/src/tests/python/qpid/tests/codec.py
to codec.pyc
byte-compiling /x1/jenkins/jenkins-slave/workspace/Qpid-Java-Cpp-Test/cpp-build/src/tests/python/qpid/tests/datatypes.py
to datatypes.pyc
byte-compiling /x1/jenkins/jenkins-slave/workspace/Qpid-Java-Cpp-Test/cpp-build/src/tests/python/qpid/tests/util.py
to util.pyc
byte-compiling /x1/jenkins/jenkins-slave/workspace/Qpid-Java-Cpp-Test/cpp-build/src/tests/python/qpid/tests/parser.py
to parser.pyc
byte-compiling /x1/jenkins/jenkins-slave/workspace/Qpid-Java-Cpp-Test/cpp-build/src/tests/python/qpid/tests/codec010.py
to codec010.pyc
byte-compiling /x1/jenkins/jenkins-slave/workspace/Qpid-Java-Cpp-Test/cpp-build/src/tests/python/qpid/tests/messaging/endpoints.py
to endpoints.pyc
byte-compiling /x1/jenkins/jenkins-slave/workspace/Qpid-Java-Cpp-Test/cpp-build/src/tests/python/qpid/tests/messaging/message.py
to message.pyc
byte-compiling /x1/jenkins/jenkins-slave/workspace/Qpid-Java-Cpp-Test/cpp-build/src/tests/python/qpid/tests/messaging/address.py
to address.pyc
byte-compiling /x1/jenkins/jenkins-slave/workspace/Qpid-Java-Cpp-Test/cpp-build/src/tests/python/qpid/tests/messaging/implementation.py
to implementation.pyc
byte-compiling /x1/jenkins/jenkins-slave/workspace/Qpid-Java-Cpp-Test/cpp-build/src/tests/python/qpid/tests/messaging/__init__.py
to __init__.pyc
byte-compiling /x1/jenkins/jenkins-slave/workspace/Qpid-Java-Cpp-Test/cpp-build/src/tests/python/qpid/tests/__init__.py
to __init__.pyc
byte-compiling /x1/jenkins/jenkins-slave/workspace/Qpid-Java-Cpp-Test/cpp-build/src/tests/python/qpid/tests/framing.py
to framing.pyc
byte-compiling /x1/jenkins/jenkins-slave/workspace/Qpid-Java-Cpp-Test/cpp-build/src/tests/python/qpid/compat.py
to compat.pyc
byte-compiling /x1/jenkins/jenkins-slave/workspace/Qpid-Java-Cpp-Test/cpp-build/src/tests/python/qpid/codec.py
to codec.pyc
byte-compiling /x1/jenkins/jenkins-slave/workspace/Qpid-Java-Cpp-Test/cpp-build/src/tests/python/qpid/lexer.py
to lexer.pyc
byte-compiling /x1/jenkins/jenkins-slave/workspace/Qpid-Java-Cpp-Test/cpp-build/src/tests/python/qpid/connection08.py
to connection08.pyc
byte-compiling /x1/jenkins/jenkins-slave/workspace/Qpid-Java-Cpp-Test/cpp-build/src/tests/python/qpid/session.py
to session.pyc
byte-compiling /x1/jenkins/jenkins-slave/workspace/Qpid-Java-Cpp-Test/cpp-build/src/tests/python/qpid/datatypes.py
to datatypes.pyc
byte-compiling /x1/jenkins/jenkins-slave/workspace/Qpid-Java-Cpp-Test/cpp-build/src/tests/python/qpid/util.py
to util.pyc
byte-compiling /x1/jenkins/jenkins-slave/workspace/Qpid-Java-Cpp-Test/cpp-build/src/tests/python/qpid/log.py
to log.pyc
byte-compiling /x1/jenkins/jenkins-slave/workspace/Qpid-Java-Cpp-Test/cpp-build/src/tests/python/qpid/managementdata.py
to managementdata.pyc
byte-compiling /x1/jenkins/jenkins-slave/workspace/Qpid-Java-Cpp-Test/cpp-build/src/tests/python/qpid/disp.py
to disp.pyc
byte-compiling /x1/jenkins/jenkins-slave/workspace/Qpid-Java-Cpp-Test/cpp-build/src/tests/python/qpid/debug.py
to debug.pyc
byte-compiling /x1/jenkins/jenkins-slave/workspace/Qpid-Java-Cpp-Test/cpp-build/src/tests/python/qpid/message.py
to message.pyc
byte-compiling /x1/jenkins/jenkins-slave/workspace/Qpid-Java-Cpp-Test/cpp-build/src/tests/python/qpid/spec08.py
to spec08.pyc
byte-compiling /x1/jenkins/jenkins-slave/workspace/Qpid-Java-Cpp-Test/cpp-build/src/tests/python/qpid/delegates.py
to delegates.pyc
byte-compiling /x1/jenkins/jenkins-slave/workspace/Qpid-Java-Cpp-Test/cpp-build/src/tests/python/qpid/harness.py
to harness.pyc
byte-compiling /x1/jenkins/jenkins-slave/workspace/Qpid-Java-Cpp-Test/cpp-build/src/tests/python/qpid/management.py
to management.pyc
byte-compiling /x1/jenkins/jenkins-slave/workspace/Qpid-Java-Cpp-Test/cpp-build/src/tests/python/qpid/specs_config.py
to specs_config.pyc
byte-compiling /x1/jenkins/jenkins-slave/workspace/Qpid-Java-Cpp-Test/cpp-build/src/tests/python/qpid/parser.py
to parser.pyc
byte-compiling /x1/jenkins/jenkins-slave/workspace/Qpid-Java-Cpp-Test/cpp-build/src/tests/python/qpid/peer.py
to peer.pyc
byte-compiling /x1/jenkins/jenkins-slave/workspace/Qpid-Java-Cpp-Test/cpp-build/src/tests/python/qpid/codec010.py
to codec010.pyc
byte-compiling /x1/jenkins/jenkins-slave/workspace/Qpid-Java-Cpp-Test/cpp-build/src/tests/python/qpid/testlib.py
to testlib.pyc
byte-compiling /x1/jenkins/jenkins-slave/workspace/Qpid-Java-Cpp-Test/cpp-build/src/tests/python/qpid/messaging/driver.py
to driver.pyc
byte-compiling /x1/jenkins/jenkins-slave/workspace/Qpid-Java-Cpp-Test/cpp-build/src/tests/python/qpid/messaging/constants.py
to constants.pyc
byte-compiling /x1/jenkins/jenkins-slave/workspace/Qpid-Java-Cpp-Test/cpp-build/src/tests/python/qpid/messaging/util.py
to util.pyc
byte-compiling /x1/jenkins/jenkins-slave/workspace/Qpid-Java-Cpp-Test/cpp-build/src/tests/python/qpid/messaging/endpoints.py
to endpoints.pyc
byte-compiling /x1/jenkins/jenkins-slave/workspace/Qpid-Java-Cpp-Test/cpp-build/src/tests/python/qpid/messaging/message.py
to message.pyc
byte-compiling /x1/jenkins/jenkins-slave/workspace/Qpid-Java-Cpp-Test/cpp-build/src/tests/python/qpid/messaging/address.py
to address.pyc
byte-compiling /x1/jenkins/jenkins-slave/workspace/Qpid-Java-Cpp-Test/cpp-build/src/tests/python/qpid/messaging/exceptions.py
to exceptions.pyc
byte-compiling /x1/jenkins/jenkins-slave/workspace/Qpid-Java-Cpp-Test/cpp-build/src/tests/python/qpid/messaging/transports.py
to transports.pyc
byte-compiling /x1/jenkins/jenkins-slave/workspace/Qpid-Java-Cpp-Test/cpp-build/src/tests/python/qpid/messaging/__init__.py
to __init__.pyc
byte-compiling /x1/jenkins/jenkins-slave/workspace/Qpid-Java-Cpp-Test/cpp-build/src/tests/python/qpid/exceptions.py
to exceptions.pyc
byte-compiling /x1/jenkins/jenkins-slave/workspace/Qpid-Java-Cpp-Test/cpp-build/src/tests/python/qpid/framer.py
to framer.pyc
byte-compiling /x1/jenkins/jenkins-slave/workspace/Qpid-Java-Cpp-Test/cpp-build/src/tests/python/qpid/__init__.py
to __init__.pyc
byte-compiling /x1/jenkins/jenkins-slave/workspace/Qpid-Java-Cpp-Test/cpp-build/src/tests/python/qpid/sasl.py
to sasl.pyc
byte-compiling /x1/jenkins/jenkins-slave/workspace/Qpid-Java-Cpp-Test/cpp-build/src/tests/python/qpid/client.py
to client.pyc
byte-compiling /x1/jenkins/jenkins-slave/workspace/Qpid-Java-Cpp-Test/cpp-build/src/tests/python/qpid/packer.py
to packer.pyc
byte-compiling /x1/jenkins/jenkins-slave/workspace/Qpid-Java-Cpp-Test/cpp-build/src/tests/python/qpid/framing.py
to framing.pyc
running install_scripts
creating /x1/jenkins/jenkins-slave/workspace/Qpid-Java-Cpp-Test/cpp-build/src/tests/python/commands
copying /x1/jenkins/jenkins-slave/workspace/Qpid-Java-Cpp-Test/cpp-build/src/tests/python/build/scripts-2.7/qpid-python-test
-> /x1/jenkins/jenkins-slave/workspace/Qpid-Java-Cpp-Test/cpp-build/src/tests/python/commands
changing mode of /x1/jenkins/jenkins-slave/workspace/Qpid-Java-Cpp-Test/cpp-build/src/tests/python/commands/qpid-python-test
to 755
running install_egg_info
Writing /x1/jenkins/jenkins-slave/workspace/Qpid-Java-Cpp-Test/cpp-build/src/tests/python/qpid_python-0.31-py2.7.egg-info
[  1%] Built target python_bld
The bug is not reproducible, so it is likely a hardware or OS problem.
make[2]: *** [src/CMakeFiles/qpidtypes.dir/qpid/types/Uuid.cpp.o] Error 1
make[1]: *** [src/CMakeFiles/qpidtypes.dir/all] Error 2
make: *** [all] Error 2
Build step 'Execute shell' marked build as failure
[locks-and-latches] Releasing all the locks
[locks-and-latches] All the locks released
Recording test results

Mime
View raw message