qpid-notifications mailing list archives

Site index · List index
Message view « Date » · « Thread »
Top « Date » · « Thread »
From Apache Jenkins Server <jenk...@builds.apache.org>
Subject Build failed in Jenkins: Qpid-Java-Cpp-Test #2044
Date Wed, 06 Aug 2014 12:28:40 GMT
See <https://builds.apache.org/job/Qpid-Java-Cpp-Test/2044/changes>

Changes:

[rgodfrey] QPID-5965 : [Java Broker] flow transient messages to disk in low memory situations

------------------------------------------
[...truncated 8332 lines...]
[INFO] skip non existing resourceDirectory /x1/jenkins/jenkins-slave/workspace/Qpid-Java-Cpp-Test/trunk/qpid/java/perftests/visualisation-jfc/src/main/resources
[INFO] Copying 0 resource
[INFO] Copying 3 resources
[INFO] 
[INFO] --- maven-compiler-plugin:3.1:compile (default-compile) @ qpid-perftests-visualisation-jfc
---
[INFO] Changes detected - recompiling the module!
[INFO] Compiling 30 source files to /x1/jenkins/jenkins-slave/workspace/Qpid-Java-Cpp-Test/trunk/qpid/java/perftests/visualisation-jfc/target/classes
[INFO] 
[INFO] --- maven-resources-plugin:2.6:testResources (default-testResources) @ qpid-perftests-visualisation-jfc
---
[INFO] Using 'UTF-8' encoding to copy filtered resources.
[INFO] Copying 1 resource
[INFO] skip non existing resourceDirectory /x1/jenkins/jenkins-slave/workspace/Qpid-Java-Cpp-Test/trunk/qpid/java/perftests/visualisation-jfc/src/test/resources
[INFO] Copying 3 resources
[INFO] 
[INFO] --- maven-compiler-plugin:3.1:testCompile (default-testCompile) @ qpid-perftests-visualisation-jfc
---
[INFO] Changes detected - recompiling the module!
[INFO] Compiling 11 source files to /x1/jenkins/jenkins-slave/workspace/Qpid-Java-Cpp-Test/trunk/qpid/java/perftests/visualisation-jfc/target/test-classes
[INFO] 
[INFO] --- maven-surefire-plugin:2.16:test (default-test) @ qpid-perftests-visualisation-jfc
---
[INFO] Surefire report directory: /x1/jenkins/jenkins-slave/workspace/Qpid-Java-Cpp-Test/trunk/qpid/java/perftests/visualisation-jfc/target/surefire-reports

-------------------------------------------------------
 T E S T S
-------------------------------------------------------
Running org.apache.qpid.disttest.charting.seriesbuilder.SeriesRowTest
main 2014-08-06 12:28:29,921 INFO [qpid.test.utils.QpidTestCase] Some tests should be excluded,
building the exclude list
main 2014-08-06 12:28:29,931 INFO [qpid.test.utils.QpidTestCase] Specified exclude file does
not exist: /x1/jenkins/jenkins-slave/workspace/Qpid-Java-Cpp-Test/trunk/qpid/java/perftests/visualisation-jfc/../test-profiles//Excludes
main 2014-08-06 12:28:29,932 INFO [qpid.test.utils.QpidTestCase] Specified exclude file does
not exist: /x1/jenkins/jenkins-slave/workspace/Qpid-Java-Cpp-Test/trunk/qpid/java/perftests/visualisation-jfc/../test-profiles//CPPExcludes
main 2014-08-06 12:28:29,932 INFO [qpid.test.utils.QpidTestCase] Specified exclude file does
not exist: /x1/jenkins/jenkins-slave/workspace/Qpid-Java-Cpp-Test/trunk/qpid/java/perftests/visualisation-jfc/../test-profiles//cpp.excludes
main 2014-08-06 12:28:29,932 INFO [qpid.test.utils.QpidTestCase] Specified exclude file does
not exist: /x1/jenkins/jenkins-slave/workspace/Qpid-Java-Cpp-Test/trunk/qpid/java/perftests/visualisation-jfc/../test-profiles//CPPPrefetchExcludes
main 2014-08-06 12:28:29,932 INFO [qpid.test.utils.QpidTestCase] Specified exclude file does
not exist: /x1/jenkins/jenkins-slave/workspace/Qpid-Java-Cpp-Test/trunk/qpid/java/perftests/visualisation-jfc/../test-profiles//CPPTransientExcludes
main 2014-08-06 12:28:29,932 INFO [qpid.test.utils.QpidTestCase] Specified exclude file does
not exist: /x1/jenkins/jenkins-slave/workspace/Qpid-Java-Cpp-Test/trunk/qpid/java/perftests/visualisation-jfc/../test-profiles//cpp.excludes
main 2014-08-06 12:28:29,950 INFO [qpid.test.utils.QpidTestCase] ========== start SeriesRowTest.testValidSeriesRowThrowsExceptionIfArrayTooSmall
==========
main 2014-08-06 12:28:29,952 INFO [qpid.test.utils.QpidTestCase] ========== tearDown SeriesRowTest.testValidSeriesRowThrowsExceptionIfArrayTooSmall
==========
main 2014-08-06 12:28:29,953 INFO [qpid.test.utils.QpidTestCase] ========== start SeriesRowTest.testDimension
==========
main 2014-08-06 12:28:29,953 INFO [qpid.test.utils.QpidTestCase] ========== tearDown SeriesRowTest.testDimension
==========
main 2014-08-06 12:28:29,961 INFO [qpid.test.utils.QpidTestCase] ========== start SeriesRowTest.testDimensionAsDouble
==========
main 2014-08-06 12:28:29,962 INFO [qpid.test.utils.QpidTestCase] ========== tearDown SeriesRowTest.testDimensionAsDouble
==========
main 2014-08-06 12:28:29,963 INFO [qpid.test.utils.QpidTestCase] ========== start SeriesRowTest.testDimensionAsString
==========
main 2014-08-06 12:28:29,963 INFO [qpid.test.utils.QpidTestCase] ========== tearDown SeriesRowTest.testDimensionAsString
==========
main 2014-08-06 12:28:29,964 INFO [qpid.test.utils.QpidTestCase] ========== start SeriesRowTest.testValidSeriesRow
==========
main 2014-08-06 12:28:29,964 INFO [qpid.test.utils.QpidTestCase] ========== tearDown SeriesRowTest.testValidSeriesRow
==========
Tests run: 5, Failures: 0, Errors: 0, Skipped: 0, Time elapsed: 0.24 sec - in org.apache.qpid.disttest.charting.seriesbuilder.SeriesRowTest
Running org.apache.qpid.disttest.charting.seriesbuilder.JdbcSeriesBuilderTest
main 2014-08-06 12:28:30,294 INFO [qpid.test.utils.QpidTestCase] ========== start JdbcSeriesBuilderTest.testBuildOneSeries
==========
main 2014-08-06 12:28:30,579 INFO [disttest.charting.seriesbuilder.JdbcSeriesBuilder] Loaded
JDBC driver class org.relique.jdbc.csv.CsvDriver
main 2014-08-06 12:28:30,613 INFO [disttest.charting.seriesbuilder.JdbcSeriesBuilder] Created:
JdbcSeriesBuilder[jdbcUrlGenerator=JdbcUrlGenerator[providedJdbdUrl=<null>]]
main 2014-08-06 12:28:30,689 INFO [qpid.test.utils.QpidTestCase] ========== tearDown JdbcSeriesBuilderTest.testBuildOneSeries
==========
Tests run: 1, Failures: 0, Errors: 0, Skipped: 0, Time elapsed: 0.727 sec - in org.apache.qpid.disttest.charting.seriesbuilder.JdbcSeriesBuilderTest
Running org.apache.qpid.disttest.charting.seriesbuilder.JdbcUrlGeneratorTest
main 2014-08-06 12:28:30,692 INFO [qpid.test.utils.QpidTestCase] ========== start JdbcUrlGeneratorTest.testGetJdbcUrlWithoutProvidingAUrlReturnsCsvUrlWithCorrectDirectory
==========
main 2014-08-06 12:28:30,699 INFO [qpid.test.utils.QpidTestCase] ========== tearDown JdbcUrlGeneratorTest.testGetJdbcUrlWithoutProvidingAUrlReturnsCsvUrlWithCorrectDirectory
==========
main 2014-08-06 12:28:30,700 INFO [qpid.test.utils.QpidTestCase] ========== start JdbcUrlGeneratorTest.testGetJdbcUrlThrowsExceptionWithoutAProvidedUrlOrSeriesDirectory
==========
main 2014-08-06 12:28:30,702 INFO [qpid.test.utils.QpidTestCase] ========== tearDown JdbcUrlGeneratorTest.testGetJdbcUrlThrowsExceptionWithoutAProvidedUrlOrSeriesDirectory
==========
main 2014-08-06 12:28:30,702 INFO [qpid.test.utils.QpidTestCase] ========== start JdbcUrlGeneratorTest.testGetJdbcUrlThrowsExceptionIfUrlProvidedAndSeriesDirectorySpecified
==========
main 2014-08-06 12:28:30,703 INFO [qpid.test.utils.QpidTestCase] ========== tearDown JdbcUrlGeneratorTest.testGetJdbcUrlThrowsExceptionIfUrlProvidedAndSeriesDirectorySpecified
==========
main 2014-08-06 12:28:30,704 INFO [qpid.test.utils.QpidTestCase] ========== start JdbcUrlGeneratorTest.testGetJdbcUrlReturnsProvidedUrl
==========
main 2014-08-06 12:28:30,704 INFO [qpid.test.utils.QpidTestCase] ========== tearDown JdbcUrlGeneratorTest.testGetJdbcUrlReturnsProvidedUrl
==========
Tests run: 4, Failures: 0, Errors: 0, Skipped: 0, Time elapsed: 0.011 sec - in org.apache.qpid.disttest.charting.seriesbuilder.JdbcUrlGeneratorTest
Running org.apache.qpid.disttest.charting.chartbuilder.ColorFactoryTest
main 2014-08-06 12:28:30,706 INFO [qpid.test.utils.QpidTestCase] ========== start ColorFactoryTest.testDarkBlue
==========
main 2014-08-06 12:28:30,713 INFO [qpid.test.utils.QpidTestCase] ========== tearDown ColorFactoryTest.testDarkBlue
==========
main 2014-08-06 12:28:30,714 INFO [qpid.test.utils.QpidTestCase] ========== start ColorFactoryTest.testBlue
==========
main 2014-08-06 12:28:30,714 INFO [qpid.test.utils.QpidTestCase] ========== tearDown ColorFactoryTest.testBlue
==========
Tests run: 2, Failures: 0, Errors: 0, Skipped: 0, Time elapsed: 0.009 sec - in org.apache.qpid.disttest.charting.chartbuilder.ColorFactoryTest
Running org.apache.qpid.disttest.charting.chartbuilder.BaseChartBuilderTest
main 2014-08-06 12:28:30,837 INFO [qpid.test.utils.QpidTestCase] ========== start BaseChartBuilderTest.testBuildChart
==========
main 2014-08-06 12:28:31,506 INFO [qpid.test.utils.QpidTestCase] ========== tearDown BaseChartBuilderTest.testBuildChart
==========
Tests run: 1, Failures: 0, Errors: 0, Skipped: 0, Time elapsed: 0.792 sec - in org.apache.qpid.disttest.charting.chartbuilder.BaseChartBuilderTest
Running org.apache.qpid.disttest.charting.chartbuilder.ChartBuilderFactoryTest
main 2014-08-06 12:28:31,510 INFO [qpid.test.utils.QpidTestCase] ========== start ChartBuilderFactoryTest.testXYLineChart
==========
main 2014-08-06 12:28:31,512 INFO [qpid.test.utils.QpidTestCase] ========== tearDown ChartBuilderFactoryTest.testXYLineChart
==========
main 2014-08-06 12:28:31,513 INFO [qpid.test.utils.QpidTestCase] ========== start ChartBuilderFactoryTest.testLineChart
==========
main 2014-08-06 12:28:31,514 INFO [qpid.test.utils.QpidTestCase] ========== tearDown ChartBuilderFactoryTest.testLineChart
==========
main 2014-08-06 12:28:31,515 INFO [qpid.test.utils.QpidTestCase] ========== start ChartBuilderFactoryTest.testBarChart
==========
main 2014-08-06 12:28:31,516 INFO [qpid.test.utils.QpidTestCase] ========== tearDown ChartBuilderFactoryTest.testBarChart
==========
main 2014-08-06 12:28:31,517 INFO [qpid.test.utils.QpidTestCase] ========== start ChartBuilderFactoryTest.testTimeSeriesLineChart
==========
main 2014-08-06 12:28:31,517 INFO [qpid.test.utils.QpidTestCase] ========== tearDown ChartBuilderFactoryTest.testTimeSeriesLineChart
==========
main 2014-08-06 12:28:31,518 INFO [qpid.test.utils.QpidTestCase] ========== start ChartBuilderFactoryTest.testLineChart3D
==========
main 2014-08-06 12:28:31,519 INFO [qpid.test.utils.QpidTestCase] ========== tearDown ChartBuilderFactoryTest.testLineChart3D
==========
main 2014-08-06 12:28:31,520 INFO [qpid.test.utils.QpidTestCase] ========== start ChartBuilderFactoryTest.testBarChart3D
==========
main 2014-08-06 12:28:31,520 INFO [qpid.test.utils.QpidTestCase] ========== tearDown ChartBuilderFactoryTest.testBarChart3D
==========
Tests run: 6, Failures: 0, Errors: 0, Skipped: 0, Time elapsed: 0.013 sec - in org.apache.qpid.disttest.charting.chartbuilder.ChartBuilderFactoryTest
Running org.apache.qpid.disttest.charting.chartbuilder.TimeSeriesBuilderCallbackTest
main 2014-08-06 12:28:31,524 INFO [qpid.test.utils.QpidTestCase] ========== start TimeSeriesBuilderCallbackTest.testAddPointToSeries
==========
main 2014-08-06 12:28:31,550 INFO [qpid.test.utils.QpidTestCase] ========== tearDown TimeSeriesBuilderCallbackTest.testAddPointToSeries
==========
Tests run: 1, Failures: 0, Errors: 0, Skipped: 0, Time elapsed: 0.029 sec - in org.apache.qpid.disttest.charting.chartbuilder.TimeSeriesBuilderCallbackTest
Running org.apache.qpid.disttest.charting.chartbuilder.ChartProductionTest
main 2014-08-06 12:28:31,557 INFO [qpid.test.utils.QpidTestCase] ========== start ChartProductionTest.testLine3DChart
==========
main 2014-08-06 12:28:31,560 INFO [disttest.charting.writer.ChartWriter] Set chart directory:
/tmp/charts-1407328111558
main 2014-08-06 12:28:32,309 INFO [disttest.charting.writer.ChartWriter] Written /tmp/charts-1407328111558/testLine3DChart.png
chart
main 2014-08-06 12:28:32,310 INFO [qpid.test.utils.QpidTestCase] ========== tearDown ChartProductionTest.testLine3DChart
==========
main 2014-08-06 12:28:32,311 INFO [qpid.test.utils.QpidTestCase] ========== start ChartProductionTest.testXYLineChart
==========
main 2014-08-06 12:28:32,312 INFO [disttest.charting.writer.ChartWriter] Set chart directory:
/tmp/charts-1407328112312
main 2014-08-06 12:28:32,481 INFO [disttest.charting.writer.ChartWriter] Written /tmp/charts-1407328112312/testXYLineChart.png
chart
main 2014-08-06 12:28:32,481 INFO [qpid.test.utils.QpidTestCase] ========== tearDown ChartProductionTest.testXYLineChart
==========
main 2014-08-06 12:28:32,482 INFO [qpid.test.utils.QpidTestCase] ========== start ChartProductionTest.testStatisticalBarChart
==========
main 2014-08-06 12:28:32,483 INFO [disttest.charting.writer.ChartWriter] Set chart directory:
/tmp/charts-1407328112483
main 2014-08-06 12:28:32,610 INFO [disttest.charting.writer.ChartWriter] Written /tmp/charts-1407328112483/testStatisticalBarChart.png
chart
main 2014-08-06 12:28:32,610 INFO [qpid.test.utils.QpidTestCase] ========== tearDown ChartProductionTest.testStatisticalBarChart
==========
main 2014-08-06 12:28:32,611 INFO [qpid.test.utils.QpidTestCase] ========== start ChartProductionTest.testLineChart
==========
main 2014-08-06 12:28:32,612 INFO [disttest.charting.writer.ChartWriter] Set chart directory:
/tmp/charts-1407328112612
main 2014-08-06 12:28:32,718 INFO [disttest.charting.writer.ChartWriter] Written /tmp/charts-1407328112612/testLineChart.png
chart
main 2014-08-06 12:28:32,718 INFO [qpid.test.utils.QpidTestCase] ========== tearDown ChartProductionTest.testLineChart
==========
main 2014-08-06 12:28:32,719 INFO [qpid.test.utils.QpidTestCase] ========== start ChartProductionTest.testBarChart
==========
main 2014-08-06 12:28:32,720 INFO [disttest.charting.writer.ChartWriter] Set chart directory:
/tmp/charts-1407328112720
main 2014-08-06 12:28:32,827 INFO [disttest.charting.writer.ChartWriter] Written /tmp/charts-1407328112720/testBarChart.png
chart
main 2014-08-06 12:28:32,827 INFO [qpid.test.utils.QpidTestCase] ========== tearDown ChartProductionTest.testBarChart
==========
main 2014-08-06 12:28:32,828 INFO [qpid.test.utils.QpidTestCase] ========== start ChartProductionTest.testBar3DChart
==========
main 2014-08-06 12:28:32,829 INFO [disttest.charting.writer.ChartWriter] Set chart directory:
/tmp/charts-1407328112829
main 2014-08-06 12:28:32,934 INFO [disttest.charting.writer.ChartWriter] Written /tmp/charts-1407328112829/testBar3DChart.png
chart
main 2014-08-06 12:28:32,934 INFO [qpid.test.utils.QpidTestCase] ========== tearDown ChartProductionTest.testBar3DChart
==========
main 2014-08-06 12:28:32,935 INFO [qpid.test.utils.QpidTestCase] ========== start ChartProductionTest.testTimeSeriesLineChart
==========
main 2014-08-06 12:28:32,936 INFO [disttest.charting.writer.ChartWriter] Set chart directory:
/tmp/charts-1407328112935
main 2014-08-06 12:28:33,083 INFO [disttest.charting.writer.ChartWriter] Written /tmp/charts-1407328112935/testTimeSeriesLineChart.png
chart
main 2014-08-06 12:28:33,084 INFO [qpid.test.utils.QpidTestCase] ========== tearDown ChartProductionTest.testTimeSeriesLineChart
==========
main 2014-08-06 12:28:33,084 INFO [qpid.test.utils.QpidTestCase] ========== start ChartProductionTest.testXYLineChartWithColourAndWidth
==========
main 2014-08-06 12:28:33,085 INFO [disttest.charting.writer.ChartWriter] Set chart directory:
/tmp/charts-1407328113085
main 2014-08-06 12:28:33,278 INFO [disttest.charting.writer.ChartWriter] Written /tmp/charts-1407328113085/testXYLineChartWithColourAndWidth.png
chart
main 2014-08-06 12:28:33,278 INFO [qpid.test.utils.QpidTestCase] ========== tearDown ChartProductionTest.testXYLineChartWithColourAndWidth
==========
Tests run: 8, Failures: 0, Errors: 0, Skipped: 0, Time elapsed: 1.726 sec - in org.apache.qpid.disttest.charting.chartbuilder.ChartProductionTest
Running org.apache.qpid.disttest.charting.definition.SeriesDefinitionCreatorTest
main 2014-08-06 12:28:33,282 INFO [qpid.test.utils.QpidTestCase] ========== start SeriesDefinitionCreatorTest.testSeriesDirectoryAndNameSubstitution
==========
main 2014-08-06 12:28:33,282 INFO [qpid.test.utils.QpidTestCase] Set system property "SeriesDefinitionProp"
to: "propValue"
main 2014-08-06 12:28:33,292 INFO [qpid.test.utils.QpidTestCase] ========== tearDown SeriesDefinitionCreatorTest.testSeriesDirectoryAndNameSubstitution
==========
main 2014-08-06 12:28:33,293 DEBUG [qpid.test.utils.QpidTestCase] reverting 1 test properties
main 2014-08-06 12:28:33,293 INFO [qpid.test.utils.QpidTestCase] ========== start SeriesDefinitionCreatorTest.testTwoSeriesDefinitions
==========
main 2014-08-06 12:28:33,295 INFO [qpid.test.utils.QpidTestCase] ========== tearDown SeriesDefinitionCreatorTest.testTwoSeriesDefinitions
==========
main 2014-08-06 12:28:33,295 INFO [qpid.test.utils.QpidTestCase] ========== start SeriesDefinitionCreatorTest.testOneSeriesDefinition
==========
main 2014-08-06 12:28:33,296 INFO [qpid.test.utils.QpidTestCase] ========== tearDown SeriesDefinitionCreatorTest.testOneSeriesDefinition
==========
main 2014-08-06 12:28:33,297 INFO [qpid.test.utils.QpidTestCase] ========== start SeriesDefinitionCreatorTest.testNonSequentialSeriesDefinitionsIgnored
==========
main 2014-08-06 12:28:33,298 INFO [qpid.test.utils.QpidTestCase] ========== tearDown SeriesDefinitionCreatorTest.testNonSequentialSeriesDefinitionsIgnored
==========
Tests run: 4, Failures: 0, Errors: 0, Skipped: 0, Time elapsed: 0.019 sec - in org.apache.qpid.disttest.charting.definition.SeriesDefinitionCreatorTest
Running org.apache.qpid.disttest.charting.definition.ChartingDefinitionCreatorTest
main 2014-08-06 12:28:33,302 INFO [qpid.test.utils.QpidTestCase] ========== start ChartingDefinitionCreatorTest.testLoadTwoDefinitionsFromDirectory
==========
main 2014-08-06 12:28:33,309 INFO [qpid.test.utils.QpidTestCase] ========== tearDown ChartingDefinitionCreatorTest.testLoadTwoDefinitionsFromDirectory
==========
main 2014-08-06 12:28:33,310 INFO [qpid.test.utils.QpidTestCase] ========== start ChartingDefinitionCreatorTest.testLoadOneDefinitionFromFile
==========
main 2014-08-06 12:28:33,311 INFO [qpid.test.utils.QpidTestCase] ========== tearDown ChartingDefinitionCreatorTest.testLoadOneDefinitionFromFile
==========
main 2014-08-06 12:28:33,312 INFO [qpid.test.utils.QpidTestCase] ========== start ChartingDefinitionCreatorTest.testDefinitionsProperties
==========
main 2014-08-06 12:28:33,312 INFO [qpid.test.utils.QpidTestCase] Set system property "ChartingDefinitionSysProp"
to: "propValue"
main 2014-08-06 12:28:33,314 INFO [qpid.test.utils.QpidTestCase] ========== tearDown ChartingDefinitionCreatorTest.testDefinitionsProperties
==========
main 2014-08-06 12:28:33,314 DEBUG [qpid.test.utils.QpidTestCase] reverting 1 test properties
main 2014-08-06 12:28:33,315 INFO [qpid.test.utils.QpidTestCase] ========== start ChartingDefinitionCreatorTest.testDefinitionFileNotFound
==========
main 2014-08-06 12:28:33,315 INFO [qpid.test.utils.QpidTestCase] ========== tearDown ChartingDefinitionCreatorTest.testDefinitionFileNotFound
==========
Tests run: 4, Failures: 0, Errors: 0, Skipped: 0, Time elapsed: 0.017 sec - in org.apache.qpid.disttest.charting.definition.ChartingDefinitionCreatorTest
Running org.apache.qpid.disttest.charting.writer.ChartWriterTest
main 2014-08-06 12:28:33,331 INFO [disttest.charting.writer.ChartWriter] Set chart directory:
/tmp/TestFileUtils-testDir-1407328113330
main 2014-08-06 12:28:33,428 INFO [disttest.charting.writer.ChartWriter] Written /tmp/TestFileUtils-testDir-1407328113330/chart1.png
chart
main 2014-08-06 12:28:33,428 INFO [disttest.charting.writer.ChartWriter] Only 1 chart image(s)
have been written so no HTML summary file will be produced
main 2014-08-06 12:28:33,429 INFO [qpid.test.utils.QpidTestCase] ========== tearDown null
==========
main 2014-08-06 12:28:33,430 INFO [disttest.charting.writer.ChartWriter] Set chart directory:
/tmp/TestFileUtils-testDir-1407328113430
main 2014-08-06 12:28:33,529 INFO [disttest.charting.writer.ChartWriter] Written /tmp/TestFileUtils-testDir-1407328113430/chart1.png
chart
main 2014-08-06 12:28:33,530 INFO [qpid.test.utils.QpidTestCase] ========== tearDown null
==========
main 2014-08-06 12:28:33,531 INFO [disttest.charting.writer.ChartWriter] Set chart directory:
/tmp/TestFileUtils-testDir-1407328113531
main 2014-08-06 12:28:33,618 INFO [disttest.charting.writer.ChartWriter] Written /tmp/TestFileUtils-testDir-1407328113531/chart2.png
chart
main 2014-08-06 12:28:33,712 INFO [disttest.charting.writer.ChartWriter] Written /tmp/TestFileUtils-testDir-1407328113531/chart1.png
chart
main 2014-08-06 12:28:33,713 DEBUG [disttest.charting.writer.ChartWriter] About to produce
HTML summary file /tmp/TestFileUtils-testDir-1407328113531/chart-summary.html from charts
{/tmp/TestFileUtils-testDir-1407328113531/chart1.png=Mock for ChartingDefinition, hashCode:
4667787, /tmp/TestFileUtils-testDir-1407328113531/chart2.png=Mock for ChartingDefinition,
hashCode: 1241482}
main 2014-08-06 12:28:33,728 INFO [qpid.test.utils.QpidTestCase] ========== tearDown null
==========
Tests run: 3, Failures: 0, Errors: 0, Skipped: 0, Time elapsed: 0.412 sec - in org.apache.qpid.disttest.charting.writer.ChartWriterTest

Results :

Tests run: 39, Failures: 0, Errors: 0, Skipped: 0

[INFO] 
[INFO] --- maven-jar-plugin:2.4:jar (default-jar) @ qpid-perftests-visualisation-jfc ---
[INFO] Building jar: /x1/jenkins/jenkins-slave/workspace/Qpid-Java-Cpp-Test/trunk/qpid/java/perftests/visualisation-jfc/target/qpid-perftests-visualisation-jfc-0.30-SNAPSHOT.jar
[INFO] 
[INFO] --- maven-site-plugin:3.3:attach-descriptor (attach-descriptor) @ qpid-perftests-visualisation-jfc
---
[INFO] 
[INFO] --- maven-antrun-plugin:1.7:run (create-qbtc-output-dir) @ qpid-perftests-visualisation-jfc
---
[INFO] Executing tasks

main:
    [mkdir] Created dir: /x1/jenkins/jenkins-slave/workspace/Qpid-Java-Cpp-Test/trunk/qpid/java/perftests/visualisation-jfc/target/qbtc-output
[INFO] Executed tasks
[INFO]                                                                         
[INFO] ------------------------------------------------------------------------
[INFO] Skipping Qpid BDB Store System Tests
[INFO] This project has been banned from the build due to previous failures.
[INFO] ------------------------------------------------------------------------
[INFO] ------------------------------------------------------------------------
[INFO] Reactor Summary:
[INFO] 
[INFO] Qpid Java Build ................................... SUCCESS [5.392s]
[INFO] Qpid AMQP 1.0 Common .............................. SUCCESS [9.956s]
[INFO] Qpid AMQP 1.0 Client .............................. SUCCESS [1.579s]
[INFO] Qpid AMQP 1.0 Client JMS .......................... SUCCESS [2.477s]
[INFO] Qpid AMQP 1.0 JMS Client Examples ................. SUCCESS [0.342s]
[INFO] Qpid AMQP 1.0 Client WebSocket .................... SUCCESS [0.939s]
[INFO] Qpid Broker Code Generation ....................... SUCCESS [0.590s]
[INFO] Qpid Test Utilities ............................... SUCCESS [0.473s]
[INFO] Qpid Common ....................................... SUCCESS [28.115s]
[INFO] Qpid Management Common ............................ SUCCESS [1.115s]
[INFO] Qpid Java Broker Core ............................. FAILURE [1:20.268s]
[INFO] Qpid Access Control Broker Plug-in ................ SKIPPED
[INFO] Qpid AMQP 0-8 Protocol Broker Plug-in ............. SKIPPED
[INFO] Qpid AMQP 0-10 Protocol Plug-in ................... SKIPPED
[INFO] Qpid AMQP 1-0 Protocol Broker Plug-in ............. SKIPPED
[INFO] Qpid AMQP 0-8 to 0-10 Message Conversion Broker Plug-in  SKIPPED
[INFO] Qpid AMQP 0-8 to 1-0 Message Conversion Broker Plug-in  SKIPPED
[INFO] Qpid AMQP 0-10 to 1-0 Message Conversion Broker Plug-in  SKIPPED
[INFO] Qpid Derby Message Store .......................... SKIPPED
[INFO] Qpid JDBC Message Store Connection Pooling Plug-in  SKIPPED
[INFO] Qpid JDBC Message Store Broker Plug-in ............ SKIPPED
[INFO] Qpid HTTP Management Broker Plug-in ............... SKIPPED
[INFO] Qpid JMX Management Broker Plug-in ................ SKIPPED
[INFO] Qpid Memory Message Store Broker Plug-in .......... SKIPPED
[INFO] Qpid AMQP 0-x JMS Client .......................... SUCCESS [8.512s]
[INFO] Qpid BDB Message Store ............................ SKIPPED
[INFO] Qpid BDB Message Store JMX ........................ SKIPPED
[INFO] Qpid Java Broker .................................. SKIPPED
[INFO] Qpid AMQP Management Protocol Broker Plug-in ...... SKIPPED
[INFO] Qpid WebSocket Broker Plug-in ..................... SKIPPED
[INFO] Qpid AMQP 0-x JMS Client Examples ................. SUCCESS [0.348s]
[INFO] Qpid JCA .......................................... SUCCESS [1.621s]
[INFO] Qpid Resource Adaptor ............................. SUCCESS [0.651s]
[INFO] Qpid Tools ........................................ SUCCESS [0.419s]
[INFO] Qpid Management Examples .......................... SUCCESS [0.360s]
[INFO] Qpid Java System Test Parent ...................... SUCCESS [1.560s]
[INFO] Qpid System Tests ................................. SKIPPED
[INFO] Qpid Performance Tests ............................ SUCCESS [19.115s]
[INFO] Qpid Performance Test System Tests ................ SKIPPED
[INFO] Qpid Performance Tests Visualisation JFC .......... SUCCESS [5.367s]
[INFO] Qpid BDB Store System Tests ....................... SKIPPED
[INFO] ------------------------------------------------------------------------
[INFO] BUILD FAILURE
[INFO] ------------------------------------------------------------------------
[INFO] Total time: 2:51.505s
[INFO] Finished at: Wed Aug 06 12:28:33 UTC 2014
[INFO] Final Memory: 47M/416M
[INFO] ------------------------------------------------------------------------
[ERROR] Failed to execute goal org.apache.maven.plugins:maven-surefire-plugin:2.16:test (default-test)
on project qpid-broker-core: There are test failures.
[ERROR] 
[ERROR] Please refer to /x1/jenkins/jenkins-slave/workspace/Qpid-Java-Cpp-Test/trunk/qpid/java/broker-core/target/surefire-reports
for the individual test results.
[ERROR] -> [Help 1]
[ERROR] 
[ERROR] To see the full stack trace of the errors, re-run Maven with the -e switch.
[ERROR] Re-run Maven using the -X switch to enable full debug logging.
[ERROR] 
[ERROR] For more information about the errors and possible solutions, please read the following
articles:
[ERROR] [Help 1] http://cwiki.apache.org/confluence/display/MAVEN/MojoFailureException
[ERROR] 
[ERROR] After correcting the problems, you can resume the build with the command
[ERROR]   mvn <goals> -rf :qpid-broker-core
Build step 'Invoke top-level Maven targets' marked build as failure
[locks-and-latches] Releasing all the locks
[locks-and-latches] All the locks released
Recording test results

Mime
View raw message