qpid-notifications mailing list archives

Site index · List index
Message view « Date » · « Thread »
Top « Date » · « Thread »
From Apache Jenkins Server <jenk...@builds.apache.org>
Subject Build failed in Jenkins: Qpid-Java-Cpp-Test #2090
Date Wed, 20 Aug 2014 19:54:48 GMT
See <https://builds.apache.org/job/Qpid-Java-Cpp-Test/2090/changes>

Changes:

[mcpierce] QPID-5893: Perl unit tests now find the utils module.

The module's not on the @INC path, and really shouldn't be since it's
only used by the tests. So now the tests programmatically update @INC to
include their directory as a part of the path, and find utils.pm.

Fixed the failing Message.t file as well, which includes tests for
methods that are deprecated.

[chug] QPID-6026: add server_reconnect example to WinSDK cmake solution generator

[fadams] QPID-6025: Java port of QpidConfig give NPE when listing queue/exchanges, added code
to agentdata Queue and Exchange to return empty Map to be consistent with C++ Broker and also
for good measure added some defensive code to QpidConfig.java

[fadams] QPID-6024: Update agentdata/Broker.java to reflect change in Java Broker Model Port
class that changed getAvailableProtocols to getProtocols

[rgodfrey] QPID-5996 : Applying patch from Robbie Gemmell

[robbie] QPID-6023: make the broker module depend on the 1.0 websocket plugin, thus adding
it to the brokers binary release assembly.

The license and notice files for the broker assembly already have relevant Jetty entries,
no change needed for the additional dependency.

[rgodfrey] QPID-6017 : Attempt 2 to skip tests that require strong encryption when strong
encryption is not available in the Java environment

[rgodfrey] QPID-6017 : Attempt to skip tests that require strong encryption when strong encryption
is not available in the Java environment

[aconway] QPID-6020: HA logging improvements - log prefix with status and ID.

Include broker status and ID in (almost) all logging messages.
Makes it much easier to track broker state and interactions.

Sundry other logging improvements including:
- Demote noisy messages to trace - connections from rgmanager status checks, searching for
primary.
- Rationalise start-up messages.
- Improved queue state detail replicating subscription and queue guard initialization.
- Fail to prepare TX is error.
- Collect all primary TX errors into one.
- Fix status of catchup brokers in primary membership for logging.
- Add process name/PID info to client connection messages.
- Various minor message tweaks.

[rgodfrey] QPID-6022 : [Java] Fix issues highlighted by code scanning tools

[gsim] QPID-6021: avoid waking up the io thread unnecessarily, improves receive rate a bit

[gsim] QPID-6021: increase initial credit granted to producers

[rgodfrey] QPID-6017 : [Java Broker] add tests for AESKeyFileEncrypterFactory

[kwall] QPID-6016: [Java Broker] Web UI error handling

Address review comments from Alex Rudyy <orudyy@apache.org>

[rgodfrey] QPID-6000 : [Java] Address review comments from Alex

[rgodfrey] QPID-6010 : [Java Broker] Remove unnecessary system properties for controlling
which AMQP protocols are made available

[rgodfrey] QPID-6018 : [Java Broker] Add an attribute to the ManagedObject annotation to signify
that the given object should not be registered in the meta-data registry

[rgodfrey] QPID-6017 : [Java Broker] add tests for AESKeyFileEncrypter

[rgodfrey] QPID-6017 : [Jaa Broker] Provide a mechanism by which "secure" attributes in the
configuration can be encrypted

[kwall] QPID-6016: [Java Broker] Improve Web Management Console error handling

[aconway] QPID-6015: HA Python QMF console raises exception due to HA subscriptions.

One of the arguments in a HA subscription (qpid.ha-ids) is binary encoded data,
however it was being passed as a string type in the arguments map.  This caused
python qmf console clients to choke when they tried to utf-decode the data.

Fix is to pass the data using the vbin32 type which is intended for binary data.

[rgodfrey] QPID-6014 : [Java] declare variables as ConcurrentMap not ConcurrentHashMap to
avoid linking issues after compiling under Java 8

[kwall] QPID-3978 : [Java Broker] Download severity of log message 'MessageRelease received
for message which has not been acquired' to debug

This message is now normal and will happen as a result of ttl or management action.

[kwall] QPID-5998: [Java Broker] Correct typo in HA operational log message.

------------------------------------------
[...truncated 17384 lines...]
[INFO] skip non existing resourceDirectory /x1/jenkins/jenkins-slave/workspace/Qpid-Java-Cpp-Test/trunk/qpid/java/perftests/visualisation-jfc/src/main/resources
[INFO] Copying 0 resource
[INFO] Copying 3 resources
[INFO] 
[INFO] --- maven-compiler-plugin:3.1:compile (default-compile) @ qpid-perftests-visualisation-jfc
---
[INFO] Changes detected - recompiling the module!
[INFO] Compiling 30 source files to /x1/jenkins/jenkins-slave/workspace/Qpid-Java-Cpp-Test/trunk/qpid/java/perftests/visualisation-jfc/target/classes
[INFO] 
[INFO] --- maven-resources-plugin:2.6:testResources (default-testResources) @ qpid-perftests-visualisation-jfc
---
[INFO] Using 'UTF-8' encoding to copy filtered resources.
[INFO] Copying 1 resource
[INFO] skip non existing resourceDirectory /x1/jenkins/jenkins-slave/workspace/Qpid-Java-Cpp-Test/trunk/qpid/java/perftests/visualisation-jfc/src/test/resources
[INFO] Copying 3 resources
[INFO] 
[INFO] --- maven-compiler-plugin:3.1:testCompile (default-testCompile) @ qpid-perftests-visualisation-jfc
---
[INFO] Changes detected - recompiling the module!
[INFO] Compiling 11 source files to /x1/jenkins/jenkins-slave/workspace/Qpid-Java-Cpp-Test/trunk/qpid/java/perftests/visualisation-jfc/target/test-classes
[INFO] 
[INFO] --- maven-surefire-plugin:2.16:test (default-test) @ qpid-perftests-visualisation-jfc
---
[INFO] Surefire report directory: /x1/jenkins/jenkins-slave/workspace/Qpid-Java-Cpp-Test/trunk/qpid/java/perftests/visualisation-jfc/target/surefire-reports

-------------------------------------------------------
 T E S T S
-------------------------------------------------------
Running org.apache.qpid.disttest.charting.seriesbuilder.SeriesRowTest
main 2014-08-20 19:54:39,914 INFO [qpid.test.utils.QpidTestCase] Some tests should be excluded,
building the exclude list
main 2014-08-20 19:54:39,915 INFO [qpid.test.utils.QpidTestCase] Specified exclude file does
not exist: /x1/jenkins/jenkins-slave/workspace/Qpid-Java-Cpp-Test/trunk/qpid/java/perftests/visualisation-jfc/../test-profiles//Excludes
main 2014-08-20 19:54:39,916 INFO [qpid.test.utils.QpidTestCase] Specified exclude file does
not exist: /x1/jenkins/jenkins-slave/workspace/Qpid-Java-Cpp-Test/trunk/qpid/java/perftests/visualisation-jfc/../test-profiles//CPPExcludes
main 2014-08-20 19:54:39,916 INFO [qpid.test.utils.QpidTestCase] Specified exclude file does
not exist: /x1/jenkins/jenkins-slave/workspace/Qpid-Java-Cpp-Test/trunk/qpid/java/perftests/visualisation-jfc/../test-profiles//cpp.excludes
main 2014-08-20 19:54:39,916 INFO [qpid.test.utils.QpidTestCase] Specified exclude file does
not exist: /x1/jenkins/jenkins-slave/workspace/Qpid-Java-Cpp-Test/trunk/qpid/java/perftests/visualisation-jfc/../test-profiles//CPPPrefetchExcludes
main 2014-08-20 19:54:39,916 INFO [qpid.test.utils.QpidTestCase] Specified exclude file does
not exist: /x1/jenkins/jenkins-slave/workspace/Qpid-Java-Cpp-Test/trunk/qpid/java/perftests/visualisation-jfc/../test-profiles//CPPTransientExcludes
main 2014-08-20 19:54:39,916 INFO [qpid.test.utils.QpidTestCase] Specified exclude file does
not exist: /x1/jenkins/jenkins-slave/workspace/Qpid-Java-Cpp-Test/trunk/qpid/java/perftests/visualisation-jfc/../test-profiles//cpp.excludes
main 2014-08-20 19:54:39,927 INFO [qpid.test.utils.QpidTestCase] ========== start SeriesRowTest.testValidSeriesRowThrowsExceptionIfArrayTooSmall
==========
main 2014-08-20 19:54:39,930 INFO [qpid.test.utils.QpidTestCase] ========== tearDown SeriesRowTest.testValidSeriesRowThrowsExceptionIfArrayTooSmall
==========
main 2014-08-20 19:54:39,931 INFO [qpid.test.utils.QpidTestCase] ========== start SeriesRowTest.testDimension
==========
main 2014-08-20 19:54:39,931 INFO [qpid.test.utils.QpidTestCase] ========== tearDown SeriesRowTest.testDimension
==========
main 2014-08-20 19:54:39,932 INFO [qpid.test.utils.QpidTestCase] ========== start SeriesRowTest.testDimensionAsDouble
==========
main 2014-08-20 19:54:39,932 INFO [qpid.test.utils.QpidTestCase] ========== tearDown SeriesRowTest.testDimensionAsDouble
==========
main 2014-08-20 19:54:39,933 INFO [qpid.test.utils.QpidTestCase] ========== start SeriesRowTest.testDimensionAsString
==========
main 2014-08-20 19:54:39,933 INFO [qpid.test.utils.QpidTestCase] ========== tearDown SeriesRowTest.testDimensionAsString
==========
main 2014-08-20 19:54:39,933 INFO [qpid.test.utils.QpidTestCase] ========== start SeriesRowTest.testValidSeriesRow
==========
main 2014-08-20 19:54:39,933 INFO [qpid.test.utils.QpidTestCase] ========== tearDown SeriesRowTest.testValidSeriesRow
==========
Tests run: 5, Failures: 0, Errors: 0, Skipped: 0, Time elapsed: 0.245 sec - in org.apache.qpid.disttest.charting.seriesbuilder.SeriesRowTest
Running org.apache.qpid.disttest.charting.seriesbuilder.JdbcSeriesBuilderTest
main 2014-08-20 19:54:40,250 INFO [qpid.test.utils.QpidTestCase] ========== start JdbcSeriesBuilderTest.testBuildOneSeries
==========
main 2014-08-20 19:54:40,354 INFO [disttest.charting.seriesbuilder.JdbcSeriesBuilder] Loaded
JDBC driver class org.relique.jdbc.csv.CsvDriver
main 2014-08-20 19:54:40,421 INFO [disttest.charting.seriesbuilder.JdbcSeriesBuilder] Created:
JdbcSeriesBuilder[jdbcUrlGenerator=JdbcUrlGenerator[providedJdbdUrl=<null>]]
main 2014-08-20 19:54:40,544 INFO [qpid.test.utils.QpidTestCase] ========== tearDown JdbcSeriesBuilderTest.testBuildOneSeries
==========
Tests run: 1, Failures: 0, Errors: 0, Skipped: 0, Time elapsed: 0.61 sec - in org.apache.qpid.disttest.charting.seriesbuilder.JdbcSeriesBuilderTest
Running org.apache.qpid.disttest.charting.seriesbuilder.JdbcUrlGeneratorTest
main 2014-08-20 19:54:40,545 INFO [qpid.test.utils.QpidTestCase] ========== start JdbcUrlGeneratorTest.testGetJdbcUrlWithoutProvidingAUrlReturnsCsvUrlWithCorrectDirectory
==========
main 2014-08-20 19:54:40,553 INFO [qpid.test.utils.QpidTestCase] ========== tearDown JdbcUrlGeneratorTest.testGetJdbcUrlWithoutProvidingAUrlReturnsCsvUrlWithCorrectDirectory
==========
main 2014-08-20 19:54:40,554 INFO [qpid.test.utils.QpidTestCase] ========== start JdbcUrlGeneratorTest.testGetJdbcUrlThrowsExceptionWithoutAProvidedUrlOrSeriesDirectory
==========
main 2014-08-20 19:54:40,555 INFO [qpid.test.utils.QpidTestCase] ========== tearDown JdbcUrlGeneratorTest.testGetJdbcUrlThrowsExceptionWithoutAProvidedUrlOrSeriesDirectory
==========
main 2014-08-20 19:54:40,555 INFO [qpid.test.utils.QpidTestCase] ========== start JdbcUrlGeneratorTest.testGetJdbcUrlThrowsExceptionIfUrlProvidedAndSeriesDirectorySpecified
==========
main 2014-08-20 19:54:40,555 INFO [qpid.test.utils.QpidTestCase] ========== tearDown JdbcUrlGeneratorTest.testGetJdbcUrlThrowsExceptionIfUrlProvidedAndSeriesDirectorySpecified
==========
main 2014-08-20 19:54:40,556 INFO [qpid.test.utils.QpidTestCase] ========== start JdbcUrlGeneratorTest.testGetJdbcUrlReturnsProvidedUrl
==========
main 2014-08-20 19:54:40,556 INFO [qpid.test.utils.QpidTestCase] ========== tearDown JdbcUrlGeneratorTest.testGetJdbcUrlReturnsProvidedUrl
==========
Tests run: 4, Failures: 0, Errors: 0, Skipped: 0, Time elapsed: 0.011 sec - in org.apache.qpid.disttest.charting.seriesbuilder.JdbcUrlGeneratorTest
Running org.apache.qpid.disttest.charting.chartbuilder.ColorFactoryTest
main 2014-08-20 19:54:40,557 INFO [qpid.test.utils.QpidTestCase] ========== start ColorFactoryTest.testDarkBlue
==========
main 2014-08-20 19:54:40,562 INFO [qpid.test.utils.QpidTestCase] ========== tearDown ColorFactoryTest.testDarkBlue
==========
main 2014-08-20 19:54:40,562 INFO [qpid.test.utils.QpidTestCase] ========== start ColorFactoryTest.testBlue
==========
main 2014-08-20 19:54:40,562 INFO [qpid.test.utils.QpidTestCase] ========== tearDown ColorFactoryTest.testBlue
==========
Tests run: 2, Failures: 0, Errors: 0, Skipped: 0, Time elapsed: 0.005 sec - in org.apache.qpid.disttest.charting.chartbuilder.ColorFactoryTest
Running org.apache.qpid.disttest.charting.chartbuilder.BaseChartBuilderTest
main 2014-08-20 19:54:40,673 INFO [qpid.test.utils.QpidTestCase] ========== start BaseChartBuilderTest.testBuildChart
==========
main 2014-08-20 19:54:41,174 INFO [qpid.test.utils.QpidTestCase] ========== tearDown BaseChartBuilderTest.testBuildChart
==========
Tests run: 1, Failures: 0, Errors: 0, Skipped: 0, Time elapsed: 0.612 sec - in org.apache.qpid.disttest.charting.chartbuilder.BaseChartBuilderTest
Running org.apache.qpid.disttest.charting.chartbuilder.ChartBuilderFactoryTest
main 2014-08-20 19:54:41,176 INFO [qpid.test.utils.QpidTestCase] ========== start ChartBuilderFactoryTest.testXYLineChart
==========
main 2014-08-20 19:54:41,179 INFO [qpid.test.utils.QpidTestCase] ========== tearDown ChartBuilderFactoryTest.testXYLineChart
==========
main 2014-08-20 19:54:41,179 INFO [qpid.test.utils.QpidTestCase] ========== start ChartBuilderFactoryTest.testLineChart
==========
main 2014-08-20 19:54:41,181 INFO [qpid.test.utils.QpidTestCase] ========== tearDown ChartBuilderFactoryTest.testLineChart
==========
main 2014-08-20 19:54:41,181 INFO [qpid.test.utils.QpidTestCase] ========== start ChartBuilderFactoryTest.testBarChart
==========
main 2014-08-20 19:54:41,182 INFO [qpid.test.utils.QpidTestCase] ========== tearDown ChartBuilderFactoryTest.testBarChart
==========
main 2014-08-20 19:54:41,182 INFO [qpid.test.utils.QpidTestCase] ========== start ChartBuilderFactoryTest.testTimeSeriesLineChart
==========
main 2014-08-20 19:54:41,182 INFO [qpid.test.utils.QpidTestCase] ========== tearDown ChartBuilderFactoryTest.testTimeSeriesLineChart
==========
main 2014-08-20 19:54:41,183 INFO [qpid.test.utils.QpidTestCase] ========== start ChartBuilderFactoryTest.testLineChart3D
==========
main 2014-08-20 19:54:41,183 INFO [qpid.test.utils.QpidTestCase] ========== tearDown ChartBuilderFactoryTest.testLineChart3D
==========
main 2014-08-20 19:54:41,184 INFO [qpid.test.utils.QpidTestCase] ========== start ChartBuilderFactoryTest.testBarChart3D
==========
main 2014-08-20 19:54:41,184 INFO [qpid.test.utils.QpidTestCase] ========== tearDown ChartBuilderFactoryTest.testBarChart3D
==========
Tests run: 6, Failures: 0, Errors: 0, Skipped: 0, Time elapsed: 0.009 sec - in org.apache.qpid.disttest.charting.chartbuilder.ChartBuilderFactoryTest
Running org.apache.qpid.disttest.charting.chartbuilder.TimeSeriesBuilderCallbackTest
main 2014-08-20 19:54:41,186 INFO [qpid.test.utils.QpidTestCase] ========== start TimeSeriesBuilderCallbackTest.testAddPointToSeries
==========
main 2014-08-20 19:54:41,285 INFO [qpid.test.utils.QpidTestCase] ========== tearDown TimeSeriesBuilderCallbackTest.testAddPointToSeries
==========
Tests run: 1, Failures: 0, Errors: 0, Skipped: 0, Time elapsed: 0.1 sec - in org.apache.qpid.disttest.charting.chartbuilder.TimeSeriesBuilderCallbackTest
Running org.apache.qpid.disttest.charting.chartbuilder.ChartProductionTest
main 2014-08-20 19:54:41,291 INFO [qpid.test.utils.QpidTestCase] ========== start ChartProductionTest.testLine3DChart
==========
main 2014-08-20 19:54:41,297 INFO [disttest.charting.writer.ChartWriter] Set chart directory:
/tmp/charts-1408564481294
main 2014-08-20 19:54:42,635 INFO [disttest.charting.writer.ChartWriter] Written /tmp/charts-1408564481294/testLine3DChart.png
chart
main 2014-08-20 19:54:42,636 INFO [qpid.test.utils.QpidTestCase] ========== tearDown ChartProductionTest.testLine3DChart
==========
main 2014-08-20 19:54:42,636 INFO [qpid.test.utils.QpidTestCase] ========== start ChartProductionTest.testXYLineChart
==========
main 2014-08-20 19:54:42,637 INFO [disttest.charting.writer.ChartWriter] Set chart directory:
/tmp/charts-1408564482636
main 2014-08-20 19:54:42,733 INFO [disttest.charting.writer.ChartWriter] Written /tmp/charts-1408564482636/testXYLineChart.png
chart
main 2014-08-20 19:54:42,733 INFO [qpid.test.utils.QpidTestCase] ========== tearDown ChartProductionTest.testXYLineChart
==========
main 2014-08-20 19:54:42,733 INFO [qpid.test.utils.QpidTestCase] ========== start ChartProductionTest.testStatisticalBarChart
==========
main 2014-08-20 19:54:42,734 INFO [disttest.charting.writer.ChartWriter] Set chart directory:
/tmp/charts-1408564482734
main 2014-08-20 19:54:42,805 INFO [disttest.charting.writer.ChartWriter] Written /tmp/charts-1408564482734/testStatisticalBarChart.png
chart
main 2014-08-20 19:54:42,805 INFO [qpid.test.utils.QpidTestCase] ========== tearDown ChartProductionTest.testStatisticalBarChart
==========
main 2014-08-20 19:54:42,805 INFO [qpid.test.utils.QpidTestCase] ========== start ChartProductionTest.testLineChart
==========
main 2014-08-20 19:54:42,806 INFO [disttest.charting.writer.ChartWriter] Set chart directory:
/tmp/charts-1408564482806
main 2014-08-20 19:54:42,865 INFO [disttest.charting.writer.ChartWriter] Written /tmp/charts-1408564482806/testLineChart.png
chart
main 2014-08-20 19:54:42,865 INFO [qpid.test.utils.QpidTestCase] ========== tearDown ChartProductionTest.testLineChart
==========
main 2014-08-20 19:54:42,865 INFO [qpid.test.utils.QpidTestCase] ========== start ChartProductionTest.testBarChart
==========
main 2014-08-20 19:54:42,866 INFO [disttest.charting.writer.ChartWriter] Set chart directory:
/tmp/charts-1408564482866
main 2014-08-20 19:54:42,926 INFO [disttest.charting.writer.ChartWriter] Written /tmp/charts-1408564482866/testBarChart.png
chart
main 2014-08-20 19:54:42,926 INFO [qpid.test.utils.QpidTestCase] ========== tearDown ChartProductionTest.testBarChart
==========
main 2014-08-20 19:54:42,926 INFO [qpid.test.utils.QpidTestCase] ========== start ChartProductionTest.testBar3DChart
==========
main 2014-08-20 19:54:42,927 INFO [disttest.charting.writer.ChartWriter] Set chart directory:
/tmp/charts-1408564482927
main 2014-08-20 19:54:42,985 INFO [disttest.charting.writer.ChartWriter] Written /tmp/charts-1408564482927/testBar3DChart.png
chart
main 2014-08-20 19:54:42,985 INFO [qpid.test.utils.QpidTestCase] ========== tearDown ChartProductionTest.testBar3DChart
==========
main 2014-08-20 19:54:42,985 INFO [qpid.test.utils.QpidTestCase] ========== start ChartProductionTest.testTimeSeriesLineChart
==========
main 2014-08-20 19:54:42,986 INFO [disttest.charting.writer.ChartWriter] Set chart directory:
/tmp/charts-1408564482986
main 2014-08-20 19:54:43,058 INFO [disttest.charting.writer.ChartWriter] Written /tmp/charts-1408564482986/testTimeSeriesLineChart.png
chart
main 2014-08-20 19:54:43,058 INFO [qpid.test.utils.QpidTestCase] ========== tearDown ChartProductionTest.testTimeSeriesLineChart
==========
main 2014-08-20 19:54:43,058 INFO [qpid.test.utils.QpidTestCase] ========== start ChartProductionTest.testXYLineChartWithColourAndWidth
==========
main 2014-08-20 19:54:43,059 INFO [disttest.charting.writer.ChartWriter] Set chart directory:
/tmp/charts-1408564483059
main 2014-08-20 19:54:43,126 INFO [disttest.charting.writer.ChartWriter] Written /tmp/charts-1408564483059/testXYLineChartWithColourAndWidth.png
chart
main 2014-08-20 19:54:43,126 INFO [qpid.test.utils.QpidTestCase] ========== tearDown ChartProductionTest.testXYLineChartWithColourAndWidth
==========
Tests run: 8, Failures: 0, Errors: 0, Skipped: 0, Time elapsed: 1.841 sec - in org.apache.qpid.disttest.charting.chartbuilder.ChartProductionTest
Running org.apache.qpid.disttest.charting.definition.SeriesDefinitionCreatorTest
main 2014-08-20 19:54:43,129 INFO [qpid.test.utils.QpidTestCase] ========== start SeriesDefinitionCreatorTest.testSeriesDirectoryAndNameSubstitution
==========
main 2014-08-20 19:54:43,129 INFO [qpid.test.utils.QpidTestCase] Set system property "SeriesDefinitionProp"
to: "propValue"
main 2014-08-20 19:54:43,135 INFO [qpid.test.utils.QpidTestCase] ========== tearDown SeriesDefinitionCreatorTest.testSeriesDirectoryAndNameSubstitution
==========
main 2014-08-20 19:54:43,136 DEBUG [qpid.test.utils.QpidTestCase] reverting 1 test properties
main 2014-08-20 19:54:43,136 INFO [qpid.test.utils.QpidTestCase] ========== start SeriesDefinitionCreatorTest.testTwoSeriesDefinitions
==========
main 2014-08-20 19:54:43,137 INFO [qpid.test.utils.QpidTestCase] ========== tearDown SeriesDefinitionCreatorTest.testTwoSeriesDefinitions
==========
main 2014-08-20 19:54:43,137 INFO [qpid.test.utils.QpidTestCase] ========== start SeriesDefinitionCreatorTest.testOneSeriesDefinition
==========
main 2014-08-20 19:54:43,137 INFO [qpid.test.utils.QpidTestCase] ========== tearDown SeriesDefinitionCreatorTest.testOneSeriesDefinition
==========
main 2014-08-20 19:54:43,138 INFO [qpid.test.utils.QpidTestCase] ========== start SeriesDefinitionCreatorTest.testNonSequentialSeriesDefinitionsIgnored
==========
main 2014-08-20 19:54:43,138 INFO [qpid.test.utils.QpidTestCase] ========== tearDown SeriesDefinitionCreatorTest.testNonSequentialSeriesDefinitionsIgnored
==========
Tests run: 4, Failures: 0, Errors: 0, Skipped: 0, Time elapsed: 0.012 sec - in org.apache.qpid.disttest.charting.definition.SeriesDefinitionCreatorTest
Running org.apache.qpid.disttest.charting.definition.ChartingDefinitionCreatorTest
main 2014-08-20 19:54:43,141 INFO [qpid.test.utils.QpidTestCase] ========== start ChartingDefinitionCreatorTest.testLoadTwoDefinitionsFromDirectory
==========
main 2014-08-20 19:54:43,146 INFO [qpid.test.utils.QpidTestCase] ========== tearDown ChartingDefinitionCreatorTest.testLoadTwoDefinitionsFromDirectory
==========
main 2014-08-20 19:54:43,147 INFO [qpid.test.utils.QpidTestCase] ========== start ChartingDefinitionCreatorTest.testLoadOneDefinitionFromFile
==========
main 2014-08-20 19:54:43,148 INFO [qpid.test.utils.QpidTestCase] ========== tearDown ChartingDefinitionCreatorTest.testLoadOneDefinitionFromFile
==========
main 2014-08-20 19:54:43,148 INFO [qpid.test.utils.QpidTestCase] ========== start ChartingDefinitionCreatorTest.testDefinitionsProperties
==========
main 2014-08-20 19:54:43,148 INFO [qpid.test.utils.QpidTestCase] Set system property "ChartingDefinitionSysProp"
to: "propValue"
main 2014-08-20 19:54:43,149 INFO [qpid.test.utils.QpidTestCase] ========== tearDown ChartingDefinitionCreatorTest.testDefinitionsProperties
==========
main 2014-08-20 19:54:43,149 DEBUG [qpid.test.utils.QpidTestCase] reverting 1 test properties
main 2014-08-20 19:54:43,150 INFO [qpid.test.utils.QpidTestCase] ========== start ChartingDefinitionCreatorTest.testDefinitionFileNotFound
==========
main 2014-08-20 19:54:43,150 INFO [qpid.test.utils.QpidTestCase] ========== tearDown ChartingDefinitionCreatorTest.testDefinitionFileNotFound
==========
Tests run: 4, Failures: 0, Errors: 0, Skipped: 0, Time elapsed: 0.011 sec - in org.apache.qpid.disttest.charting.definition.ChartingDefinitionCreatorTest
Running org.apache.qpid.disttest.charting.writer.ChartWriterTest
main 2014-08-20 19:54:43,184 INFO [disttest.charting.writer.ChartWriter] Set chart directory:
/tmp/TestFileUtils-testDir-1408564483184
main 2014-08-20 19:54:43,242 INFO [disttest.charting.writer.ChartWriter] Written /tmp/TestFileUtils-testDir-1408564483184/chart1.png
chart
main 2014-08-20 19:54:43,242 INFO [disttest.charting.writer.ChartWriter] Only 1 chart image(s)
have been written so no HTML summary file will be produced
main 2014-08-20 19:54:43,242 INFO [qpid.test.utils.QpidTestCase] ========== tearDown null
==========
main 2014-08-20 19:54:43,243 INFO [disttest.charting.writer.ChartWriter] Set chart directory:
/tmp/TestFileUtils-testDir-1408564483243
main 2014-08-20 19:54:43,296 INFO [disttest.charting.writer.ChartWriter] Written /tmp/TestFileUtils-testDir-1408564483243/chart1.png
chart
main 2014-08-20 19:54:43,296 INFO [qpid.test.utils.QpidTestCase] ========== tearDown null
==========
main 2014-08-20 19:54:43,297 INFO [disttest.charting.writer.ChartWriter] Set chart directory:
/tmp/TestFileUtils-testDir-1408564483297
main 2014-08-20 19:54:43,347 INFO [disttest.charting.writer.ChartWriter] Written /tmp/TestFileUtils-testDir-1408564483297/chart2.png
chart
main 2014-08-20 19:54:43,397 INFO [disttest.charting.writer.ChartWriter] Written /tmp/TestFileUtils-testDir-1408564483297/chart1.png
chart
main 2014-08-20 19:54:43,397 DEBUG [disttest.charting.writer.ChartWriter] About to produce
HTML summary file /tmp/TestFileUtils-testDir-1408564483297/chart-summary.html from charts
{/tmp/TestFileUtils-testDir-1408564483297/chart1.png=Mock for ChartingDefinition, hashCode:
26019857, /tmp/TestFileUtils-testDir-1408564483297/chart2.png=Mock for ChartingDefinition,
hashCode: 831637}
main 2014-08-20 19:54:43,405 INFO [qpid.test.utils.QpidTestCase] ========== tearDown null
==========
Tests run: 3, Failures: 0, Errors: 0, Skipped: 0, Time elapsed: 0.254 sec - in org.apache.qpid.disttest.charting.writer.ChartWriterTest

Results :

Tests run: 39, Failures: 0, Errors: 0, Skipped: 0

[INFO] 
[INFO] --- maven-jar-plugin:2.4:jar (default-jar) @ qpid-perftests-visualisation-jfc ---
[INFO] Building jar: /x1/jenkins/jenkins-slave/workspace/Qpid-Java-Cpp-Test/trunk/qpid/java/perftests/visualisation-jfc/target/qpid-perftests-visualisation-jfc-0.32-SNAPSHOT.jar
[INFO] 
[INFO] --- maven-site-plugin:3.3:attach-descriptor (attach-descriptor) @ qpid-perftests-visualisation-jfc
---
[INFO] 
[INFO] --- maven-antrun-plugin:1.7:run (create-qbtc-output-dir) @ qpid-perftests-visualisation-jfc
---
[INFO] Executing tasks

main:
    [mkdir] Created dir: /x1/jenkins/jenkins-slave/workspace/Qpid-Java-Cpp-Test/trunk/qpid/java/perftests/visualisation-jfc/target/qbtc-output
[INFO] Executed tasks
[INFO]                                                                         
[INFO] ------------------------------------------------------------------------
[INFO] Skipping Qpid BDB Store System Tests
[INFO] This project has been banned from the build due to previous failures.
[INFO] ------------------------------------------------------------------------
[INFO] ------------------------------------------------------------------------
[INFO] Reactor Summary:
[INFO] 
[INFO] Qpid Java Build ................................... SUCCESS [2.785s]
[INFO] Qpid AMQP 1.0 Common .............................. SUCCESS [4.162s]
[INFO] Qpid AMQP 1.0 Client .............................. SUCCESS [0.739s]
[INFO] Qpid AMQP 1.0 Client JMS .......................... SUCCESS [1.240s]
[INFO] Qpid AMQP 1.0 JMS Client Examples ................. SUCCESS [0.166s]
[INFO] Qpid AMQP 1.0 Client WebSocket .................... SUCCESS [0.703s]
[INFO] Qpid Broker Code Generation ....................... SUCCESS [0.338s]
[INFO] Qpid Test Utilities ............................... SUCCESS [0.474s]
[INFO] Qpid Common ....................................... SUCCESS [24.932s]
[INFO] Qpid Management Common ............................ SUCCESS [1.098s]
[INFO] Qpid Java Broker Core ............................. SUCCESS [1:15.287s]
[INFO] Qpid Access Control Broker Plug-in ................ SUCCESS [3.622s]
[INFO] Qpid AMQP 0-8 Protocol Broker Plug-in ............. SUCCESS [19.804s]
[INFO] Qpid AMQP 0-10 Protocol Plug-in ................... SUCCESS [3.549s]
[INFO] Qpid AMQP 1-0 Protocol Broker Plug-in ............. SUCCESS [0.396s]
[INFO] Qpid AMQP 0-8 to 0-10 Message Conversion Broker Plug-in  SUCCESS [0.285s]
[INFO] Qpid AMQP 0-8 to 1-0 Message Conversion Broker Plug-in  SUCCESS [0.326s]
[INFO] Qpid AMQP 0-10 to 1-0 Message Conversion Broker Plug-in  SUCCESS [0.183s]
[INFO] Qpid Derby Message Store .......................... SUCCESS [1:34.950s]
[INFO] Qpid JDBC Message Store Connection Pooling Plug-in  SUCCESS [0.526s]
[INFO] Qpid JDBC Message Store Broker Plug-in ............ SUCCESS [7.151s]
[INFO] Qpid HTTP Management Broker Plug-in ............... SUCCESS [4.335s]
[INFO] Qpid JMX Management Broker Plug-in ................ SUCCESS [2.742s]
[INFO] Qpid Memory Message Store Broker Plug-in .......... SUCCESS [0.313s]
[INFO] Qpid WebSocket Broker Plug-in ..................... SUCCESS [0.202s]
[INFO] Qpid AMQP 0-x JMS Client .......................... SUCCESS [6.567s]
[INFO] Qpid BDB Message Store ............................ SUCCESS [2:03.124s]
[INFO] Qpid BDB Message Store JMX ........................ SUCCESS [1.579s]
[INFO] Qpid Java Broker .................................. SUCCESS [4.060s]
[INFO] Qpid AMQP Management Protocol Broker Plug-in ...... SUCCESS [0.264s]
[INFO] Qpid AMQP 0-x JMS Client Examples ................. SUCCESS [0.133s]
[INFO] Qpid JCA .......................................... SUCCESS [1.557s]
[INFO] Qpid Resource Adaptor ............................. SUCCESS [0.451s]
[INFO] Qpid Tools ........................................ SUCCESS [0.275s]
[INFO] Qpid Management Examples .......................... SUCCESS [0.159s]
[INFO] Qpid Java System Test Parent ...................... SUCCESS [0.930s]
[INFO] Qpid System Tests ................................. FAILURE [5:47.698s]
[INFO] Qpid Performance Tests ............................ SUCCESS [14.796s]
[INFO] Qpid Performance Test System Tests ................ SKIPPED
[INFO] Qpid Performance Tests Visualisation JFC .......... SUCCESS [6.481s]
[INFO] Qpid BDB Store System Tests ....................... SKIPPED
[INFO] ------------------------------------------------------------------------
[INFO] BUILD FAILURE
[INFO] ------------------------------------------------------------------------
[INFO] Total time: 12:39.349s
[INFO] Finished at: Wed Aug 20 19:54:43 UTC 2014
[INFO] Final Memory: 69M/366M
[INFO] ------------------------------------------------------------------------
[ERROR] Failed to execute goal org.apache.maven.plugins:maven-surefire-plugin:2.16:test (integration-test)
on project qpid-systests: There are test failures.
[ERROR] 
[ERROR] Please refer to /x1/jenkins/jenkins-slave/workspace/Qpid-Java-Cpp-Test/trunk/qpid/java/systests/target/surefire-reports
for the individual test results.
[ERROR] -> [Help 1]
[ERROR] 
[ERROR] To see the full stack trace of the errors, re-run Maven with the -e switch.
[ERROR] Re-run Maven using the -X switch to enable full debug logging.
[ERROR] 
[ERROR] For more information about the errors and possible solutions, please read the following
articles:
[ERROR] [Help 1] http://cwiki.apache.org/confluence/display/MAVEN/MojoFailureException
[ERROR] 
[ERROR] After correcting the problems, you can resume the build with the command
[ERROR]   mvn <goals> -rf :qpid-systests
Build step 'Invoke top-level Maven targets' marked build as failure
[locks-and-latches] Releasing all the locks
[locks-and-latches] All the locks released
Recording test results

Mime
View raw message