qpid-notifications mailing list archives

Site index · List index
Message view « Date » · « Thread »
Top « Date » · « Thread »
From Apache Jenkins Server <jenk...@builds.apache.org>
Subject Build failed in Jenkins: Qpid-Java-Cpp-Test #2080
Date Sat, 16 Aug 2014 15:50:04 GMT
See <https://builds.apache.org/job/Qpid-Java-Cpp-Test/2080/changes>

Changes:

[rgodfrey] QPID-6000 : [Java Broker] [Java Client] add the ability to configure automatic
message compression

[kwall] QPID-6006: [Java Broker] UI to expose attribute defaults during create and edit workflows

* Metadata service now used to discover the attributes for each category instance type.
* Create/edit dialogues now have promptMessages to provide a fuller description of the field's
purpose
* If the attribute has a default, the default is interpolated into the promptMessage in a
standard way.

------------------------------------------
[...truncated 17410 lines...]
[INFO] skip non existing resourceDirectory /x1/jenkins/jenkins-slave/workspace/Qpid-Java-Cpp-Test/trunk/qpid/java/perftests/visualisation-jfc/src/main/resources
[INFO] Copying 0 resource
[INFO] Copying 3 resources
[INFO] 
[INFO] --- maven-compiler-plugin:3.1:compile (default-compile) @ qpid-perftests-visualisation-jfc
---
[INFO] Changes detected - recompiling the module!
[INFO] Compiling 30 source files to /x1/jenkins/jenkins-slave/workspace/Qpid-Java-Cpp-Test/trunk/qpid/java/perftests/visualisation-jfc/target/classes
[INFO] 
[INFO] --- maven-resources-plugin:2.6:testResources (default-testResources) @ qpid-perftests-visualisation-jfc
---
[INFO] Using 'UTF-8' encoding to copy filtered resources.
[INFO] Copying 1 resource
[INFO] skip non existing resourceDirectory /x1/jenkins/jenkins-slave/workspace/Qpid-Java-Cpp-Test/trunk/qpid/java/perftests/visualisation-jfc/src/test/resources
[INFO] Copying 3 resources
[INFO] 
[INFO] --- maven-compiler-plugin:3.1:testCompile (default-testCompile) @ qpid-perftests-visualisation-jfc
---
[INFO] Changes detected - recompiling the module!
[INFO] Compiling 11 source files to /x1/jenkins/jenkins-slave/workspace/Qpid-Java-Cpp-Test/trunk/qpid/java/perftests/visualisation-jfc/target/test-classes
[INFO] 
[INFO] --- maven-surefire-plugin:2.16:test (default-test) @ qpid-perftests-visualisation-jfc
---
[INFO] Surefire report directory: /x1/jenkins/jenkins-slave/workspace/Qpid-Java-Cpp-Test/trunk/qpid/java/perftests/visualisation-jfc/target/surefire-reports

-------------------------------------------------------
 T E S T S
-------------------------------------------------------
Running org.apache.qpid.disttest.charting.seriesbuilder.SeriesRowTest
main 2014-08-16 15:49:52,884 INFO [qpid.test.utils.QpidTestCase] Some tests should be excluded,
building the exclude list
main 2014-08-16 15:49:52,886 INFO [qpid.test.utils.QpidTestCase] Specified exclude file does
not exist: /x1/jenkins/jenkins-slave/workspace/Qpid-Java-Cpp-Test/trunk/qpid/java/perftests/visualisation-jfc/../test-profiles//Excludes
main 2014-08-16 15:49:52,886 INFO [qpid.test.utils.QpidTestCase] Specified exclude file does
not exist: /x1/jenkins/jenkins-slave/workspace/Qpid-Java-Cpp-Test/trunk/qpid/java/perftests/visualisation-jfc/../test-profiles//CPPExcludes
main 2014-08-16 15:49:52,886 INFO [qpid.test.utils.QpidTestCase] Specified exclude file does
not exist: /x1/jenkins/jenkins-slave/workspace/Qpid-Java-Cpp-Test/trunk/qpid/java/perftests/visualisation-jfc/../test-profiles//cpp.excludes
main 2014-08-16 15:49:52,886 INFO [qpid.test.utils.QpidTestCase] Specified exclude file does
not exist: /x1/jenkins/jenkins-slave/workspace/Qpid-Java-Cpp-Test/trunk/qpid/java/perftests/visualisation-jfc/../test-profiles//CPPPrefetchExcludes
main 2014-08-16 15:49:52,886 INFO [qpid.test.utils.QpidTestCase] Specified exclude file does
not exist: /x1/jenkins/jenkins-slave/workspace/Qpid-Java-Cpp-Test/trunk/qpid/java/perftests/visualisation-jfc/../test-profiles//CPPTransientExcludes
main 2014-08-16 15:49:52,886 INFO [qpid.test.utils.QpidTestCase] Specified exclude file does
not exist: /x1/jenkins/jenkins-slave/workspace/Qpid-Java-Cpp-Test/trunk/qpid/java/perftests/visualisation-jfc/../test-profiles//cpp.excludes
main 2014-08-16 15:49:52,893 INFO [qpid.test.utils.QpidTestCase] ========== start SeriesRowTest.testValidSeriesRowThrowsExceptionIfArrayTooSmall
==========
main 2014-08-16 15:49:52,894 INFO [qpid.test.utils.QpidTestCase] ========== tearDown SeriesRowTest.testValidSeriesRowThrowsExceptionIfArrayTooSmall
==========
main 2014-08-16 15:49:52,895 INFO [qpid.test.utils.QpidTestCase] ========== start SeriesRowTest.testDimension
==========
main 2014-08-16 15:49:52,895 INFO [qpid.test.utils.QpidTestCase] ========== tearDown SeriesRowTest.testDimension
==========
main 2014-08-16 15:49:52,896 INFO [qpid.test.utils.QpidTestCase] ========== start SeriesRowTest.testDimensionAsDouble
==========
main 2014-08-16 15:49:52,897 INFO [qpid.test.utils.QpidTestCase] ========== tearDown SeriesRowTest.testDimensionAsDouble
==========
main 2014-08-16 15:49:52,897 INFO [qpid.test.utils.QpidTestCase] ========== start SeriesRowTest.testDimensionAsString
==========
main 2014-08-16 15:49:52,897 INFO [qpid.test.utils.QpidTestCase] ========== tearDown SeriesRowTest.testDimensionAsString
==========
main 2014-08-16 15:49:52,898 INFO [qpid.test.utils.QpidTestCase] ========== start SeriesRowTest.testValidSeriesRow
==========
main 2014-08-16 15:49:52,898 INFO [qpid.test.utils.QpidTestCase] ========== tearDown SeriesRowTest.testValidSeriesRow
==========
Tests run: 5, Failures: 0, Errors: 0, Skipped: 0, Time elapsed: 0.141 sec - in org.apache.qpid.disttest.charting.seriesbuilder.SeriesRowTest
Running org.apache.qpid.disttest.charting.seriesbuilder.JdbcSeriesBuilderTest
main 2014-08-16 15:49:53,038 INFO [qpid.test.utils.QpidTestCase] ========== start JdbcSeriesBuilderTest.testBuildOneSeries
==========
main 2014-08-16 15:49:53,092 INFO [disttest.charting.seriesbuilder.JdbcSeriesBuilder] Loaded
JDBC driver class org.relique.jdbc.csv.CsvDriver
main 2014-08-16 15:49:53,110 INFO [disttest.charting.seriesbuilder.JdbcSeriesBuilder] Created:
JdbcSeriesBuilder[jdbcUrlGenerator=JdbcUrlGenerator[providedJdbdUrl=<null>]]
main 2014-08-16 15:49:53,162 INFO [qpid.test.utils.QpidTestCase] ========== tearDown JdbcSeriesBuilderTest.testBuildOneSeries
==========
Tests run: 1, Failures: 0, Errors: 0, Skipped: 0, Time elapsed: 0.264 sec - in org.apache.qpid.disttest.charting.seriesbuilder.JdbcSeriesBuilderTest
Running org.apache.qpid.disttest.charting.seriesbuilder.JdbcUrlGeneratorTest
main 2014-08-16 15:49:53,164 INFO [qpid.test.utils.QpidTestCase] ========== start JdbcUrlGeneratorTest.testGetJdbcUrlWithoutProvidingAUrlReturnsCsvUrlWithCorrectDirectory
==========
main 2014-08-16 15:49:53,169 INFO [qpid.test.utils.QpidTestCase] ========== tearDown JdbcUrlGeneratorTest.testGetJdbcUrlWithoutProvidingAUrlReturnsCsvUrlWithCorrectDirectory
==========
main 2014-08-16 15:49:53,170 INFO [qpid.test.utils.QpidTestCase] ========== start JdbcUrlGeneratorTest.testGetJdbcUrlThrowsExceptionWithoutAProvidedUrlOrSeriesDirectory
==========
main 2014-08-16 15:49:53,171 INFO [qpid.test.utils.QpidTestCase] ========== tearDown JdbcUrlGeneratorTest.testGetJdbcUrlThrowsExceptionWithoutAProvidedUrlOrSeriesDirectory
==========
main 2014-08-16 15:49:53,171 INFO [qpid.test.utils.QpidTestCase] ========== start JdbcUrlGeneratorTest.testGetJdbcUrlThrowsExceptionIfUrlProvidedAndSeriesDirectorySpecified
==========
main 2014-08-16 15:49:53,172 INFO [qpid.test.utils.QpidTestCase] ========== tearDown JdbcUrlGeneratorTest.testGetJdbcUrlThrowsExceptionIfUrlProvidedAndSeriesDirectorySpecified
==========
main 2014-08-16 15:49:53,172 INFO [qpid.test.utils.QpidTestCase] ========== start JdbcUrlGeneratorTest.testGetJdbcUrlReturnsProvidedUrl
==========
main 2014-08-16 15:49:53,172 INFO [qpid.test.utils.QpidTestCase] ========== tearDown JdbcUrlGeneratorTest.testGetJdbcUrlReturnsProvidedUrl
==========
Tests run: 4, Failures: 0, Errors: 0, Skipped: 0, Time elapsed: 0.01 sec - in org.apache.qpid.disttest.charting.seriesbuilder.JdbcUrlGeneratorTest
Running org.apache.qpid.disttest.charting.chartbuilder.ColorFactoryTest
main 2014-08-16 15:49:53,174 INFO [qpid.test.utils.QpidTestCase] ========== start ColorFactoryTest.testDarkBlue
==========
main 2014-08-16 15:49:53,178 INFO [qpid.test.utils.QpidTestCase] ========== tearDown ColorFactoryTest.testDarkBlue
==========
main 2014-08-16 15:49:53,178 INFO [qpid.test.utils.QpidTestCase] ========== start ColorFactoryTest.testBlue
==========
main 2014-08-16 15:49:53,178 INFO [qpid.test.utils.QpidTestCase] ========== tearDown ColorFactoryTest.testBlue
==========
Tests run: 2, Failures: 0, Errors: 0, Skipped: 0, Time elapsed: 0.006 sec - in org.apache.qpid.disttest.charting.chartbuilder.ColorFactoryTest
Running org.apache.qpid.disttest.charting.chartbuilder.BaseChartBuilderTest
main 2014-08-16 15:49:53,326 INFO [qpid.test.utils.QpidTestCase] ========== start BaseChartBuilderTest.testBuildChart
==========
main 2014-08-16 15:49:53,738 INFO [qpid.test.utils.QpidTestCase] ========== tearDown BaseChartBuilderTest.testBuildChart
==========
Tests run: 1, Failures: 0, Errors: 0, Skipped: 0, Time elapsed: 0.56 sec - in org.apache.qpid.disttest.charting.chartbuilder.BaseChartBuilderTest
Running org.apache.qpid.disttest.charting.chartbuilder.ChartBuilderFactoryTest
main 2014-08-16 15:49:53,740 INFO [qpid.test.utils.QpidTestCase] ========== start ChartBuilderFactoryTest.testXYLineChart
==========
main 2014-08-16 15:49:53,742 INFO [qpid.test.utils.QpidTestCase] ========== tearDown ChartBuilderFactoryTest.testXYLineChart
==========
main 2014-08-16 15:49:53,742 INFO [qpid.test.utils.QpidTestCase] ========== start ChartBuilderFactoryTest.testLineChart
==========
main 2014-08-16 15:49:53,743 INFO [qpid.test.utils.QpidTestCase] ========== tearDown ChartBuilderFactoryTest.testLineChart
==========
main 2014-08-16 15:49:53,743 INFO [qpid.test.utils.QpidTestCase] ========== start ChartBuilderFactoryTest.testBarChart
==========
main 2014-08-16 15:49:53,744 INFO [qpid.test.utils.QpidTestCase] ========== tearDown ChartBuilderFactoryTest.testBarChart
==========
main 2014-08-16 15:49:53,744 INFO [qpid.test.utils.QpidTestCase] ========== start ChartBuilderFactoryTest.testTimeSeriesLineChart
==========
main 2014-08-16 15:49:53,744 INFO [qpid.test.utils.QpidTestCase] ========== tearDown ChartBuilderFactoryTest.testTimeSeriesLineChart
==========
main 2014-08-16 15:49:53,745 INFO [qpid.test.utils.QpidTestCase] ========== start ChartBuilderFactoryTest.testLineChart3D
==========
main 2014-08-16 15:49:53,745 INFO [qpid.test.utils.QpidTestCase] ========== tearDown ChartBuilderFactoryTest.testLineChart3D
==========
main 2014-08-16 15:49:53,746 INFO [qpid.test.utils.QpidTestCase] ========== start ChartBuilderFactoryTest.testBarChart3D
==========
main 2014-08-16 15:49:53,746 INFO [qpid.test.utils.QpidTestCase] ========== tearDown ChartBuilderFactoryTest.testBarChart3D
==========
Tests run: 6, Failures: 0, Errors: 0, Skipped: 0, Time elapsed: 0.008 sec - in org.apache.qpid.disttest.charting.chartbuilder.ChartBuilderFactoryTest
Running org.apache.qpid.disttest.charting.chartbuilder.TimeSeriesBuilderCallbackTest
main 2014-08-16 15:49:53,748 INFO [qpid.test.utils.QpidTestCase] ========== start TimeSeriesBuilderCallbackTest.testAddPointToSeries
==========
main 2014-08-16 15:49:53,779 INFO [qpid.test.utils.QpidTestCase] ========== tearDown TimeSeriesBuilderCallbackTest.testAddPointToSeries
==========
Tests run: 1, Failures: 0, Errors: 0, Skipped: 0, Time elapsed: 0.032 sec - in org.apache.qpid.disttest.charting.chartbuilder.TimeSeriesBuilderCallbackTest
Running org.apache.qpid.disttest.charting.chartbuilder.ChartProductionTest
main 2014-08-16 15:49:53,783 INFO [qpid.test.utils.QpidTestCase] ========== start ChartProductionTest.testLine3DChart
==========
main 2014-08-16 15:49:53,785 INFO [disttest.charting.writer.ChartWriter] Set chart directory:
/tmp/charts-1408204193784
main 2014-08-16 15:49:55,495 INFO [disttest.charting.writer.ChartWriter] Written /tmp/charts-1408204193784/testLine3DChart.png
chart
main 2014-08-16 15:49:55,495 INFO [qpid.test.utils.QpidTestCase] ========== tearDown ChartProductionTest.testLine3DChart
==========
main 2014-08-16 15:49:55,496 INFO [qpid.test.utils.QpidTestCase] ========== start ChartProductionTest.testXYLineChart
==========
main 2014-08-16 15:49:55,496 INFO [disttest.charting.writer.ChartWriter] Set chart directory:
/tmp/charts-1408204195496
main 2014-08-16 15:49:55,601 INFO [disttest.charting.writer.ChartWriter] Written /tmp/charts-1408204195496/testXYLineChart.png
chart
main 2014-08-16 15:49:55,601 INFO [qpid.test.utils.QpidTestCase] ========== tearDown ChartProductionTest.testXYLineChart
==========
main 2014-08-16 15:49:55,602 INFO [qpid.test.utils.QpidTestCase] ========== start ChartProductionTest.testStatisticalBarChart
==========
main 2014-08-16 15:49:55,603 INFO [disttest.charting.writer.ChartWriter] Set chart directory:
/tmp/charts-1408204195603
main 2014-08-16 15:49:55,681 INFO [disttest.charting.writer.ChartWriter] Written /tmp/charts-1408204195603/testStatisticalBarChart.png
chart
main 2014-08-16 15:49:55,681 INFO [qpid.test.utils.QpidTestCase] ========== tearDown ChartProductionTest.testStatisticalBarChart
==========
main 2014-08-16 15:49:55,681 INFO [qpid.test.utils.QpidTestCase] ========== start ChartProductionTest.testLineChart
==========
main 2014-08-16 15:49:55,682 INFO [disttest.charting.writer.ChartWriter] Set chart directory:
/tmp/charts-1408204195682
main 2014-08-16 15:49:55,745 INFO [disttest.charting.writer.ChartWriter] Written /tmp/charts-1408204195682/testLineChart.png
chart
main 2014-08-16 15:49:55,745 INFO [qpid.test.utils.QpidTestCase] ========== tearDown ChartProductionTest.testLineChart
==========
main 2014-08-16 15:49:55,746 INFO [qpid.test.utils.QpidTestCase] ========== start ChartProductionTest.testBarChart
==========
main 2014-08-16 15:49:55,746 INFO [disttest.charting.writer.ChartWriter] Set chart directory:
/tmp/charts-1408204195746
main 2014-08-16 15:49:55,810 INFO [disttest.charting.writer.ChartWriter] Written /tmp/charts-1408204195746/testBarChart.png
chart
main 2014-08-16 15:49:55,810 INFO [qpid.test.utils.QpidTestCase] ========== tearDown ChartProductionTest.testBarChart
==========
main 2014-08-16 15:49:55,810 INFO [qpid.test.utils.QpidTestCase] ========== start ChartProductionTest.testBar3DChart
==========
main 2014-08-16 15:49:55,811 INFO [disttest.charting.writer.ChartWriter] Set chart directory:
/tmp/charts-1408204195811
main 2014-08-16 15:49:55,873 INFO [disttest.charting.writer.ChartWriter] Written /tmp/charts-1408204195811/testBar3DChart.png
chart
main 2014-08-16 15:49:55,873 INFO [qpid.test.utils.QpidTestCase] ========== tearDown ChartProductionTest.testBar3DChart
==========
main 2014-08-16 15:49:55,873 INFO [qpid.test.utils.QpidTestCase] ========== start ChartProductionTest.testTimeSeriesLineChart
==========
main 2014-08-16 15:49:55,874 INFO [disttest.charting.writer.ChartWriter] Set chart directory:
/tmp/charts-1408204195873
main 2014-08-16 15:49:55,945 INFO [disttest.charting.writer.ChartWriter] Written /tmp/charts-1408204195873/testTimeSeriesLineChart.png
chart
main 2014-08-16 15:49:55,945 INFO [qpid.test.utils.QpidTestCase] ========== tearDown ChartProductionTest.testTimeSeriesLineChart
==========
main 2014-08-16 15:49:55,946 INFO [qpid.test.utils.QpidTestCase] ========== start ChartProductionTest.testXYLineChartWithColourAndWidth
==========
main 2014-08-16 15:49:55,946 INFO [disttest.charting.writer.ChartWriter] Set chart directory:
/tmp/charts-1408204195946
main 2014-08-16 15:49:56,017 INFO [disttest.charting.writer.ChartWriter] Written /tmp/charts-1408204195946/testXYLineChartWithColourAndWidth.png
chart
main 2014-08-16 15:49:56,017 INFO [qpid.test.utils.QpidTestCase] ========== tearDown ChartProductionTest.testXYLineChartWithColourAndWidth
==========
Tests run: 8, Failures: 0, Errors: 0, Skipped: 0, Time elapsed: 2.238 sec - in org.apache.qpid.disttest.charting.chartbuilder.ChartProductionTest
Running org.apache.qpid.disttest.charting.definition.SeriesDefinitionCreatorTest
main 2014-08-16 15:49:56,019 INFO [qpid.test.utils.QpidTestCase] ========== start SeriesDefinitionCreatorTest.testSeriesDirectoryAndNameSubstitution
==========
main 2014-08-16 15:49:56,019 INFO [qpid.test.utils.QpidTestCase] Set system property "SeriesDefinitionProp"
to: "propValue"
main 2014-08-16 15:49:56,024 INFO [qpid.test.utils.QpidTestCase] ========== tearDown SeriesDefinitionCreatorTest.testSeriesDirectoryAndNameSubstitution
==========
main 2014-08-16 15:49:56,024 DEBUG [qpid.test.utils.QpidTestCase] reverting 1 test properties
main 2014-08-16 15:49:56,024 INFO [qpid.test.utils.QpidTestCase] ========== start SeriesDefinitionCreatorTest.testTwoSeriesDefinitions
==========
main 2014-08-16 15:49:56,025 INFO [qpid.test.utils.QpidTestCase] ========== tearDown SeriesDefinitionCreatorTest.testTwoSeriesDefinitions
==========
main 2014-08-16 15:49:56,025 INFO [qpid.test.utils.QpidTestCase] ========== start SeriesDefinitionCreatorTest.testOneSeriesDefinition
==========
main 2014-08-16 15:49:56,026 INFO [qpid.test.utils.QpidTestCase] ========== tearDown SeriesDefinitionCreatorTest.testOneSeriesDefinition
==========
main 2014-08-16 15:49:56,026 INFO [qpid.test.utils.QpidTestCase] ========== start SeriesDefinitionCreatorTest.testNonSequentialSeriesDefinitionsIgnored
==========
main 2014-08-16 15:49:56,027 INFO [qpid.test.utils.QpidTestCase] ========== tearDown SeriesDefinitionCreatorTest.testNonSequentialSeriesDefinitionsIgnored
==========
Tests run: 4, Failures: 0, Errors: 0, Skipped: 0, Time elapsed: 0.009 sec - in org.apache.qpid.disttest.charting.definition.SeriesDefinitionCreatorTest
Running org.apache.qpid.disttest.charting.definition.ChartingDefinitionCreatorTest
main 2014-08-16 15:49:56,028 INFO [qpid.test.utils.QpidTestCase] ========== start ChartingDefinitionCreatorTest.testLoadTwoDefinitionsFromDirectory
==========
main 2014-08-16 15:49:56,034 INFO [qpid.test.utils.QpidTestCase] ========== tearDown ChartingDefinitionCreatorTest.testLoadTwoDefinitionsFromDirectory
==========
main 2014-08-16 15:49:56,034 INFO [qpid.test.utils.QpidTestCase] ========== start ChartingDefinitionCreatorTest.testLoadOneDefinitionFromFile
==========
main 2014-08-16 15:49:56,035 INFO [qpid.test.utils.QpidTestCase] ========== tearDown ChartingDefinitionCreatorTest.testLoadOneDefinitionFromFile
==========
main 2014-08-16 15:49:56,035 INFO [qpid.test.utils.QpidTestCase] ========== start ChartingDefinitionCreatorTest.testDefinitionsProperties
==========
main 2014-08-16 15:49:56,035 INFO [qpid.test.utils.QpidTestCase] Set system property "ChartingDefinitionSysProp"
to: "propValue"
main 2014-08-16 15:49:56,036 INFO [qpid.test.utils.QpidTestCase] ========== tearDown ChartingDefinitionCreatorTest.testDefinitionsProperties
==========
main 2014-08-16 15:49:56,036 DEBUG [qpid.test.utils.QpidTestCase] reverting 1 test properties
main 2014-08-16 15:49:56,037 INFO [qpid.test.utils.QpidTestCase] ========== start ChartingDefinitionCreatorTest.testDefinitionFileNotFound
==========
main 2014-08-16 15:49:56,037 INFO [qpid.test.utils.QpidTestCase] ========== tearDown ChartingDefinitionCreatorTest.testDefinitionFileNotFound
==========
Tests run: 4, Failures: 0, Errors: 0, Skipped: 0, Time elapsed: 0.009 sec - in org.apache.qpid.disttest.charting.definition.ChartingDefinitionCreatorTest
Running org.apache.qpid.disttest.charting.writer.ChartWriterTest
main 2014-08-16 15:49:56,223 INFO [disttest.charting.writer.ChartWriter] Set chart directory:
/tmp/TestFileUtils-testDir-1408204196223
main 2014-08-16 15:49:56,280 INFO [disttest.charting.writer.ChartWriter] Written /tmp/TestFileUtils-testDir-1408204196223/chart1.png
chart
main 2014-08-16 15:49:56,280 INFO [disttest.charting.writer.ChartWriter] Only 1 chart image(s)
have been written so no HTML summary file will be produced
main 2014-08-16 15:49:56,280 INFO [qpid.test.utils.QpidTestCase] ========== tearDown null
==========
main 2014-08-16 15:49:56,281 INFO [disttest.charting.writer.ChartWriter] Set chart directory:
/tmp/TestFileUtils-testDir-1408204196281
main 2014-08-16 15:49:56,334 INFO [disttest.charting.writer.ChartWriter] Written /tmp/TestFileUtils-testDir-1408204196281/chart1.png
chart
main 2014-08-16 15:49:56,334 INFO [qpid.test.utils.QpidTestCase] ========== tearDown null
==========
main 2014-08-16 15:49:56,335 INFO [disttest.charting.writer.ChartWriter] Set chart directory:
/tmp/TestFileUtils-testDir-1408204196335
main 2014-08-16 15:49:56,388 INFO [disttest.charting.writer.ChartWriter] Written /tmp/TestFileUtils-testDir-1408204196335/chart2.png
chart
main 2014-08-16 15:49:56,444 INFO [disttest.charting.writer.ChartWriter] Written /tmp/TestFileUtils-testDir-1408204196335/chart1.png
chart
main 2014-08-16 15:49:56,445 DEBUG [disttest.charting.writer.ChartWriter] About to produce
HTML summary file /tmp/TestFileUtils-testDir-1408204196335/chart-summary.html from charts
{/tmp/TestFileUtils-testDir-1408204196335/chart1.png=Mock for ChartingDefinition, hashCode:
27592921, /tmp/TestFileUtils-testDir-1408204196335/chart2.png=Mock for ChartingDefinition,
hashCode: 31985040}
main 2014-08-16 15:49:56,450 INFO [qpid.test.utils.QpidTestCase] ========== tearDown null
==========
Tests run: 3, Failures: 0, Errors: 0, Skipped: 0, Time elapsed: 0.413 sec - in org.apache.qpid.disttest.charting.writer.ChartWriterTest

Results :

Tests run: 39, Failures: 0, Errors: 0, Skipped: 0

[INFO] 
[INFO] --- maven-jar-plugin:2.4:jar (default-jar) @ qpid-perftests-visualisation-jfc ---
[INFO] Building jar: /x1/jenkins/jenkins-slave/workspace/Qpid-Java-Cpp-Test/trunk/qpid/java/perftests/visualisation-jfc/target/qpid-perftests-visualisation-jfc-0.32-SNAPSHOT.jar
[INFO] 
[INFO] --- maven-site-plugin:3.3:attach-descriptor (attach-descriptor) @ qpid-perftests-visualisation-jfc
---
[INFO] 
[INFO] --- maven-antrun-plugin:1.7:run (create-qbtc-output-dir) @ qpid-perftests-visualisation-jfc
---
[INFO] Executing tasks

main:
    [mkdir] Created dir: /x1/jenkins/jenkins-slave/workspace/Qpid-Java-Cpp-Test/trunk/qpid/java/perftests/visualisation-jfc/target/qbtc-output
[INFO] Executed tasks
[INFO]                                                                         
[INFO] ------------------------------------------------------------------------
[INFO] Skipping Qpid BDB Store System Tests
[INFO] This project has been banned from the build due to previous failures.
[INFO] ------------------------------------------------------------------------
[INFO] ------------------------------------------------------------------------
[INFO] Reactor Summary:
[INFO] 
[INFO] Qpid Java Build ................................... SUCCESS [6.570s]
[INFO] Qpid AMQP 1.0 Common .............................. SUCCESS [9.054s]
[INFO] Qpid AMQP 1.0 Client .............................. SUCCESS [0.834s]
[INFO] Qpid AMQP 1.0 Client JMS .......................... SUCCESS [4.788s]
[INFO] Qpid AMQP 1.0 JMS Client Examples ................. SUCCESS [0.164s]
[INFO] Qpid AMQP 1.0 Client WebSocket .................... SUCCESS [0.678s]
[INFO] Qpid Broker Code Generation ....................... SUCCESS [0.353s]
[INFO] Qpid Test Utilities ............................... SUCCESS [0.357s]
[INFO] Qpid Common ....................................... SUCCESS [21.372s]
[INFO] Qpid Management Common ............................ SUCCESS [0.548s]
[INFO] Qpid Java Broker Core ............................. SUCCESS [1:13.738s]
[INFO] Qpid Access Control Broker Plug-in ................ SUCCESS [3.042s]
[INFO] Qpid AMQP 0-8 Protocol Broker Plug-in ............. SUCCESS [18.675s]
[INFO] Qpid AMQP 0-10 Protocol Plug-in ................... SUCCESS [4.911s]
[INFO] Qpid AMQP 1-0 Protocol Broker Plug-in ............. SUCCESS [0.670s]
[INFO] Qpid AMQP 0-8 to 0-10 Message Conversion Broker Plug-in  SUCCESS [0.271s]
[INFO] Qpid AMQP 0-8 to 1-0 Message Conversion Broker Plug-in  SUCCESS [0.361s]
[INFO] Qpid AMQP 0-10 to 1-0 Message Conversion Broker Plug-in  SUCCESS [0.348s]
[INFO] Qpid Derby Message Store .......................... SUCCESS [2:24.231s]
[INFO] Qpid JDBC Message Store Connection Pooling Plug-in  SUCCESS [0.600s]
[INFO] Qpid JDBC Message Store Broker Plug-in ............ SUCCESS [7.132s]
[INFO] Qpid HTTP Management Broker Plug-in ............... SUCCESS [4.742s]
[INFO] Qpid JMX Management Broker Plug-in ................ SUCCESS [2.283s]
[INFO] Qpid Memory Message Store Broker Plug-in .......... SUCCESS [0.361s]
[INFO] Qpid AMQP 0-x JMS Client .......................... SUCCESS [5.890s]
[INFO] Qpid BDB Message Store ............................ SUCCESS [2:17.414s]
[INFO] Qpid BDB Message Store JMX ........................ SUCCESS [1.102s]
[INFO] Qpid Java Broker .................................. SUCCESS [4.193s]
[INFO] Qpid AMQP Management Protocol Broker Plug-in ...... SUCCESS [0.289s]
[INFO] Qpid WebSocket Broker Plug-in ..................... SUCCESS [0.301s]
[INFO] Qpid AMQP 0-x JMS Client Examples ................. SUCCESS [0.126s]
[INFO] Qpid JCA .......................................... SUCCESS [1.102s]
[INFO] Qpid Resource Adaptor ............................. SUCCESS [0.506s]
[INFO] Qpid Tools ........................................ SUCCESS [0.297s]
[INFO] Qpid Management Examples .......................... SUCCESS [0.167s]
[INFO] Qpid Java System Test Parent ...................... SUCCESS [0.941s]
[INFO] Qpid System Tests ................................. FAILURE [5:39.614s]
[INFO] Qpid Performance Tests ............................ SUCCESS [14.455s]
[INFO] Qpid Performance Test System Tests ................ SKIPPED
[INFO] Qpid Performance Tests Visualisation JFC .......... SUCCESS [4.807s]
[INFO] Qpid BDB Store System Tests ....................... SKIPPED
[INFO] ------------------------------------------------------------------------
[INFO] BUILD FAILURE
[INFO] ------------------------------------------------------------------------
[INFO] Total time: 13:39.666s
[INFO] Finished at: Sat Aug 16 15:49:56 UTC 2014
[INFO] Final Memory: 68M/286M
[INFO] ------------------------------------------------------------------------
[ERROR] Failed to execute goal org.apache.maven.plugins:maven-surefire-plugin:2.16:test (integration-test)
on project qpid-systests: There are test failures.
[ERROR] 
[ERROR] Please refer to /x1/jenkins/jenkins-slave/workspace/Qpid-Java-Cpp-Test/trunk/qpid/java/systests/target/surefire-reports
for the individual test results.
[ERROR] -> [Help 1]
[ERROR] 
[ERROR] To see the full stack trace of the errors, re-run Maven with the -e switch.
[ERROR] Re-run Maven using the -X switch to enable full debug logging.
[ERROR] 
[ERROR] For more information about the errors and possible solutions, please read the following
articles:
[ERROR] [Help 1] http://cwiki.apache.org/confluence/display/MAVEN/MojoFailureException
[ERROR] 
[ERROR] After correcting the problems, you can resume the build with the command
[ERROR]   mvn <goals> -rf :qpid-systests
Build step 'Invoke top-level Maven targets' marked build as failure
[locks-and-latches] Releasing all the locks
[locks-and-latches] All the locks released
Recording test results

Mime
View raw message