qpid-notifications mailing list archives

Site index · List index
Message view « Date » · « Thread »
Top « Date » · « Thread »
From Apache Jenkins Server <jenk...@builds.apache.org>
Subject Build failed in Jenkins: Qpid-Java-Cpp-Test #2087
Date Mon, 18 Aug 2014 00:56:49 GMT
See <https://builds.apache.org/job/Qpid-Java-Cpp-Test/2087/changes>

Changes:

[rgodfrey] QPID-6011 : [Java Broker] provide a mechanism for disabling plugins and implementation
types

------------------------------------------
[...truncated 18617 lines...]
main 2014-08-18 00:56:43,021 DEBUG [apache.qpid.client.AMQDestination] Based on topic://amq.topic/xaTopic/?routingkey='xaTopic'&exclusive='true'&autodelete='true'
the selected destination syntax is BURL
main 2014-08-18 00:56:43,022 DEBUG [apache.qpid.jndi.PropertiesFileInitialContextFactory]
Creating the topic: xaTopic with the following binding keys xaTopic,
main 2014-08-18 00:56:43,022 DEBUG [apache.qpid.client.AMQDestination] Based on topic://amq.topic/durableSubscriberTopic/?routingkey='durableSubscriberTopic'&exclusive='true'&autodelete='true'
the selected destination syntax is BURL
main 2014-08-18 00:56:43,022 DEBUG [apache.qpid.jndi.PropertiesFileInitialContextFactory]
Creating the topic: durableSubscriberTopic with the following binding keys durableSubscriberTopic,
main 2014-08-18 00:56:43,022 INFO [apache.qpid.jndi.PropertiesFileInitialContextFactory] Attempting
to load test-profiles/test-provider.properties
main 2014-08-18 00:56:43,022 INFO [apache.qpid.jndi.PropertiesFileInitialContextFactory] Loaded
Context Properties:{connectionfactory.connection1=amqp://username:password@clientid/test?brokerlist='tcp://localhost:15672',
topic.topic=topic, test.port.ssl=15671, topic.xaTopic=xaTopic, topic.durableSubscriberTopic=durableSubscriberTopic,
connectionfactory.default.ssl=amqp://username:password@clientid/test?brokerlist='tcp://localhost:15671?ssl='true'',
connectionfactory.failover=amqp://username:password@clientid/test?brokerlist='tcp://localhost:25672;tcp://localhost:15672'&sync_ack='true'&sync_publish='all'&failover='roundrobin?cyclecount='20'',
test.port=15672, test.mport=18999, queue.xaQueue=xaQueue, queue.queue=example.queue, test.port.alt=25672,
java.naming.factory.initial=org.apache.qpid.jndi.PropertiesFileInitialContextFactory, connectionfactory.default=amqp://username:password@clientid/test?brokerlist='tcp://localhost:15672',
queue.MyQueue=example.MyQueue, test.port.alt.ssl=25671, java.naming.provider.url=test-profiles/test-provider.properties,
connectionfactory.failover.ssl=amqp://username:password@clientid/test?brokerlist='tcp://localhost:25671?ssl='true';tcp://localhost:15671?ssl='true''&sync_ack='true'&sync_publish='all'&failover='roundrobin?cyclecount='20'',
connectionfactory.connection2=amqp://username:password@clientid/test?brokerlist='tcp://localhost:25672'}
main 2014-08-18 00:56:43,022 DEBUG [apache.qpid.client.AMQDestination] Based on direct://amq.direct/xaQueue/xaQueue?routingkey='xaQueue'&durable='true'
the selected destination syntax is BURL
main 2014-08-18 00:56:43,023 DEBUG [apache.qpid.client.AMQDestination] Based on direct://amq.direct/example.queue/example.queue?routingkey='example.queue'&durable='true'
the selected destination syntax is BURL
main 2014-08-18 00:56:43,023 DEBUG [apache.qpid.client.AMQDestination] Based on direct://amq.direct/example.MyQueue/example.MyQueue?routingkey='example.MyQueue'&durable='true'
the selected destination syntax is BURL
main 2014-08-18 00:56:43,023 DEBUG [apache.qpid.client.AMQDestination] Based on topic://amq.topic/topic/?routingkey='topic'&exclusive='true'&autodelete='true'
the selected destination syntax is BURL
main 2014-08-18 00:56:43,023 DEBUG [apache.qpid.jndi.PropertiesFileInitialContextFactory]
Creating the topic: topic with the following binding keys topic,
main 2014-08-18 00:56:43,023 DEBUG [apache.qpid.client.AMQDestination] Based on topic://amq.topic/xaTopic/?routingkey='xaTopic'&exclusive='true'&autodelete='true'
the selected destination syntax is BURL
main 2014-08-18 00:56:43,023 DEBUG [apache.qpid.jndi.PropertiesFileInitialContextFactory]
Creating the topic: xaTopic with the following binding keys xaTopic,
main 2014-08-18 00:56:43,023 DEBUG [apache.qpid.client.AMQDestination] Based on topic://amq.topic/durableSubscriberTopic/?routingkey='durableSubscriberTopic'&exclusive='true'&autodelete='true'
the selected destination syntax is BURL
main 2014-08-18 00:56:43,023 DEBUG [apache.qpid.jndi.PropertiesFileInitialContextFactory]
Creating the topic: durableSubscriberTopic with the following binding keys durableSubscriberTopic,
Tests run: 7, Failures: 7, Errors: 0, Skipped: 0, Time elapsed: 0.001 sec <<< FAILURE!
- in org.apache.qpid.server.store.berkeleydb.replication.TwoNodeTest
testMasterDesignatedPrimaryCanBeRestartedWithoutReplica(org.apache.qpid.server.store.berkeleydb.replication.TwoNodeTest)
 Time elapsed: 0 sec  <<< FAILURE!
junit.framework.AssertionFailedError: null
	at junit.framework.Assert.fail(Assert.java:55)
	at junit.framework.Assert.assertTrue(Assert.java:22)
	at junit.framework.Assert.assertTrue(Assert.java:31)
	at junit.framework.TestCase.assertTrue(TestCase.java:201)
	at org.apache.qpid.server.store.berkeleydb.replication.TwoNodeTest.setUp(TwoNodeTest.java:52)

testSecondaryDesignatedAsPrimaryAfterOriginalPrimaryStopped(org.apache.qpid.server.store.berkeleydb.replication.TwoNodeTest)
 Time elapsed: 0 sec  <<< FAILURE!
junit.framework.AssertionFailedError: null
	at junit.framework.Assert.fail(Assert.java:55)
	at junit.framework.Assert.assertTrue(Assert.java:22)
	at junit.framework.Assert.assertTrue(Assert.java:31)
	at junit.framework.TestCase.assertTrue(TestCase.java:201)
	at org.apache.qpid.server.store.berkeleydb.replication.TwoNodeTest.setUp(TwoNodeTest.java:52)

testClusterRestartWithoutDesignatedPrimary(org.apache.qpid.server.store.berkeleydb.replication.TwoNodeTest)
 Time elapsed: 0 sec  <<< FAILURE!
junit.framework.AssertionFailedError: null
	at junit.framework.Assert.fail(Assert.java:55)
	at junit.framework.Assert.assertTrue(Assert.java:22)
	at junit.framework.Assert.assertTrue(Assert.java:31)
	at junit.framework.TestCase.assertTrue(TestCase.java:201)
	at org.apache.qpid.server.store.berkeleydb.replication.TwoNodeTest.setUp(TwoNodeTest.java:52)

testDesignatedPrimaryContinuesAfterSecondaryStopped(org.apache.qpid.server.store.berkeleydb.replication.TwoNodeTest)
 Time elapsed: 0 sec  <<< FAILURE!
junit.framework.AssertionFailedError: null
	at junit.framework.Assert.fail(Assert.java:55)
	at junit.framework.Assert.assertTrue(Assert.java:22)
	at junit.framework.Assert.assertTrue(Assert.java:31)
	at junit.framework.TestCase.assertTrue(TestCase.java:201)
	at org.apache.qpid.server.store.berkeleydb.replication.TwoNodeTest.setUp(TwoNodeTest.java:52)

testPersistentOperationsFailOnNonDesignatedPrimaryAfterSecondaryStopped(org.apache.qpid.server.store.berkeleydb.replication.TwoNodeTest)
 Time elapsed: 0 sec  <<< FAILURE!
junit.framework.AssertionFailedError: null
	at junit.framework.Assert.fail(Assert.java:55)
	at junit.framework.Assert.assertTrue(Assert.java:22)
	at junit.framework.Assert.assertTrue(Assert.java:31)
	at junit.framework.TestCase.assertTrue(TestCase.java:201)
	at org.apache.qpid.server.store.berkeleydb.replication.TwoNodeTest.setUp(TwoNodeTest.java:52)

testInitialDesignatedPrimaryStateOfNodes(org.apache.qpid.server.store.berkeleydb.replication.TwoNodeTest)
 Time elapsed: 0 sec  <<< FAILURE!
junit.framework.AssertionFailedError: null
	at junit.framework.Assert.fail(Assert.java:55)
	at junit.framework.Assert.assertTrue(Assert.java:22)
	at junit.framework.Assert.assertTrue(Assert.java:31)
	at junit.framework.TestCase.assertTrue(TestCase.java:201)
	at org.apache.qpid.server.store.berkeleydb.replication.TwoNodeTest.setUp(TwoNodeTest.java:52)

testSecondaryDoesNotBecomePrimaryWhenDesignatedPrimaryStopped(org.apache.qpid.server.store.berkeleydb.replication.TwoNodeTest)
 Time elapsed: 0 sec  <<< FAILURE!
junit.framework.AssertionFailedError: null
	at junit.framework.Assert.fail(Assert.java:55)
	at junit.framework.Assert.assertTrue(Assert.java:22)
	at junit.framework.Assert.assertTrue(Assert.java:31)
	at junit.framework.TestCase.assertTrue(TestCase.java:201)
	at org.apache.qpid.server.store.berkeleydb.replication.TwoNodeTest.setUp(TwoNodeTest.java:52)

Running org.apache.qpid.server.store.berkeleydb.replication.BDBHAVirtualHostRestTest
Tests run: 3, Failures: 0, Errors: 3, Skipped: 0, Time elapsed: 0.022 sec <<< FAILURE!
- in org.apache.qpid.server.store.berkeleydb.replication.BDBHAVirtualHostRestTest
testSetLocalTransactionSynchronizationPolicy(org.apache.qpid.server.store.berkeleydb.replication.BDBHAVirtualHostRestTest)
 Time elapsed: 0 sec  <<< ERROR!
java.net.ConnectException: Connection refused
	at java.net.PlainSocketImpl.socketConnect(Native Method)
	at java.net.AbstractPlainSocketImpl.doConnect(AbstractPlainSocketImpl.java:339)
	at java.net.AbstractPlainSocketImpl.connectToAddress(AbstractPlainSocketImpl.java:200)
	at java.net.AbstractPlainSocketImpl.connect(AbstractPlainSocketImpl.java:182)
	at java.net.SocksSocketImpl.connect(SocksSocketImpl.java:392)
	at java.net.Socket.connect(Socket.java:579)
	at java.net.Socket.connect(Socket.java:528)
	at sun.net.NetworkClient.doConnect(NetworkClient.java:180)
	at sun.net.www.http.HttpClient.openServer(HttpClient.java:378)
	at sun.net.www.http.HttpClient.openServer(HttpClient.java:473)
	at sun.net.www.http.HttpClient.<init>(HttpClient.java:203)
	at sun.net.www.http.HttpClient.New(HttpClient.java:290)
	at sun.net.www.http.HttpClient.New(HttpClient.java:306)
	at sun.net.www.protocol.http.HttpURLConnection.getNewHttpClient(HttpURLConnection.java:995)
	at sun.net.www.protocol.http.HttpURLConnection.plainConnect(HttpURLConnection.java:931)
	at sun.net.www.protocol.http.HttpURLConnection.connect(HttpURLConnection.java:849)
	at org.apache.qpid.systest.rest.RestTestHelper.getJsonAsList(RestTestHelper.java:288)
	at org.apache.qpid.systest.rest.QpidRestTestCase.waitForAttributeChanged(QpidRestTestCase.java:114)
	at org.apache.qpid.server.store.berkeleydb.replication.BDBHAVirtualHostRestTest.testSetLocalTransactionSynchronizationPolicy(BDBHAVirtualHostRestTest.java:108)

testMutateState(org.apache.qpid.server.store.berkeleydb.replication.BDBHAVirtualHostRestTest)
 Time elapsed: 0 sec  <<< ERROR!
java.net.ConnectException: Connection refused
	at java.net.PlainSocketImpl.socketConnect(Native Method)
	at java.net.AbstractPlainSocketImpl.doConnect(AbstractPlainSocketImpl.java:339)
	at java.net.AbstractPlainSocketImpl.connectToAddress(AbstractPlainSocketImpl.java:200)
	at java.net.AbstractPlainSocketImpl.connect(AbstractPlainSocketImpl.java:182)
	at java.net.SocksSocketImpl.connect(SocksSocketImpl.java:392)
	at java.net.Socket.connect(Socket.java:579)
	at java.net.Socket.connect(Socket.java:528)
	at sun.net.NetworkClient.doConnect(NetworkClient.java:180)
	at sun.net.www.http.HttpClient.openServer(HttpClient.java:378)
	at sun.net.www.http.HttpClient.openServer(HttpClient.java:473)
	at sun.net.www.http.HttpClient.<init>(HttpClient.java:203)
	at sun.net.www.http.HttpClient.New(HttpClient.java:290)
	at sun.net.www.http.HttpClient.New(HttpClient.java:306)
	at sun.net.www.protocol.http.HttpURLConnection.getNewHttpClient(HttpURLConnection.java:995)
	at sun.net.www.protocol.http.HttpURLConnection.plainConnect(HttpURLConnection.java:931)
	at sun.net.www.protocol.http.HttpURLConnection.connect(HttpURLConnection.java:849)
	at org.apache.qpid.systest.rest.RestTestHelper.getJsonAsList(RestTestHelper.java:288)
	at org.apache.qpid.systest.rest.QpidRestTestCase.waitForAttributeChanged(QpidRestTestCase.java:114)
	at org.apache.qpid.server.store.berkeleydb.replication.BDBHAVirtualHostRestTest.testMutateState(BDBHAVirtualHostRestTest.java:132)

testSetRemoteTransactionSynchronizationPolicy(org.apache.qpid.server.store.berkeleydb.replication.BDBHAVirtualHostRestTest)
 Time elapsed: 0.022 sec  <<< ERROR!
java.net.ConnectException: Connection refused
	at java.net.PlainSocketImpl.socketConnect(Native Method)
	at java.net.AbstractPlainSocketImpl.doConnect(AbstractPlainSocketImpl.java:339)
	at java.net.AbstractPlainSocketImpl.connectToAddress(AbstractPlainSocketImpl.java:200)
	at java.net.AbstractPlainSocketImpl.connect(AbstractPlainSocketImpl.java:182)
	at java.net.SocksSocketImpl.connect(SocksSocketImpl.java:392)
	at java.net.Socket.connect(Socket.java:579)
	at java.net.Socket.connect(Socket.java:528)
	at sun.net.NetworkClient.doConnect(NetworkClient.java:180)
	at sun.net.www.http.HttpClient.openServer(HttpClient.java:378)
	at sun.net.www.http.HttpClient.openServer(HttpClient.java:473)
	at sun.net.www.http.HttpClient.<init>(HttpClient.java:203)
	at sun.net.www.http.HttpClient.New(HttpClient.java:290)
	at sun.net.www.http.HttpClient.New(HttpClient.java:306)
	at sun.net.www.protocol.http.HttpURLConnection.getNewHttpClient(HttpURLConnection.java:995)
	at sun.net.www.protocol.http.HttpURLConnection.plainConnect(HttpURLConnection.java:931)
	at sun.net.www.protocol.http.HttpURLConnection.connect(HttpURLConnection.java:849)
	at org.apache.qpid.systest.rest.RestTestHelper.getJsonAsList(RestTestHelper.java:288)
	at org.apache.qpid.systest.rest.QpidRestTestCase.waitForAttributeChanged(QpidRestTestCase.java:114)
	at org.apache.qpid.server.store.berkeleydb.replication.BDBHAVirtualHostRestTest.testSetRemoteTransactionSynchronizationPolicy(BDBHAVirtualHostRestTest.java:120)


Results :

Failed tests: 
  MultiNodeTest>QpidTestCase.run:148->QpidBrokerTestCase.runBare:311->setUp:70 null
  MultiNodeTest>QpidTestCase.run:148->QpidBrokerTestCase.runBare:311->setUp:70 null
  MultiNodeTest>QpidTestCase.run:148->QpidBrokerTestCase.runBare:311->setUp:70 null
  MultiNodeTest>QpidTestCase.run:148->QpidBrokerTestCase.runBare:311->setUp:70 null
  MultiNodeTest>QpidTestCase.run:148->QpidBrokerTestCase.runBare:311->setUp:70 null
  MultiNodeTest>QpidTestCase.run:148->QpidBrokerTestCase.runBare:311->setUp:70 null
  MultiNodeTest>QpidTestCase.run:148->QpidBrokerTestCase.runBare:311->setUp:70 null
  MultiNodeTest>QpidTestCase.run:148->QpidBrokerTestCase.runBare:311->setUp:70 null
  TwoNodeTest>QpidTestCase.run:148->QpidBrokerTestCase.runBare:311->setUp:52 null
  TwoNodeTest>QpidTestCase.run:148->QpidBrokerTestCase.runBare:311->setUp:52 null
  TwoNodeTest>QpidTestCase.run:148->QpidBrokerTestCase.runBare:311->setUp:52 null
  TwoNodeTest>QpidTestCase.run:148->QpidBrokerTestCase.runBare:311->setUp:52 null
  TwoNodeTest>QpidTestCase.run:148->QpidBrokerTestCase.runBare:311->setUp:52 null
  TwoNodeTest>QpidTestCase.run:148->QpidBrokerTestCase.runBare:311->setUp:52 null
  TwoNodeTest>QpidTestCase.run:148->QpidBrokerTestCase.runBare:311->setUp:52 null

Tests in error: 
  BDBHAVirtualHostNodeRestTest>QpidTestCase.run:148->QpidBrokerTestCase.runBare:311->testNewMasterElectedWhenVirtualHostIsStopped:133->createHANode:315
? Connect
  BDBHAVirtualHostNodeRestTest>QpidTestCase.run:148->QpidBrokerTestCase.runBare:311->testMutateStateOfOneNode:101->createHANode:315
? Connect
  BDBHAVirtualHostNodeRestTest>QpidTestCase.run:148->QpidBrokerTestCase.runBare:311->testIntruderBDBHAVHNNotAllowedNoConnect:231->createHANode:315
? Connect
  BDBHAVirtualHostNodeRestTest>QpidTestCase.run:148->QpidBrokerTestCase.runBare:311->testIntruderProtection:251->createHANode:315
? Connect
  BDBHAVirtualHostNodeRestTest>QpidTestCase.run:148->QpidBrokerTestCase.runBare:311->testDeleteMasterNode:191->createHANode:315
? Connect
  BDBHAVirtualHostNodeRestTest>QpidTestCase.run:148->QpidBrokerTestCase.runBare:311->testCreate3NodeGroup:90->createHANode:315
? Connect
  BDBHAVirtualHostNodeRestTest>QpidTestCase.run:148->QpidBrokerTestCase.runBare:311->testDeleteReplicaNode:164->createHANode:315
? Connect
  JMXManagementTest>QpidTestCase.run:148->QpidBrokerTestCase.runBare:311->testRemoveRemoteNodeFromGroup:161->getStoreBeanForNodeAtBrokerPort:273
? IO
  JMXManagementTest>QpidTestCase.run:148->QpidBrokerTestCase.runBare:311->testVirtualHostOperationsDeniedForNonMasterNode:184->getManagedBrokerBeanForNodeAtBrokerPort:280
? IO
  JMXManagementTest>QpidTestCase.run:148->QpidBrokerTestCase.runBare:311->testStateOfNonActiveBrokerIsNotMaster:130->getStoreBeanForNodeAtBrokerPort:273
? IO
  JMXManagementTest>QpidTestCase.run:148->QpidBrokerTestCase.runBare:311->testStateOfActiveBrokerIsMaster:122->getStoreBeanForNodeAtBrokerPort:273
? IO
  JMXManagementTest>QpidTestCase.run:148->QpidBrokerTestCase.runBare:311->testVirtualHostMbeanOnMasterTransfer:222->getManagedBrokerBeanForNodeAtBrokerPort:280
? IO
  JMXManagementTest>QpidTestCase.run:148->QpidBrokerTestCase.runBare:311->testGroupMembers:139->getStoreBeanForNodeAtBrokerPort:273
? IO
  JMXManagementTest>QpidTestCase.run:148->QpidBrokerTestCase.runBare:311->testReadonlyMBeanAttributes:108->getStoreBeanForNodeAtBrokerPort:273
? IO
  BDBHAVirtualHostRestTest>QpidTestCase.run:148->QpidBrokerTestCase.runBare:311->testSetLocalTransactionSynchronizationPolicy:108->QpidRestTestCase.waitForAttributeChanged:114
? Connect
  BDBHAVirtualHostRestTest>QpidTestCase.run:148->QpidBrokerTestCase.runBare:311->testMutateState:132->QpidRestTestCase.waitForAttributeChanged:114
? Connect
  BDBHAVirtualHostRestTest>QpidTestCase.run:148->QpidBrokerTestCase.runBare:311->testSetRemoteTransactionSynchronizationPolicy:120->QpidRestTestCase.waitForAttributeChanged:114
? Connect

Tests run: 40, Failures: 15, Errors: 17, Skipped: 0

[INFO] ------------------------------------------------------------------------
[INFO] Reactor Summary:
[INFO] 
[INFO] Qpid Java Build ................................... SUCCESS [6.986s]
[INFO] Qpid AMQP 1.0 Common .............................. SUCCESS [5.192s]
[INFO] Qpid AMQP 1.0 Client .............................. SUCCESS [0.626s]
[INFO] Qpid AMQP 1.0 Client JMS .......................... SUCCESS [1.747s]
[INFO] Qpid AMQP 1.0 JMS Client Examples ................. SUCCESS [0.174s]
[INFO] Qpid AMQP 1.0 Client WebSocket .................... SUCCESS [0.800s]
[INFO] Qpid Broker Code Generation ....................... SUCCESS [0.275s]
[INFO] Qpid Test Utilities ............................... SUCCESS [0.418s]
[INFO] Qpid Common ....................................... SUCCESS [19.082s]
[INFO] Qpid Management Common ............................ SUCCESS [0.494s]
[INFO] Qpid Java Broker Core ............................. SUCCESS [1:11.638s]
[INFO] Qpid Access Control Broker Plug-in ................ SUCCESS [2.643s]
[INFO] Qpid AMQP 0-8 Protocol Broker Plug-in ............. SUCCESS [18.813s]
[INFO] Qpid AMQP 0-10 Protocol Plug-in ................... SUCCESS [1.830s]
[INFO] Qpid AMQP 1-0 Protocol Broker Plug-in ............. SUCCESS [0.471s]
[INFO] Qpid AMQP 0-8 to 0-10 Message Conversion Broker Plug-in  SUCCESS [0.240s]
[INFO] Qpid AMQP 0-8 to 1-0 Message Conversion Broker Plug-in  SUCCESS [0.267s]
[INFO] Qpid AMQP 0-10 to 1-0 Message Conversion Broker Plug-in  SUCCESS [0.228s]
[INFO] Qpid Derby Message Store .......................... SUCCESS [1:32.763s]
[INFO] Qpid JDBC Message Store Connection Pooling Plug-in  SUCCESS [0.517s]
[INFO] Qpid JDBC Message Store Broker Plug-in ............ SUCCESS [5.328s]
[INFO] Qpid HTTP Management Broker Plug-in ............... SUCCESS [3.581s]
[INFO] Qpid JMX Management Broker Plug-in ................ SUCCESS [2.070s]
[INFO] Qpid Memory Message Store Broker Plug-in .......... SUCCESS [0.358s]
[INFO] Qpid AMQP 0-x JMS Client .......................... SUCCESS [5.255s]
[INFO] Qpid BDB Message Store ............................ SUCCESS [2:03.685s]
[INFO] Qpid BDB Message Store JMX ........................ SUCCESS [0.987s]
[INFO] Qpid Java Broker .................................. SUCCESS [3.500s]
[INFO] Qpid AMQP Management Protocol Broker Plug-in ...... SUCCESS [0.261s]
[INFO] Qpid WebSocket Broker Plug-in ..................... SUCCESS [0.223s]
[INFO] Qpid AMQP 0-x JMS Client Examples ................. SUCCESS [0.125s]
[INFO] Qpid JCA .......................................... SUCCESS [1.047s]
[INFO] Qpid Resource Adaptor ............................. SUCCESS [0.438s]
[INFO] Qpid Tools ........................................ SUCCESS [0.229s]
[INFO] Qpid Management Examples .......................... SUCCESS [0.148s]
[INFO] Qpid Java System Test Parent ...................... SUCCESS [1.474s]
[INFO] Qpid System Tests ................................. SUCCESS [5:39.588s]
[INFO] Qpid Performance Tests ............................ SUCCESS [14.349s]
[INFO] Qpid Performance Test System Tests ................ SUCCESS [16.546s]
[INFO] Qpid Performance Tests Visualisation JFC .......... SUCCESS [4.651s]
[INFO] Qpid BDB Store System Tests ....................... FAILURE [5.628s]
[INFO] ------------------------------------------------------------------------
[INFO] BUILD FAILURE
[INFO] ------------------------------------------------------------------------
[INFO] Total time: 12:35.554s
[INFO] Finished at: Mon Aug 18 00:56:43 UTC 2014
[INFO] Final Memory: 70M/402M
[INFO] ------------------------------------------------------------------------
[ERROR] Failed to execute goal org.apache.maven.plugins:maven-surefire-plugin:2.16:test (integration-test)
on project qpid-bdbstore-systests: There are test failures.
[ERROR] 
[ERROR] Please refer to /x1/jenkins/jenkins-slave/workspace/Qpid-Java-Cpp-Test/trunk/qpid/java/bdbstore/systests/target/surefire-reports
for the individual test results.
[ERROR] -> [Help 1]
[ERROR] 
[ERROR] To see the full stack trace of the errors, re-run Maven with the -e switch.
[ERROR] Re-run Maven using the -X switch to enable full debug logging.
[ERROR] 
[ERROR] For more information about the errors and possible solutions, please read the following
articles:
[ERROR] [Help 1] http://cwiki.apache.org/confluence/display/MAVEN/MojoFailureException
[ERROR] 
[ERROR] After correcting the problems, you can resume the build with the command
[ERROR]   mvn <goals> -rf :qpid-bdbstore-systests
Build step 'Invoke top-level Maven targets' marked build as failure
[locks-and-latches] Releasing all the locks
[locks-and-latches] All the locks released
Recording test results

Mime
View raw message