qpid-notifications mailing list archives

Site index · List index
Message view « Date » · « Thread »
Top « Date » · « Thread »
From Apache Jenkins Server <jenk...@builds.apache.org>
Subject Build failed in Jenkins: Qpid-Java-Java-Test-JDK1.8 #824
Date Fri, 15 Aug 2014 04:31:53 GMT
See <https://builds.apache.org/job/Qpid-Java-Java-Test-JDK1.8/824/changes>

Changes:

[orudyy] QPID-5998: Fix HA operational logging

[rgodfrey] QPID-3978 : [Java Broker] Add unit test for UnacknowledgedMessageMap

[rgodfrey] QPID-3978 : [Java Broker] Fix bug in unacknowledged map where non locked (deleted)
messages were not being excluded from the messages to dequeue

[rgodfrey] QPID-6001 :  [Java Client] Prevent NPE when publishing using ADDR destination to
Broker using AMQP 0-9-1 or lower

[kwall] QPID-6001: [Java Client] Prevent NPE when publishing using ADDR destination to Broker
using AMQP 0-9-1 or lower

[astitcher] QPID-5999: Update selector syntax documentation to reflect the implementation

[gsim] QPID-5985: fixed regression introduced by previous commit (r1617256), ensuring that
call does not block indefinitely

[rgodfrey] QPID-5996 : [Java Build] Coverage reports are not being produced

[pmoravec] [no jira]: fixing commit 1617841 that broke building (unreliable to be initialized
after nextId)

[kwall] QPID-5991: [Java System Tests]  BDB HA System Test Improvements

* Change failover url so that algorithm for cases where we expect a connection to the broker
checks each broker once
  per cycle rather than twice successively.  Doubled the number of cycles and reduced the
connect delay so that
  test discover the master node more quickly.
* Use separate negative failover url when expectation is that group will refuse connection.
* Remove duplicated test
* In TwoNodeTest use REST API only.   JMXManagementTest now has sole responsibility for testing
HA using the JMX bean.

[kwall] NO-JIRA: Remove unused test support classes

------------------------------------------
[...truncated 27892 lines...]
main 2014-08-15 04:31:44,309 INFO [qpid.test.utils.QpidTestCase] ========== tearDown JdbcUrlGeneratorTest.testGetJdbcUrlThrowsExceptionIfUrlProvidedAndSeriesDirectorySpecified
==========
main 2014-08-15 04:31:44,310 INFO [qpid.test.utils.QpidTestCase] ========== start JdbcUrlGeneratorTest.testGetJdbcUrlReturnsProvidedUrl
==========
main 2014-08-15 04:31:44,310 INFO [qpid.test.utils.QpidTestCase] ========== tearDown JdbcUrlGeneratorTest.testGetJdbcUrlReturnsProvidedUrl
==========
Tests run: 4, Failures: 0, Errors: 0, Skipped: 0, Time elapsed: 0.012 sec - in org.apache.qpid.disttest.charting.seriesbuilder.JdbcUrlGeneratorTest
Running org.apache.qpid.disttest.charting.chartbuilder.ColorFactoryTest
main 2014-08-15 04:31:44,311 INFO [qpid.test.utils.QpidTestCase] ========== start ColorFactoryTest.testDarkBlue
==========
main 2014-08-15 04:31:44,394 INFO [qpid.test.utils.QpidTestCase] ========== tearDown ColorFactoryTest.testDarkBlue
==========
main 2014-08-15 04:31:44,394 INFO [qpid.test.utils.QpidTestCase] ========== start ColorFactoryTest.testBlue
==========
main 2014-08-15 04:31:44,395 INFO [qpid.test.utils.QpidTestCase] ========== tearDown ColorFactoryTest.testBlue
==========
Tests run: 2, Failures: 0, Errors: 0, Skipped: 0, Time elapsed: 0.084 sec - in org.apache.qpid.disttest.charting.chartbuilder.ColorFactoryTest
Running org.apache.qpid.disttest.charting.chartbuilder.BaseChartBuilderTest
main 2014-08-15 04:31:44,451 INFO [qpid.test.utils.QpidTestCase] ========== start BaseChartBuilderTest.testBuildChart
==========
main 2014-08-15 04:31:44,708 INFO [qpid.test.utils.QpidTestCase] ========== tearDown BaseChartBuilderTest.testBuildChart
==========
Tests run: 1, Failures: 0, Errors: 0, Skipped: 0, Time elapsed: 0.313 sec - in org.apache.qpid.disttest.charting.chartbuilder.BaseChartBuilderTest
Running org.apache.qpid.disttest.charting.chartbuilder.ChartBuilderFactoryTest
main 2014-08-15 04:31:44,710 INFO [qpid.test.utils.QpidTestCase] ========== start ChartBuilderFactoryTest.testXYLineChart
==========
main 2014-08-15 04:31:44,712 INFO [qpid.test.utils.QpidTestCase] ========== tearDown ChartBuilderFactoryTest.testXYLineChart
==========
main 2014-08-15 04:31:44,712 INFO [qpid.test.utils.QpidTestCase] ========== start ChartBuilderFactoryTest.testLineChart
==========
main 2014-08-15 04:31:44,713 INFO [qpid.test.utils.QpidTestCase] ========== tearDown ChartBuilderFactoryTest.testLineChart
==========
main 2014-08-15 04:31:44,714 INFO [qpid.test.utils.QpidTestCase] ========== start ChartBuilderFactoryTest.testBarChart
==========
main 2014-08-15 04:31:44,714 INFO [qpid.test.utils.QpidTestCase] ========== tearDown ChartBuilderFactoryTest.testBarChart
==========
main 2014-08-15 04:31:44,715 INFO [qpid.test.utils.QpidTestCase] ========== start ChartBuilderFactoryTest.testTimeSeriesLineChart
==========
main 2014-08-15 04:31:44,715 INFO [qpid.test.utils.QpidTestCase] ========== tearDown ChartBuilderFactoryTest.testTimeSeriesLineChart
==========
main 2014-08-15 04:31:44,715 INFO [qpid.test.utils.QpidTestCase] ========== start ChartBuilderFactoryTest.testLineChart3D
==========
main 2014-08-15 04:31:44,716 INFO [qpid.test.utils.QpidTestCase] ========== tearDown ChartBuilderFactoryTest.testLineChart3D
==========
main 2014-08-15 04:31:44,716 INFO [qpid.test.utils.QpidTestCase] ========== start ChartBuilderFactoryTest.testBarChart3D
==========
main 2014-08-15 04:31:44,717 INFO [qpid.test.utils.QpidTestCase] ========== tearDown ChartBuilderFactoryTest.testBarChart3D
==========
Tests run: 6, Failures: 0, Errors: 0, Skipped: 0, Time elapsed: 0.009 sec - in org.apache.qpid.disttest.charting.chartbuilder.ChartBuilderFactoryTest
Running org.apache.qpid.disttest.charting.chartbuilder.TimeSeriesBuilderCallbackTest
main 2014-08-15 04:31:44,718 INFO [qpid.test.utils.QpidTestCase] ========== start TimeSeriesBuilderCallbackTest.testAddPointToSeries
==========
main 2014-08-15 04:31:44,745 INFO [qpid.test.utils.QpidTestCase] ========== tearDown TimeSeriesBuilderCallbackTest.testAddPointToSeries
==========
Tests run: 1, Failures: 0, Errors: 0, Skipped: 0, Time elapsed: 0.028 sec - in org.apache.qpid.disttest.charting.chartbuilder.TimeSeriesBuilderCallbackTest
Running org.apache.qpid.disttest.charting.chartbuilder.ChartProductionTest
main 2014-08-15 04:31:44,749 INFO [qpid.test.utils.QpidTestCase] ========== start ChartProductionTest.testLine3DChart
==========
main 2014-08-15 04:31:44,754 INFO [disttest.charting.writer.ChartWriter] Set chart directory:
/tmp/charts-1408077104752
main 2014-08-15 04:31:46,075 INFO [disttest.charting.writer.ChartWriter] Written /tmp/charts-1408077104752/testLine3DChart.png
chart
main 2014-08-15 04:31:46,075 INFO [qpid.test.utils.QpidTestCase] ========== tearDown ChartProductionTest.testLine3DChart
==========
main 2014-08-15 04:31:46,075 INFO [qpid.test.utils.QpidTestCase] ========== start ChartProductionTest.testXYLineChart
==========
main 2014-08-15 04:31:46,076 INFO [disttest.charting.writer.ChartWriter] Set chart directory:
/tmp/charts-1408077106076
main 2014-08-15 04:31:46,159 INFO [disttest.charting.writer.ChartWriter] Written /tmp/charts-1408077106076/testXYLineChart.png
chart
main 2014-08-15 04:31:46,159 INFO [qpid.test.utils.QpidTestCase] ========== tearDown ChartProductionTest.testXYLineChart
==========
main 2014-08-15 04:31:46,159 INFO [qpid.test.utils.QpidTestCase] ========== start ChartProductionTest.testStatisticalBarChart
==========
main 2014-08-15 04:31:46,160 INFO [disttest.charting.writer.ChartWriter] Set chart directory:
/tmp/charts-1408077106160
main 2014-08-15 04:31:46,219 INFO [disttest.charting.writer.ChartWriter] Written /tmp/charts-1408077106160/testStatisticalBarChart.png
chart
main 2014-08-15 04:31:46,219 INFO [qpid.test.utils.QpidTestCase] ========== tearDown ChartProductionTest.testStatisticalBarChart
==========
main 2014-08-15 04:31:46,220 INFO [qpid.test.utils.QpidTestCase] ========== start ChartProductionTest.testLineChart
==========
main 2014-08-15 04:31:46,221 INFO [disttest.charting.writer.ChartWriter] Set chart directory:
/tmp/charts-1408077106221
main 2014-08-15 04:31:46,268 INFO [disttest.charting.writer.ChartWriter] Written /tmp/charts-1408077106221/testLineChart.png
chart
main 2014-08-15 04:31:46,268 INFO [qpid.test.utils.QpidTestCase] ========== tearDown ChartProductionTest.testLineChart
==========
main 2014-08-15 04:31:46,268 INFO [qpid.test.utils.QpidTestCase] ========== start ChartProductionTest.testBarChart
==========
main 2014-08-15 04:31:46,269 INFO [disttest.charting.writer.ChartWriter] Set chart directory:
/tmp/charts-1408077106269
main 2014-08-15 04:31:46,317 INFO [disttest.charting.writer.ChartWriter] Written /tmp/charts-1408077106269/testBarChart.png
chart
main 2014-08-15 04:31:46,317 INFO [qpid.test.utils.QpidTestCase] ========== tearDown ChartProductionTest.testBarChart
==========
main 2014-08-15 04:31:46,317 INFO [qpid.test.utils.QpidTestCase] ========== start ChartProductionTest.testBar3DChart
==========
main 2014-08-15 04:31:46,318 INFO [disttest.charting.writer.ChartWriter] Set chart directory:
/tmp/charts-1408077106318
main 2014-08-15 04:31:46,364 INFO [disttest.charting.writer.ChartWriter] Written /tmp/charts-1408077106318/testBar3DChart.png
chart
main 2014-08-15 04:31:46,364 INFO [qpid.test.utils.QpidTestCase] ========== tearDown ChartProductionTest.testBar3DChart
==========
main 2014-08-15 04:31:46,364 INFO [qpid.test.utils.QpidTestCase] ========== start ChartProductionTest.testTimeSeriesLineChart
==========
main 2014-08-15 04:31:46,365 INFO [disttest.charting.writer.ChartWriter] Set chart directory:
/tmp/charts-1408077106365
main 2014-08-15 04:31:46,424 INFO [disttest.charting.writer.ChartWriter] Written /tmp/charts-1408077106365/testTimeSeriesLineChart.png
chart
main 2014-08-15 04:31:46,424 INFO [qpid.test.utils.QpidTestCase] ========== tearDown ChartProductionTest.testTimeSeriesLineChart
==========
main 2014-08-15 04:31:46,424 INFO [qpid.test.utils.QpidTestCase] ========== start ChartProductionTest.testXYLineChartWithColourAndWidth
==========
main 2014-08-15 04:31:46,425 INFO [disttest.charting.writer.ChartWriter] Set chart directory:
/tmp/charts-1408077106425
main 2014-08-15 04:31:46,474 INFO [disttest.charting.writer.ChartWriter] Written /tmp/charts-1408077106425/testXYLineChartWithColourAndWidth.png
chart
main 2014-08-15 04:31:46,474 INFO [qpid.test.utils.QpidTestCase] ========== tearDown ChartProductionTest.testXYLineChartWithColourAndWidth
==========
Tests run: 8, Failures: 0, Errors: 0, Skipped: 0, Time elapsed: 1.728 sec - in org.apache.qpid.disttest.charting.chartbuilder.ChartProductionTest
Running org.apache.qpid.disttest.charting.definition.SeriesDefinitionCreatorTest
main 2014-08-15 04:31:46,476 INFO [qpid.test.utils.QpidTestCase] ========== start SeriesDefinitionCreatorTest.testSeriesDirectoryAndNameSubstitution
==========
main 2014-08-15 04:31:46,476 INFO [qpid.test.utils.QpidTestCase] Set system property "SeriesDefinitionProp"
to: "propValue"
main 2014-08-15 04:31:46,482 INFO [qpid.test.utils.QpidTestCase] ========== tearDown SeriesDefinitionCreatorTest.testSeriesDirectoryAndNameSubstitution
==========
main 2014-08-15 04:31:46,482 DEBUG [qpid.test.utils.QpidTestCase] reverting 1 test properties
main 2014-08-15 04:31:46,482 INFO [qpid.test.utils.QpidTestCase] ========== start SeriesDefinitionCreatorTest.testTwoSeriesDefinitions
==========
main 2014-08-15 04:31:46,483 INFO [qpid.test.utils.QpidTestCase] ========== tearDown SeriesDefinitionCreatorTest.testTwoSeriesDefinitions
==========
main 2014-08-15 04:31:46,484 INFO [qpid.test.utils.QpidTestCase] ========== start SeriesDefinitionCreatorTest.testOneSeriesDefinition
==========
main 2014-08-15 04:31:46,485 INFO [qpid.test.utils.QpidTestCase] ========== tearDown SeriesDefinitionCreatorTest.testOneSeriesDefinition
==========
main 2014-08-15 04:31:46,485 INFO [qpid.test.utils.QpidTestCase] ========== start SeriesDefinitionCreatorTest.testNonSequentialSeriesDefinitionsIgnored
==========
main 2014-08-15 04:31:46,486 INFO [qpid.test.utils.QpidTestCase] ========== tearDown SeriesDefinitionCreatorTest.testNonSequentialSeriesDefinitionsIgnored
==========
Tests run: 4, Failures: 0, Errors: 0, Skipped: 0, Time elapsed: 0.011 sec - in org.apache.qpid.disttest.charting.definition.SeriesDefinitionCreatorTest
Running org.apache.qpid.disttest.charting.definition.ChartingDefinitionCreatorTest
main 2014-08-15 04:31:46,488 INFO [qpid.test.utils.QpidTestCase] ========== start ChartingDefinitionCreatorTest.testLoadTwoDefinitionsFromDirectory
==========
main 2014-08-15 04:31:46,493 INFO [qpid.test.utils.QpidTestCase] ========== tearDown ChartingDefinitionCreatorTest.testLoadTwoDefinitionsFromDirectory
==========
main 2014-08-15 04:31:46,493 INFO [qpid.test.utils.QpidTestCase] ========== start ChartingDefinitionCreatorTest.testLoadOneDefinitionFromFile
==========
main 2014-08-15 04:31:46,494 INFO [qpid.test.utils.QpidTestCase] ========== tearDown ChartingDefinitionCreatorTest.testLoadOneDefinitionFromFile
==========
main 2014-08-15 04:31:46,495 INFO [qpid.test.utils.QpidTestCase] ========== start ChartingDefinitionCreatorTest.testDefinitionsProperties
==========
main 2014-08-15 04:31:46,495 INFO [qpid.test.utils.QpidTestCase] Set system property "ChartingDefinitionSysProp"
to: "propValue"
main 2014-08-15 04:31:46,496 INFO [qpid.test.utils.QpidTestCase] ========== tearDown ChartingDefinitionCreatorTest.testDefinitionsProperties
==========
main 2014-08-15 04:31:46,496 DEBUG [qpid.test.utils.QpidTestCase] reverting 1 test properties
main 2014-08-15 04:31:46,496 INFO [qpid.test.utils.QpidTestCase] ========== start ChartingDefinitionCreatorTest.testDefinitionFileNotFound
==========
main 2014-08-15 04:31:46,496 INFO [qpid.test.utils.QpidTestCase] ========== tearDown ChartingDefinitionCreatorTest.testDefinitionFileNotFound
==========
Tests run: 4, Failures: 0, Errors: 0, Skipped: 0, Time elapsed: 0.011 sec - in org.apache.qpid.disttest.charting.definition.ChartingDefinitionCreatorTest
Running org.apache.qpid.disttest.charting.writer.ChartWriterTest
main 2014-08-15 04:31:46,524 INFO [disttest.charting.writer.ChartWriter] Set chart directory:
/tmp/TestFileUtils-testDir-1408077106524
main 2014-08-15 04:31:46,570 INFO [disttest.charting.writer.ChartWriter] Written /tmp/TestFileUtils-testDir-1408077106524/chart1.png
chart
main 2014-08-15 04:31:46,570 INFO [disttest.charting.writer.ChartWriter] Only 1 chart image(s)
have been written so no HTML summary file will be produced
main 2014-08-15 04:31:46,570 INFO [qpid.test.utils.QpidTestCase] ========== tearDown null
==========
main 2014-08-15 04:31:46,571 INFO [disttest.charting.writer.ChartWriter] Set chart directory:
/tmp/TestFileUtils-testDir-1408077106571
main 2014-08-15 04:31:46,609 INFO [disttest.charting.writer.ChartWriter] Written /tmp/TestFileUtils-testDir-1408077106571/chart1.png
chart
main 2014-08-15 04:31:46,609 INFO [qpid.test.utils.QpidTestCase] ========== tearDown null
==========
main 2014-08-15 04:31:46,610 INFO [disttest.charting.writer.ChartWriter] Set chart directory:
/tmp/TestFileUtils-testDir-1408077106610
main 2014-08-15 04:31:46,650 INFO [disttest.charting.writer.ChartWriter] Written /tmp/TestFileUtils-testDir-1408077106610/chart2.png
chart
main 2014-08-15 04:31:46,689 INFO [disttest.charting.writer.ChartWriter] Written /tmp/TestFileUtils-testDir-1408077106610/chart1.png
chart
main 2014-08-15 04:31:46,690 DEBUG [disttest.charting.writer.ChartWriter] About to produce
HTML summary file /tmp/TestFileUtils-testDir-1408077106610/chart-summary.html from charts
{/tmp/TestFileUtils-testDir-1408077106610/chart1.png=Mock for ChartingDefinition, hashCode:
2054787417, /tmp/TestFileUtils-testDir-1408077106610/chart2.png=Mock for ChartingDefinition,
hashCode: 67811496}
main 2014-08-15 04:31:46,698 INFO [qpid.test.utils.QpidTestCase] ========== tearDown null
==========
Tests run: 3, Failures: 0, Errors: 0, Skipped: 0, Time elapsed: 0.201 sec - in org.apache.qpid.disttest.charting.writer.ChartWriterTest

Results :

Tests run: 39, Failures: 0, Errors: 0, Skipped: 0

[INFO] 
[INFO] --- maven-jar-plugin:2.4:jar (default-jar) @ qpid-perftests-visualisation-jfc ---
[INFO] Building jar: /x1/jenkins/jenkins-slave/workspace/Qpid-Java-Java-Test-JDK1.8/trunk/qpid/java/perftests/visualisation-jfc/target/qpid-perftests-visualisation-jfc-0.32-SNAPSHOT.jar
[INFO] 
[INFO] --- maven-site-plugin:3.3:attach-descriptor (attach-descriptor) @ qpid-perftests-visualisation-jfc
---
[INFO] 
[INFO] --- maven-antrun-plugin:1.7:run (create-qbtc-output-dir) @ qpid-perftests-visualisation-jfc
---
[INFO] Executing tasks

main:
    [mkdir] Created dir: /x1/jenkins/jenkins-slave/workspace/Qpid-Java-Java-Test-JDK1.8/trunk/qpid/java/perftests/visualisation-jfc/target/qbtc-output
[INFO] Executed tasks
[INFO] 
[INFO] --- maven-site-plugin:3.3:site (default-site) @ qpid-perftests-visualisation-jfc ---
[INFO] configuring report plugin org.apache.maven.plugins:maven-project-info-reports-plugin:2.7
[INFO] configuring report plugin org.codehaus.mojo:license-maven-plugin:1.6
[INFO] configuring report plugin org.apache.maven.plugins:maven-surefire-report-plugin:2.16
[INFO] configuring report plugin org.apache.maven.plugins:maven-jxr-plugin:2.3
[INFO] configuring report plugin org.jacoco:jacoco-maven-plugin:0.7.0.201403182114
[INFO] Skipping JaCoCo execution due to missing execution data file:/x1/jenkins/jenkins-slave/workspace/Qpid-Java-Java-Test-JDK1.8/trunk/qpid/java/perftests/visualisation-jfc/target/jacoco-it.exec
[INFO] configuring report plugin org.apache.rat:apache-rat-plugin:0.10
[INFO] Parent project loaded from repository: org.apache.qpid:qpid-parent:pom:1.0
[INFO] Parent project loaded from repository: org.apache:apache:pom:14
[INFO] Relativizing decoration links with respect to project URL: http://qpid.apache.org/qpid-java-build/perftests/qpid-perftests-visualisation-jfc
[INFO] Rendering site with org.apache.maven.skins:maven-default-skin:jar:1.0 skin.
[INFO] Generating "About" report    --- maven-project-info-reports-plugin:2.7
[INFO] Generating "Plugin Management" report    --- maven-project-info-reports-plugin:2.7
[INFO] Generating "Distribution Management" report    --- maven-project-info-reports-plugin:2.7
[INFO] Generating "Dependency Information" report    --- maven-project-info-reports-plugin:2.7
[INFO] Generating "Dependency Convergence" report    --- maven-project-info-reports-plugin:2.7
[INFO] Generating "Source Repository" report    --- maven-project-info-reports-plugin:2.7
[INFO] Generating "Mailing Lists" report    --- maven-project-info-reports-plugin:2.7
[INFO] Generating "Issue Tracking" report    --- maven-project-info-reports-plugin:2.7
[INFO] Generating "Continuous Integration" report    --- maven-project-info-reports-plugin:2.7
[INFO] Generating "Project Plugins" report    --- maven-project-info-reports-plugin:2.7
[INFO] Generating "Project License" report    --- maven-project-info-reports-plugin:2.7
[INFO] Generating "Dependency Management" report    --- maven-project-info-reports-plugin:2.7
[INFO] Generating "Project Team" report    --- maven-project-info-reports-plugin:2.7
[INFO] Generating "Project Summary" report    --- maven-project-info-reports-plugin:2.7
[INFO] Generating "Dependencies" report    --- maven-project-info-reports-plugin:2.7
[INFO] Generating "Third Parties" report    --- license-maven-plugin:1.6
[INFO] Generating "Surefire Report" report    --- maven-surefire-report-plugin:2.16
[INFO] Generating "Source Xref" report    --- maven-jxr-plugin:2.3
[INFO] Generating "Test Source Xref" report    --- maven-jxr-plugin:2.3
[INFO] Generating "JaCoCo Test" report    --- jacoco-maven-plugin:0.7.0.201403182114
[INFO] Analyzed bundle 'Qpid Performance Tests Visualisation JFC' with 33 classes
[INFO] Generating "Rat Report" report    --- apache-rat-plugin:0.10
[INFO] 51 implicit excludes (use -debug for more details).
[INFO] Exclude: build/**
[INFO] Exclude: lib/**
[INFO] Exclude: test-profiles/test_resources/ssl/**
[INFO] 43 resources included (use -debug for more details)
Warning:  org.apache.xerces.jaxp.SAXParserImpl$JAXPSAXParser: Property 'http://www.oracle.com/xml/jaxp/properties/entityExpansionLimit'
is not recognized.
Compiler warnings:
  WARNING:  'org.apache.xerces.jaxp.SAXParserImpl: Property 'http://javax.xml.XMLConstants/property/accessExternalDTD'
is not recognized.'
Warning:  org.apache.xerces.parsers.SAXParser: Feature 'http://javax.xml.XMLConstants/feature/secure-processing'
is not recognized.
Warning:  org.apache.xerces.parsers.SAXParser: Property 'http://javax.xml.XMLConstants/property/accessExternalDTD'
is not recognized.
Warning:  org.apache.xerces.parsers.SAXParser: Property 'http://www.oracle.com/xml/jaxp/properties/entityExpansionLimit'
is not recognized.
[INFO] 
[INFO] --- maven-site-plugin:3.3:stage (default-cli) @ qpid-perftests-visualisation-jfc ---
[INFO] Using this base directory for staging: /x1/jenkins/jenkins-slave/workspace/Qpid-Java-Java-Test-JDK1.8/trunk/qpid/java/target/staging
[INFO] Parent project loaded from repository: org.apache.qpid:qpid-parent:pom:1.0
file:///x1/jenkins/jenkins-slave/workspace/Qpid-Java-Java-Test-JDK1.8/trunk/qpid/java/target/staging/
- Session: Opened  
[INFO] Pushing /x1/jenkins/jenkins-slave/workspace/Qpid-Java-Java-Test-JDK1.8/trunk/qpid/java/perftests/visualisation-jfc/target/site
[INFO]    >>> to file:///x1/jenkins/jenkins-slave/workspace/Qpid-Java-Java-Test-JDK1.8/trunk/qpid/java/target/staging/perftests/visualisation-jfc/perftests/qpid-perftests-visualisation-jfc
file:///x1/jenkins/jenkins-slave/workspace/Qpid-Java-Java-Test-JDK1.8/trunk/qpid/java/target/staging/
- Session: Disconnecting  
file:///x1/jenkins/jenkins-slave/workspace/Qpid-Java-Java-Test-JDK1.8/trunk/qpid/java/target/staging/
- Session: Disconnected
[INFO]                                                                         
[INFO] ------------------------------------------------------------------------
[INFO] Skipping Qpid BDB Store System Tests
[INFO] This project has been banned from the build due to previous failures.
[INFO] ------------------------------------------------------------------------
[INFO] ------------------------------------------------------------------------
[INFO] Reactor Summary:
[INFO] 
[INFO] Qpid Java Build ................................... SUCCESS [54.559s]
[INFO] Qpid AMQP 1.0 Common .............................. SUCCESS [5.202s]
[INFO] Qpid AMQP 1.0 Client .............................. SUCCESS [2.170s]
[INFO] Qpid AMQP 1.0 Client JMS .......................... SUCCESS [3.254s]
[INFO] Qpid AMQP 1.0 JMS Client Examples ................. SUCCESS [1.458s]
[INFO] Qpid AMQP 1.0 Client WebSocket .................... SUCCESS [2.177s]
[INFO] Qpid Broker Code Generation ....................... SUCCESS [1.238s]
[INFO] Qpid Test Utilities ............................... SUCCESS [1.296s]
[INFO] Qpid Common ....................................... SUCCESS [32.938s]
[INFO] Qpid Management Common ............................ SUCCESS [2.133s]
[INFO] Qpid Java Broker Core ............................. SUCCESS [1:28.547s]
[INFO] Qpid Access Control Broker Plug-in ................ SUCCESS [3.856s]
[INFO] Qpid AMQP 0-8 Protocol Broker Plug-in ............. SUCCESS [20.044s]
[INFO] Qpid AMQP 0-10 Protocol Plug-in ................... SUCCESS [3.793s]
[INFO] Qpid AMQP 1-0 Protocol Broker Plug-in ............. SUCCESS [1.562s]
[INFO] Qpid AMQP 0-8 to 0-10 Message Conversion Broker Plug-in  SUCCESS [1.877s]
[INFO] Qpid AMQP 0-8 to 1-0 Message Conversion Broker Plug-in  SUCCESS [1.877s]
[INFO] Qpid AMQP 0-10 to 1-0 Message Conversion Broker Plug-in  SUCCESS [1.255s]
[INFO] Qpid Derby Message Store .......................... FAILURE [21.123s]
[INFO] Qpid JDBC Message Store Connection Pooling Plug-in  SUCCESS [1.327s]
[INFO] Qpid JDBC Message Store Broker Plug-in ............ SUCCESS [7.510s]
[INFO] Qpid HTTP Management Broker Plug-in ............... SUCCESS [6.226s]
[INFO] Qpid JMX Management Broker Plug-in ................ SUCCESS [3.858s]
[INFO] Qpid Memory Message Store Broker Plug-in .......... SUCCESS [1.400s]
[INFO] Qpid AMQP 0-x JMS Client .......................... SUCCESS [8.387s]
[INFO] Qpid BDB Message Store ............................ SUCCESS [38.471s]
[INFO] Qpid BDB Message Store JMX ........................ SUCCESS [2.786s]
[INFO] Qpid Java Broker .................................. SKIPPED
[INFO] Qpid AMQP Management Protocol Broker Plug-in ...... SUCCESS [1.125s]
[INFO] Qpid WebSocket Broker Plug-in ..................... SUCCESS [1.285s]
[INFO] Qpid AMQP 0-x JMS Client Examples ................. SUCCESS [1.136s]
[INFO] Qpid JCA .......................................... SUCCESS [3.735s]
[INFO] Qpid Resource Adaptor ............................. SUCCESS [1.432s]
[INFO] Qpid Tools ........................................ SUCCESS [1.721s]
[INFO] Qpid Management Examples .......................... SUCCESS [1.084s]
[INFO] Qpid Java System Test Parent ...................... SUCCESS [24.981s]
[INFO] Qpid System Tests ................................. SKIPPED
[INFO] Qpid Performance Tests ............................ SUCCESS [21.283s]
[INFO] Qpid Performance Test System Tests ................ SKIPPED
[INFO] Qpid Performance Tests Visualisation JFC .......... SUCCESS [5.323s]
[INFO] Qpid BDB Store System Tests ....................... SKIPPED
[INFO] ------------------------------------------------------------------------
[INFO] BUILD FAILURE
[INFO] ------------------------------------------------------------------------
[INFO] Total time: 6:24.257s
[INFO] Finished at: Fri Aug 15 04:31:48 UTC 2014
[INFO] Final Memory: 102M/852M
[INFO] ------------------------------------------------------------------------
[ERROR] Failed to execute goal org.apache.maven.plugins:maven-surefire-plugin:2.16:test (default-test)
on project qpid-broker-plugins-derby-store: There are test failures.
[ERROR] 
[ERROR] Please refer to /x1/jenkins/jenkins-slave/workspace/Qpid-Java-Java-Test-JDK1.8/trunk/qpid/java/broker-plugins/derby-store/target/surefire-reports
for the individual test results.
[ERROR] -> [Help 1]
[ERROR] 
[ERROR] To see the full stack trace of the errors, re-run Maven with the -e switch.
[ERROR] Re-run Maven using the -X switch to enable full debug logging.
[ERROR] 
[ERROR] For more information about the errors and possible solutions, please read the following
articles:
[ERROR] [Help 1] http://cwiki.apache.org/confluence/display/MAVEN/MojoFailureException
[ERROR] 
[ERROR] After correcting the problems, you can resume the build with the command
[ERROR]   mvn <goals> -rf :qpid-broker-plugins-derby-store
Build step 'Invoke top-level Maven targets' marked build as failure
[locks-and-latches] Releasing all the locks
[locks-and-latches] All the locks released
Recording test results

Mime
View raw message