qpid-notifications mailing list archives

Site index · List index
Message view « Date » · « Thread »
Top « Date » · « Thread »
From Apache Jenkins Server <jenk...@builds.apache.org>
Subject Build failed in Jenkins: Qpid-proton-j » proton-tests #602
Date Fri, 13 Jun 2014 21:12:36 GMT
See <https://builds.apache.org/job/Qpid-proton-j/org.apache.qpid$proton-tests/602/changes>

Changes:

[chug] PROTON-606: Python testReclaimCredit exposes test server messenger hang on windows
Move client2 into NBMessengerTest scope and include it in main pump loop.

------------------------------------------
[...truncated 2056 lines...]
	at org.apache.qpid.proton.engine.impl.ssl.SslImpl$UnsecureClientAwareTransportWrapper.initTransportWrapperOnFirstIO(SslImpl.java:218)
	at org.apache.qpid.proton.engine.impl.ssl.SslImpl$UnsecureClientAwareTransportWrapper.pending(SslImpl.java:150)
	... 107 more
Caused by: java.io.FileNotFoundException: <https://builds.apache.org/job/Qpid-proton-j/org.apache.qpid$proton-tests/ws/python/proton_tests/ssl_db/bad>
(No such file or directory)
	at java.io.FileInputStream.open(Native Method)
	at java.io.FileInputStream.<init>(FileInputStream.java:120)
	at java.io.FileInputStream.<init>(FileInputStream.java:79)
	at java.io.FileReader.<init>(FileReader.java:41)
	at org.apache.qpid.proton.engine.impl.ssl.SslEngineFacadeFactory.readPemObject(SslEngineFacadeFactory.java:423)
	... 114 more
 pass
proton_tests.ssl.MessengerSSLTests.test_client_credentials_untrusted ....java.net.BindException:
Address already in use
	at sun.nio.ch.Net.bind(Native Method)
	at sun.nio.ch.ServerSocketChannelImpl.bind(ServerSocketChannelImpl.java:124)
	at sun.nio.ch.ServerSocketAdaptor.bind(ServerSocketAdaptor.java:59)
	at sun.nio.ch.ServerSocketAdaptor.bind(ServerSocketAdaptor.java:52)
	at org.apache.qpid.proton.driver.impl.DriverImpl.createListener(DriverImpl.java:162)
	at org.apache.qpid.proton.messenger.impl.MessengerImpl.subscribe(MessengerImpl.java:547)
	at sun.reflect.GeneratedMethodAccessor177.invoke(Unknown Source)
	at sun.reflect.DelegatingMethodAccessorImpl.invoke(DelegatingMethodAccessorImpl.java:25)
	at java.lang.reflect.Method.invoke(Method.java:597)
	at org.python.core.PyReflectedFunction.__call__(PyReflectedFunction.java:186)
	at org.python.core.PyReflectedFunction.__call__(PyReflectedFunction.java:204)
	at org.python.core.PyObject.__call__(PyObject.java:404)
	at org.python.core.PyObject.__call__(PyObject.java:408)
	at org.python.core.PyMethod.__call__(PyMethod.java:124)
	at cmessenger$py.pn_messenger_subscribe$17(__pyclasspath__/cmessenger.py:105)
	at cmessenger$py.call_function(__pyclasspath__/cmessenger.py)
	at org.python.core.PyTableCode.call(PyTableCode.java:165)
	at org.python.core.PyBaseCode.call(PyBaseCode.java:149)
	at org.python.core.PyFunction.__call__(PyFunction.java:327)
	at proton$py.subscribe$44(<https://builds.apache.org/job/Qpid-proton-j/org.apache.qpid$proton-tests/ws/../proton-c/bindings/python/proton.py>:468)
	at proton$py.call_function(<https://builds.apache.org/job/Qpid-proton-j/org.apache.qpid$proton-tests/ws/../proton-c/bindings/python/proton.py)>
	at org.python.core.PyTableCode.call(PyTableCode.java:165)
	at org.python.core.PyBaseCode.call(PyBaseCode.java:149)
	at org.python.core.PyFunction.__call__(PyFunction.java:327)
	at org.python.core.PyMethod.__call__(PyMethod.java:124)
	at proton_tests.ssl$py.test_client_credentials$38(<https://builds.apache.org/job/Qpid-proton-j/org.apache.qpid$proton-tests/ws/python/proton_tests/ssl.py>:903)
	at proton_tests.ssl$py.call_function(<https://builds.apache.org/job/Qpid-proton-j/org.apache.qpid$proton-tests/ws/python/proton_tests/ssl.py)>
	at org.python.core.PyTableCode.call(PyTableCode.java:165)
	at org.python.core.PyBaseCode.call(PyBaseCode.java:301)
	at org.python.core.PyBaseCode.call(PyBaseCode.java:194)
	at org.python.core.PyFunction.__call__(PyFunction.java:387)
	at org.python.core.PyMethod.instancemethod___call__(PyMethod.java:220)
	at org.python.core.PyMethod.__call__(PyMethod.java:211)
	at proton_tests.ssl$py.test_client_credentials_untrusted$43(<https://builds.apache.org/job/Qpid-proton-j/org.apache.qpid$proton-tests/ws/python/proton_tests/ssl.py>:915)
	at proton_tests.ssl$py.call_function(<https://builds.apache.org/job/Qpid-proton-j/org.apache.qpid$proton-tests/ws/python/proton_tests/ssl.py)>
	at org.python.core.PyTableCode.call(PyTableCode.java:165)
	at org.python.core.PyBaseCode.call(PyBaseCode.java:134)
	at org.python.core.PyFunction.__call__(PyFunction.java:317)
	at org.python.core.PyMethod.__call__(PyMethod.java:109)
	at org.python.pycode._pyx0.run$36(<https://builds.apache.org/job/Qpid-proton-j/org.apache.qpid$proton-tests/ws/python/proton-test>:359)
	at org.python.pycode._pyx0.call_function(<https://builds.apache.org/job/Qpid-proton-j/org.apache.qpid$proton-tests/ws/python/proton-test)>
	at org.python.core.PyTableCode.call(PyTableCode.java:165)
	at org.python.core.PyBaseCode.call(PyBaseCode.java:166)
	at org.python.core.PyFunction.__call__(PyFunction.java:338)
	at org.python.core.PyMethod.__call__(PyMethod.java:139)
	at org.python.pycode._pyx0._run$55(<https://builds.apache.org/job/Qpid-proton-j/org.apache.qpid$proton-tests/ws/python/proton-test>:506)
	at org.python.pycode._pyx0.call_function(<https://builds.apache.org/job/Qpid-proton-j/org.apache.qpid$proton-tests/ws/python/proton-test)>
	at org.python.core.PyTableCode.call(PyTableCode.java:165)
	at org.python.core.PyBaseCode.call(PyBaseCode.java:134)
	at org.python.core.PyFunction.__call__(PyFunction.java:317)
	at org.python.core.PyMethod.__call__(PyMethod.java:109)
	at org.python.pycode._pyx0.run_test$41(<https://builds.apache.org/job/Qpid-proton-j/org.apache.qpid$proton-tests/ws/python/proton-test>:434)
	at org.python.pycode._pyx0.call_function(<https://builds.apache.org/job/Qpid-proton-j/org.apache.qpid$proton-tests/ws/python/proton-test)>
	at org.python.core.PyTableCode.call(PyTableCode.java:165)
	at org.python.core.PyBaseCode.call(PyBaseCode.java:166)
	at org.python.core.PyFunction.__call__(PyFunction.java:338)
	at org.python.pycode._pyx0.run$54(<https://builds.apache.org/job/Qpid-proton-j/org.apache.qpid$proton-tests/ws/python/proton-test>:482)
	at org.python.pycode._pyx0.call_function(<https://builds.apache.org/job/Qpid-proton-j/org.apache.qpid$proton-tests/ws/python/proton-test)>
	at org.python.core.PyTableCode.call(PyTableCode.java:165)
	at org.python.core.PyBaseCode.call(PyBaseCode.java:134)
	at org.python.core.PyFunction.__call__(PyFunction.java:317)
	at org.python.core.PyMethod.__call__(PyMethod.java:109)
	at org.python.pycode._pyx0.runthrough$76(<https://builds.apache.org/job/Qpid-proton-j/org.apache.qpid$proton-tests/ws/python/proton-test>:670)
	at org.python.pycode._pyx0.call_function(<https://builds.apache.org/job/Qpid-proton-j/org.apache.qpid$proton-tests/ws/python/proton-test)>
	at org.python.core.PyTableCode.call(PyTableCode.java:165)
	at org.python.core.PyBaseCode.call(PyBaseCode.java:120)
	at org.python.core.PyFunction.__call__(PyFunction.java:307)
	at org.python.pycode._pyx0.f$0(<https://builds.apache.org/job/Qpid-proton-j/org.apache.qpid$proton-tests/ws/python/proton-test>:687)
	at org.python.pycode._pyx0.call_function(<https://builds.apache.org/job/Qpid-proton-j/org.apache.qpid$proton-tests/ws/python/proton-test)>
	at org.python.core.PyTableCode.call(PyTableCode.java:165)
	at org.python.core.PyCode.call(PyCode.java:18)
	at org.python.core.Py.runCode(Py.java:1275)
	at org.python.core.__builtin__.execfile_flags(__builtin__.java:522)
	at org.python.util.PythonInterpreter.execfile(PythonInterpreter.java:225)
	at org.apache.qpid.proton.JythonTest.runTestOnce(JythonTest.java:103)
	at org.apache.qpid.proton.JythonTest.test(JythonTest.java:95)
	at sun.reflect.NativeMethodAccessorImpl.invoke0(Native Method)
	at sun.reflect.NativeMethodAccessorImpl.invoke(NativeMethodAccessorImpl.java:39)
	at sun.reflect.DelegatingMethodAccessorImpl.invoke(DelegatingMethodAccessorImpl.java:25)
	at java.lang.reflect.Method.invoke(Method.java:597)
	at org.junit.runners.model.FrameworkMethod$1.runReflectiveCall(FrameworkMethod.java:45)
	at org.junit.internal.runners.model.ReflectiveCallable.run(ReflectiveCallable.java:15)
	at org.junit.runners.model.FrameworkMethod.invokeExplosively(FrameworkMethod.java:42)
	at org.junit.internal.runners.statements.InvokeMethod.evaluate(InvokeMethod.java:20)
	at org.junit.runners.ParentRunner.runLeaf(ParentRunner.java:263)
	at org.junit.runners.BlockJUnit4ClassRunner.runChild(BlockJUnit4ClassRunner.java:68)
	at org.junit.runners.BlockJUnit4ClassRunner.runChild(BlockJUnit4ClassRunner.java:47)
	at org.junit.runners.ParentRunner$3.run(ParentRunner.java:231)
	at org.junit.runners.ParentRunner$1.schedule(ParentRunner.java:60)
	at org.junit.runners.ParentRunner.runChildren(ParentRunner.java:229)
	at org.junit.runners.ParentRunner.access$000(ParentRunner.java:50)
	at org.junit.runners.ParentRunner$2.evaluate(ParentRunner.java:222)
	at org.junit.runners.ParentRunner.run(ParentRunner.java:300)
	at org.apache.maven.surefire.junit4.JUnit4Provider.execute(JUnit4Provider.java:252)
	at org.apache.maven.surefire.junit4.JUnit4Provider.executeTestSet(JUnit4Provider.java:141)
	at org.apache.maven.surefire.junit4.JUnit4Provider.invoke(JUnit4Provider.java:112)
	at sun.reflect.NativeMethodAccessorImpl.invoke0(Native Method)
	at sun.reflect.NativeMethodAccessorImpl.invoke(NativeMethodAccessorImpl.java:39)
	at sun.reflect.DelegatingMethodAccessorImpl.invoke(DelegatingMethodAccessorImpl.java:25)
	at java.lang.reflect.Method.invoke(Method.java:597)
	at org.apache.maven.surefire.util.ReflectionUtils.invokeMethodWithArray(ReflectionUtils.java:189)
	at org.apache.maven.surefire.booter.ProviderFactory$ProviderProxy.invoke(ProviderFactory.java:165)
	at org.apache.maven.surefire.booter.ProviderFactory.invokeProvider(ProviderFactory.java:85)
	at org.apache.maven.surefire.booter.ForkedBooter.runSuitesInProcess(ForkedBooter.java:115)
	at org.apache.maven.surefire.booter.ForkedBooter.main(ForkedBooter.java:75)
 fail
Error during teardown:  Traceback (most recent call last):
    File "<https://builds.apache.org/job/Qpid-proton-j/org.apache.qpid$proton-tests/ws/python/proton-test",>
line 352, in run
      phase()
    File "<https://builds.apache.org/job/Qpid-proton-j/org.apache.qpid$proton-tests/ws/python/proton_tests/ssl.py",>
line 810, in teardown
      assert self.client.stopped
  AssertionError
proton_tests.ssl.MessengerSSLTests.test_server_credentials ..............java.net.BindException:
Address already in use
	at sun.nio.ch.Net.bind(Native Method)
	at sun.nio.ch.ServerSocketChannelImpl.bind(ServerSocketChannelImpl.java:124)
	at sun.nio.ch.ServerSocketAdaptor.bind(ServerSocketAdaptor.java:59)
	at sun.nio.ch.ServerSocketAdaptor.bind(ServerSocketAdaptor.java:52)
	at org.apache.qpid.proton.driver.impl.DriverImpl.createListener(DriverImpl.java:162)
	at org.apache.qpid.proton.messenger.impl.MessengerImpl.subscribe(MessengerImpl.java:547)
	at sun.reflect.GeneratedMethodAccessor177.invoke(Unknown Source)
	at sun.reflect.DelegatingMethodAccessorImpl.invoke(DelegatingMethodAccessorImpl.java:25)
	at java.lang.reflect.Method.invoke(Method.java:597)
	at org.python.core.PyReflectedFunction.__call__(PyReflectedFunction.java:186)
	at org.python.core.PyReflectedFunction.__call__(PyReflectedFunction.java:204)
	at org.python.core.PyObject.__call__(PyObject.java:404)
	at org.python.core.PyObject.__call__(PyObject.java:408)
	at org.python.core.PyMethod.__call__(PyMethod.java:124)
	at cmessenger$py.pn_messenger_subscribe$17(__pyclasspath__/cmessenger.py:105)
	at cmessenger$py.call_function(__pyclasspath__/cmessenger.py)
	at org.python.core.PyTableCode.call(PyTableCode.java:165)
	at org.python.core.PyBaseCode.call(PyBaseCode.java:149)
	at org.python.core.PyFunction.__call__(PyFunction.java:327)
	at proton$py.subscribe$44(<https://builds.apache.org/job/Qpid-proton-j/org.apache.qpid$proton-tests/ws/../proton-c/bindings/python/proton.py>:468)
	at proton$py.call_function(<https://builds.apache.org/job/Qpid-proton-j/org.apache.qpid$proton-tests/ws/../proton-c/bindings/python/proton.py)>
	at org.python.core.PyTableCode.call(PyTableCode.java:165)
	at org.python.core.PyBaseCode.call(PyBaseCode.java:149)
	at org.python.core.PyFunction.__call__(PyFunction.java:327)
	at org.python.core.PyMethod.__call__(PyMethod.java:124)
	at proton_tests.ssl$py.test_server_credentials$34(<https://builds.apache.org/job/Qpid-proton-j/org.apache.qpid$proton-tests/ws/python/proton_tests/ssl.py>:839)
	at proton_tests.ssl$py.call_function(<https://builds.apache.org/job/Qpid-proton-j/org.apache.qpid$proton-tests/ws/python/proton_tests/ssl.py)>
	at org.python.core.PyTableCode.call(PyTableCode.java:165)
	at org.python.core.PyBaseCode.call(PyBaseCode.java:301)
	at org.python.core.PyBaseCode.call(PyBaseCode.java:127)
	at org.python.core.PyFunction.__call__(PyFunction.java:317)
	at org.python.core.PyMethod.__call__(PyMethod.java:109)
	at org.python.pycode._pyx0.run$36(<https://builds.apache.org/job/Qpid-proton-j/org.apache.qpid$proton-tests/ws/python/proton-test>:359)
	at org.python.pycode._pyx0.call_function(<https://builds.apache.org/job/Qpid-proton-j/org.apache.qpid$proton-tests/ws/python/proton-test)>
	at org.python.core.PyTableCode.call(PyTableCode.java:165)
	at org.python.core.PyBaseCode.call(PyBaseCode.java:166)
	at org.python.core.PyFunction.__call__(PyFunction.java:338)
	at org.python.core.PyMethod.__call__(PyMethod.java:139)
	at org.python.pycode._pyx0._run$55(<https://builds.apache.org/job/Qpid-proton-j/org.apache.qpid$proton-tests/ws/python/proton-test>:506)
	at org.python.pycode._pyx0.call_function(<https://builds.apache.org/job/Qpid-proton-j/org.apache.qpid$proton-tests/ws/python/proton-test)>
	at org.python.core.PyTableCode.call(PyTableCode.java:165)
	at org.python.core.PyBaseCode.call(PyBaseCode.java:134)
	at org.python.core.PyFunction.__call__(PyFunction.java:317)
	at org.python.core.PyMethod.__call__(PyMethod.java:109)
	at org.python.pycode._pyx0.run_test$41(<https://builds.apache.org/job/Qpid-proton-j/org.apache.qpid$proton-tests/ws/python/proton-test>:434)
	at org.python.pycode._pyx0.call_function(<https://builds.apache.org/job/Qpid-proton-j/org.apache.qpid$proton-tests/ws/python/proton-test)>
	at org.python.core.PyTableCode.call(PyTableCode.java:165)
	at org.python.core.PyBaseCode.call(PyBaseCode.java:166)
	at org.python.core.PyFunction.__call__(PyFunction.java:338)
	at org.python.pycode._pyx0.run$54(<https://builds.apache.org/job/Qpid-proton-j/org.apache.qpid$proton-tests/ws/python/proton-test>:482)
	at org.python.pycode._pyx0.call_function(<https://builds.apache.org/job/Qpid-proton-j/org.apache.qpid$proton-tests/ws/python/proton-test)>
	at org.python.core.PyTableCode.call(PyTableCode.java:165)
	at org.python.core.PyBaseCode.call(PyBaseCode.java:134)
	at org.python.core.PyFunction.__call__(PyFunction.java:317)
	at org.python.core.PyMethod.__call__(PyMethod.java:109)
	at org.python.pycode._pyx0.runthrough$76(<https://builds.apache.org/job/Qpid-proton-j/org.apache.qpid$proton-tests/ws/python/proton-test>:670)
	at org.python.pycode._pyx0.call_function(<https://builds.apache.org/job/Qpid-proton-j/org.apache.qpid$proton-tests/ws/python/proton-test)>
	at org.python.core.PyTableCode.call(PyTableCode.java:165)
	at org.python.core.PyBaseCode.call(PyBaseCode.java:120)
	at org.python.core.PyFunction.__call__(PyFunction.java:307)
	at org.python.pycode._pyx0.f$0(<https://builds.apache.org/job/Qpid-proton-j/org.apache.qpid$proton-tests/ws/python/proton-test>:687)
	at org.python.pycode._pyx0.call_function(<https://builds.apache.org/job/Qpid-proton-j/org.apache.qpid$proton-tests/ws/python/proton-test)>
	at org.python.core.PyTableCode.call(PyTableCode.java:165)
	at org.python.core.PyCode.call(PyCode.java:18)
	at org.python.core.Py.runCode(Py.java:1275)
	at org.python.core.__builtin__.execfile_flags(__builtin__.java:522)
	at org.python.util.PythonInterpreter.execfile(PythonInterpreter.java:225)
	at org.apache.qpid.proton.JythonTest.runTestOnce(JythonTest.java:103)
	at org.apache.qpid.proton.JythonTest.test(JythonTest.java:95)
	at sun.reflect.NativeMethodAccessorImpl.invoke0(Native Method)
	at sun.reflect.NativeMethodAccessorImpl.invoke(NativeMethodAccessorImpl.java:39)
	at sun.reflect.DelegatingMethodAccessorImpl.invoke(DelegatingMethodAccessorImpl.java:25)
	at java.lang.reflect.Method.invoke(Method.java:597)
	at org.junit.runners.model.FrameworkMethod$1.runReflectiveCall(FrameworkMethod.java:45)
	at org.junit.internal.runners.model.ReflectiveCallable.run(ReflectiveCallable.java:15)
	at org.junit.runners.model.FrameworkMethod.invokeExplosively(FrameworkMethod.java:42)
	at org.junit.internal.runners.statements.InvokeMethod.evaluate(InvokeMethod.java:20)
	at org.junit.runners.ParentRunner.runLeaf(ParentRunner.java:263)
	at org.junit.runners.BlockJUnit4ClassRunner.runChild(BlockJUnit4ClassRunner.java:68)
	at org.junit.runners.BlockJUnit4ClassRunner.runChild(BlockJUnit4ClassRunner.java:47)
	at org.junit.runners.ParentRunner$3.run(ParentRunner.java:231)
	at org.junit.runners.ParentRunner$1.schedule(ParentRunner.java:60)
	at org.junit.runners.ParentRunner.runChildren(ParentRunner.java:229)
	at org.junit.runners.ParentRunner.access$000(ParentRunner.java:50)
	at org.junit.runners.ParentRunner$2.evaluate(ParentRunner.java:222)
	at org.junit.runners.ParentRunner.run(ParentRunner.java:300)
	at org.apache.maven.surefire.junit4.JUnit4Provider.execute(JUnit4Provider.java:252)
	at org.apache.maven.surefire.junit4.JUnit4Provider.executeTestSet(JUnit4Provider.java:141)
	at org.apache.maven.surefire.junit4.JUnit4Provider.invoke(JUnit4Provider.java:112)
	at sun.reflect.NativeMethodAccessorImpl.invoke0(Native Method)
	at sun.reflect.NativeMethodAccessorImpl.invoke(NativeMethodAccessorImpl.java:39)
	at sun.reflect.DelegatingMethodAccessorImpl.invoke(DelegatingMethodAccessorImpl.java:25)
	at java.lang.reflect.Method.invoke(Method.java:597)
	at org.apache.maven.surefire.util.ReflectionUtils.invokeMethodWithArray(ReflectionUtils.java:189)
	at org.apache.maven.surefire.booter.ProviderFactory$ProviderProxy.invoke(ProviderFactory.java:165)
	at org.apache.maven.surefire.booter.ProviderFactory.invokeProvider(ProviderFactory.java:85)
	at org.apache.maven.surefire.booter.ForkedBooter.runSuitesInProcess(ForkedBooter.java:115)
	at org.apache.maven.surefire.booter.ForkedBooter.main(ForkedBooter.java:75)
 pass
proton_tests.ssl.MessengerSSLTests.test_server_credentials_bad_cert ..... skip
  Skipped
proton_tests.ssl.MessengerSSLTests.test_server_credentials_bad_key ...... skip
  Skipped
proton_tests.ssl.MessengerSSLTests.test_server_credentials_bad_password . skip
  Skipped
proton_tests.ssl.SslTest. \
    test_allow_unsecured_client_which_connects_secured .................. pass
proton_tests.ssl.SslTest. \
    test_allow_unsecured_client_which_connects_unsecured ................ pass
proton_tests.ssl.SslTest.test_bad_server_certificate .................... pass
proton_tests.ssl.SslTest.test_client_authentication ..................... pass
proton_tests.ssl.SslTest.test_client_authentication_fail_bad_cert ....... pass
proton_tests.ssl.SslTest.test_client_authentication_fail_no_cert ........ pass
proton_tests.ssl.SslTest.test_client_server_authentication .............. pass
proton_tests.ssl.SslTest.test_defaults .................................. pass
proton_tests.ssl.SslTest.test_disallow_unsecured_client ................. pass
proton_tests.ssl.SslTest.test_multiple_sessions .........................Killed

Results :

Tests run: 8, Failures: 0, Errors: 0, Skipped: 0

[JENKINS] Recording test results
[JENKINS] Archiving disabled

Mime
View raw message