qpid-notifications mailing list archives

Site index · List index
Message view « Date » · « Thread »
Top « Date » · « Thread »
From Apache Jenkins Server <jenk...@builds.apache.org>
Subject Build failed in Jenkins: Qpid-Java-Java-Test-JDK1.8 #774
Date Fri, 27 Jun 2014 10:15:49 GMT
See <https://builds.apache.org/job/Qpid-Java-Java-Test-JDK1.8/774/>

------------------------------------------
[...truncated 20992 lines...]
main 2014-06-27 10:14:41,381 INFO [qpid.test.utils.QpidTestCase] ========== tearDown SeriesDefinitionCreatorTest.testNonSequentialSeriesDefinitionsIgnored
==========
Tests run: 4, Failures: 0, Errors: 0, Skipped: 0, Time elapsed: 0.007 sec - in org.apache.qpid.disttest.charting.definition.SeriesDefinitionCreatorTest
Running org.apache.qpid.disttest.charting.writer.ChartWriterTest
main 2014-06-27 10:14:41,979 INFO [disttest.charting.writer.ChartWriter] Set chart directory:
/tmp/TestFileUtils-testDir-1403864081969
main 2014-06-27 10:14:43,790 INFO [disttest.charting.writer.ChartWriter] Written /tmp/TestFileUtils-testDir-1403864081969/chart1.png
chart
main 2014-06-27 10:14:43,790 INFO [disttest.charting.writer.ChartWriter] Only 1 chart image(s)
have been written so no HTML summary file will be produced
main 2014-06-27 10:14:43,791 INFO [qpid.test.utils.QpidTestCase] ========== tearDown null
==========
main 2014-06-27 10:14:43,792 INFO [disttest.charting.writer.ChartWriter] Set chart directory:
/tmp/TestFileUtils-testDir-1403864083792
main 2014-06-27 10:14:43,846 INFO [disttest.charting.writer.ChartWriter] Written /tmp/TestFileUtils-testDir-1403864083792/chart1.png
chart
main 2014-06-27 10:14:43,846 INFO [qpid.test.utils.QpidTestCase] ========== tearDown null
==========
main 2014-06-27 10:14:43,848 INFO [disttest.charting.writer.ChartWriter] Set chart directory:
/tmp/TestFileUtils-testDir-1403864083848
main 2014-06-27 10:14:43,910 INFO [disttest.charting.writer.ChartWriter] Written /tmp/TestFileUtils-testDir-1403864083848/chart2.png
chart
main 2014-06-27 10:14:43,958 INFO [disttest.charting.writer.ChartWriter] Written /tmp/TestFileUtils-testDir-1403864083848/chart1.png
chart
main 2014-06-27 10:14:43,959 DEBUG [disttest.charting.writer.ChartWriter] About to produce
HTML summary file /tmp/TestFileUtils-testDir-1403864083848/chart-summary.html from charts
{/tmp/TestFileUtils-testDir-1403864083848/chart1.png=Mock for ChartingDefinition, hashCode:
1237598030, /tmp/TestFileUtils-testDir-1403864083848/chart2.png=Mock for ChartingDefinition,
hashCode: 688766789}
main 2014-06-27 10:14:43,973 INFO [qpid.test.utils.QpidTestCase] ========== tearDown null
==========
Tests run: 3, Failures: 0, Errors: 0, Skipped: 0, Time elapsed: 2.592 sec - in org.apache.qpid.disttest.charting.writer.ChartWriterTest
Running org.apache.qpid.disttest.charting.chartbuilder.ChartProductionTest
main 2014-06-27 10:14:43,982 INFO [qpid.test.utils.QpidTestCase] ========== start ChartProductionTest.testLine3DChart
==========
main 2014-06-27 10:14:43,983 INFO [disttest.charting.writer.ChartWriter] Set chart directory:
/tmp/charts-1403864083983
main 2014-06-27 10:14:44,122 INFO [disttest.charting.writer.ChartWriter] Written /tmp/charts-1403864083983/testLine3DChart.png
chart
main 2014-06-27 10:14:44,122 INFO [qpid.test.utils.QpidTestCase] ========== tearDown ChartProductionTest.testLine3DChart
==========
main 2014-06-27 10:14:44,123 INFO [qpid.test.utils.QpidTestCase] ========== start ChartProductionTest.testXYLineChart
==========
main 2014-06-27 10:14:44,124 INFO [disttest.charting.writer.ChartWriter] Set chart directory:
/tmp/charts-1403864084124
main 2014-06-27 10:14:44,212 INFO [disttest.charting.writer.ChartWriter] Written /tmp/charts-1403864084124/testXYLineChart.png
chart
main 2014-06-27 10:14:44,212 INFO [qpid.test.utils.QpidTestCase] ========== tearDown ChartProductionTest.testXYLineChart
==========
main 2014-06-27 10:14:44,213 INFO [qpid.test.utils.QpidTestCase] ========== start ChartProductionTest.testStatisticalBarChart
==========
main 2014-06-27 10:14:44,214 INFO [disttest.charting.writer.ChartWriter] Set chart directory:
/tmp/charts-1403864084214
main 2014-06-27 10:14:44,278 INFO [disttest.charting.writer.ChartWriter] Written /tmp/charts-1403864084214/testStatisticalBarChart.png
chart
main 2014-06-27 10:14:44,278 INFO [qpid.test.utils.QpidTestCase] ========== tearDown ChartProductionTest.testStatisticalBarChart
==========
main 2014-06-27 10:14:44,279 INFO [qpid.test.utils.QpidTestCase] ========== start ChartProductionTest.testLineChart
==========
main 2014-06-27 10:14:44,280 INFO [disttest.charting.writer.ChartWriter] Set chart directory:
/tmp/charts-1403864084280
main 2014-06-27 10:14:44,342 INFO [disttest.charting.writer.ChartWriter] Written /tmp/charts-1403864084280/testLineChart.png
chart
main 2014-06-27 10:14:44,342 INFO [qpid.test.utils.QpidTestCase] ========== tearDown ChartProductionTest.testLineChart
==========
main 2014-06-27 10:14:44,343 INFO [qpid.test.utils.QpidTestCase] ========== start ChartProductionTest.testBarChart
==========
main 2014-06-27 10:14:44,344 INFO [disttest.charting.writer.ChartWriter] Set chart directory:
/tmp/charts-1403864084344
main 2014-06-27 10:14:44,400 INFO [disttest.charting.writer.ChartWriter] Written /tmp/charts-1403864084344/testBarChart.png
chart
main 2014-06-27 10:14:44,400 INFO [qpid.test.utils.QpidTestCase] ========== tearDown ChartProductionTest.testBarChart
==========
main 2014-06-27 10:14:44,401 INFO [qpid.test.utils.QpidTestCase] ========== start ChartProductionTest.testBar3DChart
==========
main 2014-06-27 10:14:44,401 INFO [disttest.charting.writer.ChartWriter] Set chart directory:
/tmp/charts-1403864084401
main 2014-06-27 10:14:44,459 INFO [disttest.charting.writer.ChartWriter] Written /tmp/charts-1403864084401/testBar3DChart.png
chart
main 2014-06-27 10:14:44,459 INFO [qpid.test.utils.QpidTestCase] ========== tearDown ChartProductionTest.testBar3DChart
==========
main 2014-06-27 10:14:44,459 INFO [qpid.test.utils.QpidTestCase] ========== start ChartProductionTest.testTimeSeriesLineChart
==========
main 2014-06-27 10:14:44,460 INFO [disttest.charting.writer.ChartWriter] Set chart directory:
/tmp/charts-1403864084460
main 2014-06-27 10:14:44,556 INFO [disttest.charting.writer.ChartWriter] Written /tmp/charts-1403864084460/testTimeSeriesLineChart.png
chart
main 2014-06-27 10:14:44,556 INFO [qpid.test.utils.QpidTestCase] ========== tearDown ChartProductionTest.testTimeSeriesLineChart
==========
main 2014-06-27 10:14:44,556 INFO [qpid.test.utils.QpidTestCase] ========== start ChartProductionTest.testXYLineChartWithColourAndWidth
==========
main 2014-06-27 10:14:44,557 INFO [disttest.charting.writer.ChartWriter] Set chart directory:
/tmp/charts-1403864084557
main 2014-06-27 10:14:44,617 INFO [disttest.charting.writer.ChartWriter] Written /tmp/charts-1403864084557/testXYLineChartWithColourAndWidth.png
chart
main 2014-06-27 10:14:44,617 INFO [qpid.test.utils.QpidTestCase] ========== tearDown ChartProductionTest.testXYLineChartWithColourAndWidth
==========
Tests run: 8, Failures: 0, Errors: 0, Skipped: 0, Time elapsed: 0.643 sec - in org.apache.qpid.disttest.charting.chartbuilder.ChartProductionTest
Running org.apache.qpid.disttest.charting.chartbuilder.BaseChartBuilderTest
main 2014-06-27 10:14:44,645 INFO [qpid.test.utils.QpidTestCase] ========== start BaseChartBuilderTest.testBuildChart
==========
main 2014-06-27 10:14:44,654 INFO [qpid.test.utils.QpidTestCase] ========== tearDown BaseChartBuilderTest.testBuildChart
==========
Tests run: 1, Failures: 0, Errors: 0, Skipped: 0, Time elapsed: 0.036 sec - in org.apache.qpid.disttest.charting.chartbuilder.BaseChartBuilderTest
Running org.apache.qpid.disttest.charting.chartbuilder.TimeSeriesBuilderCallbackTest
main 2014-06-27 10:14:44,656 INFO [qpid.test.utils.QpidTestCase] ========== start TimeSeriesBuilderCallbackTest.testAddPointToSeries
==========
main 2014-06-27 10:14:44,657 INFO [qpid.test.utils.QpidTestCase] ========== tearDown TimeSeriesBuilderCallbackTest.testAddPointToSeries
==========
Tests run: 1, Failures: 0, Errors: 0, Skipped: 0, Time elapsed: 0.002 sec - in org.apache.qpid.disttest.charting.chartbuilder.TimeSeriesBuilderCallbackTest
Running org.apache.qpid.disttest.charting.chartbuilder.ColorFactoryTest
main 2014-06-27 10:14:44,658 INFO [qpid.test.utils.QpidTestCase] ========== start ColorFactoryTest.testDarkBlue
==========
main 2014-06-27 10:14:44,659 INFO [qpid.test.utils.QpidTestCase] ========== tearDown ColorFactoryTest.testDarkBlue
==========
main 2014-06-27 10:14:44,659 INFO [qpid.test.utils.QpidTestCase] ========== start ColorFactoryTest.testBlue
==========
main 2014-06-27 10:14:44,659 INFO [qpid.test.utils.QpidTestCase] ========== tearDown ColorFactoryTest.testBlue
==========
Tests run: 2, Failures: 0, Errors: 0, Skipped: 0, Time elapsed: 0.001 sec - in org.apache.qpid.disttest.charting.chartbuilder.ColorFactoryTest
Running org.apache.qpid.disttest.charting.chartbuilder.ChartBuilderFactoryTest
main 2014-06-27 10:14:44,661 INFO [qpid.test.utils.QpidTestCase] ========== start ChartBuilderFactoryTest.testXYLineChart
==========
main 2014-06-27 10:14:44,661 INFO [qpid.test.utils.QpidTestCase] ========== tearDown ChartBuilderFactoryTest.testXYLineChart
==========
main 2014-06-27 10:14:44,662 INFO [qpid.test.utils.QpidTestCase] ========== start ChartBuilderFactoryTest.testLineChart
==========
main 2014-06-27 10:14:44,662 INFO [qpid.test.utils.QpidTestCase] ========== tearDown ChartBuilderFactoryTest.testLineChart
==========
main 2014-06-27 10:14:44,662 INFO [qpid.test.utils.QpidTestCase] ========== start ChartBuilderFactoryTest.testBarChart
==========
main 2014-06-27 10:14:44,663 INFO [qpid.test.utils.QpidTestCase] ========== tearDown ChartBuilderFactoryTest.testBarChart
==========
main 2014-06-27 10:14:44,663 INFO [qpid.test.utils.QpidTestCase] ========== start ChartBuilderFactoryTest.testTimeSeriesLineChart
==========
main 2014-06-27 10:14:44,663 INFO [qpid.test.utils.QpidTestCase] ========== tearDown ChartBuilderFactoryTest.testTimeSeriesLineChart
==========
main 2014-06-27 10:14:44,663 INFO [qpid.test.utils.QpidTestCase] ========== start ChartBuilderFactoryTest.testLineChart3D
==========
main 2014-06-27 10:14:44,663 INFO [qpid.test.utils.QpidTestCase] ========== tearDown ChartBuilderFactoryTest.testLineChart3D
==========
main 2014-06-27 10:14:44,664 INFO [qpid.test.utils.QpidTestCase] ========== start ChartBuilderFactoryTest.testBarChart3D
==========
main 2014-06-27 10:14:44,664 INFO [qpid.test.utils.QpidTestCase] ========== tearDown ChartBuilderFactoryTest.testBarChart3D
==========
Tests run: 6, Failures: 0, Errors: 0, Skipped: 0, Time elapsed: 0.004 sec - in org.apache.qpid.disttest.charting.chartbuilder.ChartBuilderFactoryTest
Running org.apache.qpid.disttest.charting.seriesbuilder.JdbcUrlGeneratorTest
main 2014-06-27 10:14:44,665 INFO [qpid.test.utils.QpidTestCase] ========== start JdbcUrlGeneratorTest.testGetJdbcUrlWithoutProvidingAUrlReturnsCsvUrlWithCorrectDirectory
==========
main 2014-06-27 10:14:44,670 INFO [qpid.test.utils.QpidTestCase] ========== tearDown JdbcUrlGeneratorTest.testGetJdbcUrlWithoutProvidingAUrlReturnsCsvUrlWithCorrectDirectory
==========
main 2014-06-27 10:14:44,671 INFO [qpid.test.utils.QpidTestCase] ========== start JdbcUrlGeneratorTest.testGetJdbcUrlThrowsExceptionWithoutAProvidedUrlOrSeriesDirectory
==========
main 2014-06-27 10:14:44,671 INFO [qpid.test.utils.QpidTestCase] ========== tearDown JdbcUrlGeneratorTest.testGetJdbcUrlThrowsExceptionWithoutAProvidedUrlOrSeriesDirectory
==========
main 2014-06-27 10:14:44,672 INFO [qpid.test.utils.QpidTestCase] ========== start JdbcUrlGeneratorTest.testGetJdbcUrlThrowsExceptionIfUrlProvidedAndSeriesDirectorySpecified
==========
main 2014-06-27 10:14:44,672 INFO [qpid.test.utils.QpidTestCase] ========== tearDown JdbcUrlGeneratorTest.testGetJdbcUrlThrowsExceptionIfUrlProvidedAndSeriesDirectorySpecified
==========
main 2014-06-27 10:14:44,672 INFO [qpid.test.utils.QpidTestCase] ========== start JdbcUrlGeneratorTest.testGetJdbcUrlReturnsProvidedUrl
==========
main 2014-06-27 10:14:44,672 INFO [qpid.test.utils.QpidTestCase] ========== tearDown JdbcUrlGeneratorTest.testGetJdbcUrlReturnsProvidedUrl
==========
Tests run: 4, Failures: 0, Errors: 0, Skipped: 0, Time elapsed: 0.009 sec - in org.apache.qpid.disttest.charting.seriesbuilder.JdbcUrlGeneratorTest
Running org.apache.qpid.disttest.charting.seriesbuilder.JdbcSeriesBuilderTest
main 2014-06-27 10:14:44,674 INFO [qpid.test.utils.QpidTestCase] ========== start JdbcSeriesBuilderTest.testBuildOneSeries
==========
main 2014-06-27 10:14:44,699 INFO [disttest.charting.seriesbuilder.JdbcSeriesBuilder] Loaded
JDBC driver class org.relique.jdbc.csv.CsvDriver
main 2014-06-27 10:14:44,707 INFO [disttest.charting.seriesbuilder.JdbcSeriesBuilder] Created:
JdbcSeriesBuilder[jdbcUrlGenerator=JdbcUrlGenerator[providedJdbdUrl=<null>]]
main 2014-06-27 10:14:44,754 INFO [qpid.test.utils.QpidTestCase] ========== tearDown JdbcSeriesBuilderTest.testBuildOneSeries
==========
Tests run: 1, Failures: 0, Errors: 0, Skipped: 0, Time elapsed: 0.082 sec - in org.apache.qpid.disttest.charting.seriesbuilder.JdbcSeriesBuilderTest
Running org.apache.qpid.disttest.charting.seriesbuilder.SeriesRowTest
main 2014-06-27 10:14:44,756 INFO [qpid.test.utils.QpidTestCase] ========== start SeriesRowTest.testValidSeriesRowThrowsExceptionIfArrayTooSmall
==========
main 2014-06-27 10:14:44,756 INFO [qpid.test.utils.QpidTestCase] ========== tearDown SeriesRowTest.testValidSeriesRowThrowsExceptionIfArrayTooSmall
==========
main 2014-06-27 10:14:44,757 INFO [qpid.test.utils.QpidTestCase] ========== start SeriesRowTest.testDimension
==========
main 2014-06-27 10:14:44,757 INFO [qpid.test.utils.QpidTestCase] ========== tearDown SeriesRowTest.testDimension
==========
main 2014-06-27 10:14:44,757 INFO [qpid.test.utils.QpidTestCase] ========== start SeriesRowTest.testDimensionAsDouble
==========
main 2014-06-27 10:14:44,757 INFO [qpid.test.utils.QpidTestCase] ========== tearDown SeriesRowTest.testDimensionAsDouble
==========
main 2014-06-27 10:14:44,758 INFO [qpid.test.utils.QpidTestCase] ========== start SeriesRowTest.testDimensionAsString
==========
main 2014-06-27 10:14:44,758 INFO [qpid.test.utils.QpidTestCase] ========== tearDown SeriesRowTest.testDimensionAsString
==========
main 2014-06-27 10:14:44,758 INFO [qpid.test.utils.QpidTestCase] ========== start SeriesRowTest.testValidSeriesRow
==========
main 2014-06-27 10:14:44,758 INFO [qpid.test.utils.QpidTestCase] ========== tearDown SeriesRowTest.testValidSeriesRow
==========
Tests run: 5, Failures: 0, Errors: 0, Skipped: 0, Time elapsed: 0.003 sec - in org.apache.qpid.disttest.charting.seriesbuilder.SeriesRowTest

Results :

Tests run: 39, Failures: 0, Errors: 0, Skipped: 0

[INFO] 
[INFO] --- maven-jar-plugin:2.4:jar (default-jar) @ qpid-perftests-visualisation-jfc ---
[INFO] Building jar: /home/hudson/jenkins-slave/workspace/Qpid-Java-Java-Test-JDK1.8/trunk/qpid/java/perftests/visualisation-jfc/target/qpid-perftests-visualisation-jfc-0.30-SNAPSHOT.jar
[INFO] 
[INFO] --- maven-site-plugin:3.3:attach-descriptor (attach-descriptor) @ qpid-perftests-visualisation-jfc
---
[INFO] 
[INFO] --- maven-antrun-plugin:1.7:run (create-qbtc-output-dir) @ qpid-perftests-visualisation-jfc
---
[INFO] Executing tasks

main:
    [mkdir] Created dir: /home/hudson/jenkins-slave/workspace/Qpid-Java-Java-Test-JDK1.8/trunk/qpid/java/perftests/visualisation-jfc/target/qbtc-output
[INFO] Executed tasks
[INFO] 
[INFO] --- maven-site-plugin:3.3:site (default-site) @ qpid-perftests-visualisation-jfc ---
[INFO] configuring report plugin org.apache.maven.plugins:maven-project-info-reports-plugin:2.7
[INFO] configuring report plugin org.codehaus.mojo:license-maven-plugin:1.6
[INFO] configuring report plugin org.apache.maven.plugins:maven-surefire-report-plugin:2.16
[INFO] configuring report plugin org.apache.maven.plugins:maven-jxr-plugin:2.3
[INFO] configuring report plugin org.jacoco:jacoco-maven-plugin:0.7.0.201403182114
[INFO] Skipping JaCoCo execution due to missing execution data file:/home/hudson/jenkins-slave/workspace/Qpid-Java-Java-Test-JDK1.8/trunk/qpid/java/perftests/visualisation-jfc/target/jacoco-it.exec
[INFO] Skipping JaCoCo execution due to missing execution data file:/home/hudson/jenkins-slave/workspace/Qpid-Java-Java-Test-JDK1.8/trunk/qpid/java/perftests/visualisation-jfc/target/jacoco.exec
[INFO] configuring report plugin org.apache.rat:apache-rat-plugin:0.10
[INFO] Parent project loaded from repository: org.apache.qpid:qpid-parent:pom:1.0
[INFO] Parent project loaded from repository: org.apache:apache:pom:14
[INFO] Relativizing decoration links with respect to project URL: http://qpid.apache.org/qpid-java-build/perftests/qpid-perftests-visualisation-jfc
[INFO] Rendering site with org.apache.maven.skins:maven-default-skin:jar:1.0 skin.
[INFO] Generating "About" report    --- maven-project-info-reports-plugin:2.7
[INFO] Generating "Plugin Management" report    --- maven-project-info-reports-plugin:2.7
[INFO] Generating "Distribution Management" report    --- maven-project-info-reports-plugin:2.7
[INFO] Generating "Dependency Information" report    --- maven-project-info-reports-plugin:2.7
[INFO] Generating "Dependency Convergence" report    --- maven-project-info-reports-plugin:2.7
[INFO] Generating "Source Repository" report    --- maven-project-info-reports-plugin:2.7
[INFO] Generating "Mailing Lists" report    --- maven-project-info-reports-plugin:2.7
[INFO] Generating "Issue Tracking" report    --- maven-project-info-reports-plugin:2.7
[INFO] Generating "Continuous Integration" report    --- maven-project-info-reports-plugin:2.7
[INFO] Generating "Project Plugins" report    --- maven-project-info-reports-plugin:2.7
[INFO] Generating "Project License" report    --- maven-project-info-reports-plugin:2.7
[INFO] Generating "Dependency Management" report    --- maven-project-info-reports-plugin:2.7
[INFO] Generating "Project Team" report    --- maven-project-info-reports-plugin:2.7
[INFO] Generating "Project Summary" report    --- maven-project-info-reports-plugin:2.7
[INFO] Generating "Dependencies" report    --- maven-project-info-reports-plugin:2.7
[INFO] Generating "Third Parties" report    --- license-maven-plugin:1.6
[INFO] Generating "Surefire Report" report    --- maven-surefire-report-plugin:2.16
[INFO] Generating "Source Xref" report    --- maven-jxr-plugin:2.3
[INFO] Generating "Test Source Xref" report    --- maven-jxr-plugin:2.3
[INFO] Generating "Rat Report" report    --- apache-rat-plugin:0.10
[INFO] 51 implicit excludes (use -debug for more details).
[INFO] Exclude: build/**
[INFO] Exclude: lib/**
[INFO] Exclude: test-profiles/test_resources/ssl/**
[INFO] 43 resources included (use -debug for more details)
Warning:  org.apache.xerces.jaxp.SAXParserImpl$JAXPSAXParser: Property 'http://www.oracle.com/xml/jaxp/properties/entityExpansionLimit'
is not recognized.
Compiler warnings:
  WARNING:  'org.apache.xerces.jaxp.SAXParserImpl: Property 'http://javax.xml.XMLConstants/property/accessExternalDTD'
is not recognized.'
Warning:  org.apache.xerces.parsers.SAXParser: Feature 'http://javax.xml.XMLConstants/feature/secure-processing'
is not recognized.
Warning:  org.apache.xerces.parsers.SAXParser: Property 'http://javax.xml.XMLConstants/property/accessExternalDTD'
is not recognized.
Warning:  org.apache.xerces.parsers.SAXParser: Property 'http://www.oracle.com/xml/jaxp/properties/entityExpansionLimit'
is not recognized.
[INFO] 
[INFO] --- maven-site-plugin:3.3:stage (default-cli) @ qpid-perftests-visualisation-jfc ---
[INFO] Using this base directory for staging: /home/hudson/jenkins-slave/workspace/Qpid-Java-Java-Test-JDK1.8/trunk/qpid/java/target/staging
[INFO] Parent project loaded from repository: org.apache.qpid:qpid-parent:pom:1.0
file:///home/hudson/jenkins-slave/workspace/Qpid-Java-Java-Test-JDK1.8/trunk/qpid/java/target/staging/
- Session: Opened  
[INFO] Pushing /home/hudson/jenkins-slave/workspace/Qpid-Java-Java-Test-JDK1.8/trunk/qpid/java/perftests/visualisation-jfc/target/site
[INFO]    >>> to file:///home/hudson/jenkins-slave/workspace/Qpid-Java-Java-Test-JDK1.8/trunk/qpid/java/target/staging/perftests/visualisation-jfc/perftests/qpid-perftests-visualisation-jfc
file:///home/hudson/jenkins-slave/workspace/Qpid-Java-Java-Test-JDK1.8/trunk/qpid/java/target/staging/
- Session: Disconnecting  
file:///home/hudson/jenkins-slave/workspace/Qpid-Java-Java-Test-JDK1.8/trunk/qpid/java/target/staging/
- Session: Disconnected
[INFO]                                                                         
[INFO] ------------------------------------------------------------------------
[INFO] Skipping Qpid BDB Store System Tests
[INFO] This project has been banned from the build due to previous failures.
[INFO] ------------------------------------------------------------------------
[INFO] ------------------------------------------------------------------------
[INFO] Reactor Summary:
[INFO] 
[INFO] Qpid Java Build ................................... SUCCESS [52.737s]
[INFO] Qpid AMQP 1.0 Common .............................. SUCCESS [15.146s]
[INFO] Qpid AMQP 1.0 Client .............................. SUCCESS [2.449s]
[INFO] Qpid AMQP 1.0 Client JMS .......................... SUCCESS [4.922s]
[INFO] Qpid AMQP 1.0 Client WebSocket .................... SUCCESS [4.617s]
[INFO] Qpid Broker Code Generation ....................... SUCCESS [2.621s]
[INFO] Qpid Test Utilities ............................... SUCCESS [4.139s]
[INFO] Qpid Common ....................................... SUCCESS [29.973s]
[INFO] Qpid Management Common ............................ SUCCESS [2.396s]
[INFO] Qpid Java Broker Core ............................. SUCCESS [1:05.942s]
[INFO] Qpid Access Control Broker Plug-in ................ SUCCESS [4.126s]
[INFO] Qpid AMQP 0-8 Protocol Broker Plug-in ............. SUCCESS [20.063s]
[INFO] Qpid AMQP 0-10 Protocol Plug-in ................... SUCCESS [4.869s]
[INFO] Qpid AMQP 1-0 Protocol Broker Plug-in ............. SUCCESS [2.144s]
[INFO] Qpid AMQP 0-8 to 0-10 Message Conversion Broker Plug-in  SUCCESS [2.401s]
[INFO] Qpid AMQP 0-8 to 1-0 Message Conversion Broker Plug-in  SUCCESS [1.900s]
[INFO] Qpid AMQP 0-10 to 1-0 Message Conversion Broker Plug-in  SUCCESS [1.789s]
[INFO] Qpid Derby Message Store .......................... SUCCESS [2:21.304s]
[INFO] Qpid JDBC Message Store Connection Pooling Plug-in  SUCCESS [2.557s]
[INFO] Qpid JDBC Message Store Broker Plug-in ............ SUCCESS [7.479s]
[INFO] Qpid HTTP Management Broker Plug-in ............... SUCCESS [5.904s]
[INFO] Qpid JMX Management Broker Plug-in ................ SUCCESS [5.541s]
[INFO] Qpid Memory Message Store Broker Plug-in .......... SUCCESS [2.541s]
[INFO] Qpid AMQP 0-x JMS Client .......................... SUCCESS [7.774s]
[INFO] Qpid BDB Message Store ............................ SUCCESS [9.952s]
[INFO] Qpid BDB Message Store JMX ........................ SUCCESS [4.116s]
[INFO] Qpid Java Broker .................................. SUCCESS [6.960s]
[INFO] Qpid AMQP Management Protocol Broker Plug-in ...... SUCCESS [2.181s]
[INFO] Qpid WebSocket Broker Plug-in ..................... SUCCESS [2.019s]
[INFO] Qpid AMQP 0-x JMS Client Examples ................. SUCCESS [1.549s]
[INFO] Qpid JCA .......................................... SUCCESS [3.899s]
[INFO] Qpid Resource Adaptor ............................. SUCCESS [2.235s]
[INFO] Qpid Tools ........................................ SUCCESS [2.591s]
[INFO] Qpid Management Examples .......................... SUCCESS [1.535s]
[INFO] Qpid Java System Test Parent ...................... SUCCESS [3.362s]
[INFO] Qpid System Tests ................................. FAILURE [12:54.814s]
[INFO] Qpid Performance Tests ............................ SUCCESS [27.775s]
[INFO] Qpid Performance Test System Tests ................ SKIPPED
[INFO] Qpid Performance Tests Visualisation JFC .......... SUCCESS [7.224s]
[INFO] Qpid BDB Store System Tests ....................... SKIPPED
[INFO] ------------------------------------------------------------------------
[INFO] BUILD FAILURE
[INFO] ------------------------------------------------------------------------
[INFO] Total time: 20:48.108s
[INFO] Finished at: Fri Jun 27 10:14:47 UTC 2014
[INFO] Final Memory: 102M/709M
[INFO] ------------------------------------------------------------------------
[ERROR] Failed to execute goal org.apache.maven.plugins:maven-surefire-plugin:2.16:test (integration-test)
on project qpid-systests: There are test failures.
[ERROR] 
[ERROR] Please refer to /home/hudson/jenkins-slave/workspace/Qpid-Java-Java-Test-JDK1.8/trunk/qpid/java/systests/target/surefire-reports
for the individual test results.
[ERROR] -> [Help 1]
[ERROR] 
[ERROR] To see the full stack trace of the errors, re-run Maven with the -e switch.
[ERROR] Re-run Maven using the -X switch to enable full debug logging.
[ERROR] 
[ERROR] For more information about the errors and possible solutions, please read the following
articles:
[ERROR] [Help 1] http://cwiki.apache.org/confluence/display/MAVEN/MojoFailureException
[ERROR] 
[ERROR] After correcting the problems, you can resume the build with the command
[ERROR]   mvn <goals> -rf :qpid-systests
Build step 'Invoke top-level Maven targets' marked build as failure
[locks-and-latches] Releasing all the locks
[locks-and-latches] All the locks released
Recording test results

Mime
View raw message