qpid-notifications mailing list archives

Site index · List index
Message view « Date » · « Thread »
Top « Date » · « Thread »
From Apache Jenkins Server <jenk...@builds.apache.org>
Subject Build failed in Jenkins: Qpid-proton-j #602
Date Fri, 13 Jun 2014 21:12:37 GMT
See <https://builds.apache.org/job/Qpid-proton-j/602/changes>

Changes:

[chug] PROTON-606: Python testReclaimCredit exposes test server messenger hang on windows
Move client2 into NBMessengerTest scope and include it in main pump loop.

------------------------------------------
[...truncated 3364 lines...]
    File "<https://builds.apache.org/job/Qpid-proton-j/ws/trunk/tests/python/proton_tests/ssl.py",>
line 810, in teardown
      assert self.client.stopped
  AssertionError
proton_tests.ssl.MessengerSSLTests.test_server_credentials ..............java.net.BindException:
Address already in use
	at sun.nio.ch.Net.bind(Native Method)
	at sun.nio.ch.ServerSocketChannelImpl.bind(ServerSocketChannelImpl.java:124)
	at sun.nio.ch.ServerSocketAdaptor.bind(ServerSocketAdaptor.java:59)
	at sun.nio.ch.ServerSocketAdaptor.bind(ServerSocketAdaptor.java:52)
	at org.apache.qpid.proton.driver.impl.DriverImpl.createListener(DriverImpl.java:162)
	at org.apache.qpid.proton.messenger.impl.MessengerImpl.subscribe(MessengerImpl.java:547)
	at sun.reflect.GeneratedMethodAccessor177.invoke(Unknown Source)
	at sun.reflect.DelegatingMethodAccessorImpl.invoke(DelegatingMethodAccessorImpl.java:25)
	at java.lang.reflect.Method.invoke(Method.java:597)
	at org.python.core.PyReflectedFunction.__call__(PyReflectedFunction.java:186)
	at org.python.core.PyReflectedFunction.__call__(PyReflectedFunction.java:204)
	at org.python.core.PyObject.__call__(PyObject.java:404)
	at org.python.core.PyObject.__call__(PyObject.java:408)
	at org.python.core.PyMethod.__call__(PyMethod.java:124)
	at cmessenger$py.pn_messenger_subscribe$17(__pyclasspath__/cmessenger.py:105)
	at cmessenger$py.call_function(__pyclasspath__/cmessenger.py)
	at org.python.core.PyTableCode.call(PyTableCode.java:165)
	at org.python.core.PyBaseCode.call(PyBaseCode.java:149)
	at org.python.core.PyFunction.__call__(PyFunction.java:327)
	at proton$py.subscribe$44(<https://builds.apache.org/job/Qpid-proton-j/ws/trunk/tests/../proton-c/bindings/python/proton.py>:468)
	at proton$py.call_function(<https://builds.apache.org/job/Qpid-proton-j/ws/trunk/tests/../proton-c/bindings/python/proton.py)>
	at org.python.core.PyTableCode.call(PyTableCode.java:165)
	at org.python.core.PyBaseCode.call(PyBaseCode.java:149)
	at org.python.core.PyFunction.__call__(PyFunction.java:327)
	at org.python.core.PyMethod.__call__(PyMethod.java:124)
	at proton_tests.ssl$py.test_server_credentials$34(<https://builds.apache.org/job/Qpid-proton-j/ws/trunk/tests/python/proton_tests/ssl.py>:839)
	at proton_tests.ssl$py.call_function(<https://builds.apache.org/job/Qpid-proton-j/ws/trunk/tests/python/proton_tests/ssl.py)>
	at org.python.core.PyTableCode.call(PyTableCode.java:165)
	at org.python.core.PyBaseCode.call(PyBaseCode.java:301)
	at org.python.core.PyBaseCode.call(PyBaseCode.java:127)
	at org.python.core.PyFunction.__call__(PyFunction.java:317)
	at org.python.core.PyMethod.__call__(PyMethod.java:109)
	at org.python.pycode._pyx0.run$36(<https://builds.apache.org/job/Qpid-proton-j/ws/trunk/tests/python/proton-test>:359)
	at org.python.pycode._pyx0.call_function(<https://builds.apache.org/job/Qpid-proton-j/ws/trunk/tests/python/proton-test)>
	at org.python.core.PyTableCode.call(PyTableCode.java:165)
	at org.python.core.PyBaseCode.call(PyBaseCode.java:166)
	at org.python.core.PyFunction.__call__(PyFunction.java:338)
	at org.python.core.PyMethod.__call__(PyMethod.java:139)
	at org.python.pycode._pyx0._run$55(<https://builds.apache.org/job/Qpid-proton-j/ws/trunk/tests/python/proton-test>:506)
	at org.python.pycode._pyx0.call_function(<https://builds.apache.org/job/Qpid-proton-j/ws/trunk/tests/python/proton-test)>
	at org.python.core.PyTableCode.call(PyTableCode.java:165)
	at org.python.core.PyBaseCode.call(PyBaseCode.java:134)
	at org.python.core.PyFunction.__call__(PyFunction.java:317)
	at org.python.core.PyMethod.__call__(PyMethod.java:109)
	at org.python.pycode._pyx0.run_test$41(<https://builds.apache.org/job/Qpid-proton-j/ws/trunk/tests/python/proton-test>:434)
	at org.python.pycode._pyx0.call_function(<https://builds.apache.org/job/Qpid-proton-j/ws/trunk/tests/python/proton-test)>
	at org.python.core.PyTableCode.call(PyTableCode.java:165)
	at org.python.core.PyBaseCode.call(PyBaseCode.java:166)
	at org.python.core.PyFunction.__call__(PyFunction.java:338)
	at org.python.pycode._pyx0.run$54(<https://builds.apache.org/job/Qpid-proton-j/ws/trunk/tests/python/proton-test>:482)
	at org.python.pycode._pyx0.call_function(<https://builds.apache.org/job/Qpid-proton-j/ws/trunk/tests/python/proton-test)>
	at org.python.core.PyTableCode.call(PyTableCode.java:165)
	at org.python.core.PyBaseCode.call(PyBaseCode.java:134)
	at org.python.core.PyFunction.__call__(PyFunction.java:317)
	at org.python.core.PyMethod.__call__(PyMethod.java:109)
	at org.python.pycode._pyx0.runthrough$76(<https://builds.apache.org/job/Qpid-proton-j/ws/trunk/tests/python/proton-test>:670)
	at org.python.pycode._pyx0.call_function(<https://builds.apache.org/job/Qpid-proton-j/ws/trunk/tests/python/proton-test)>
	at org.python.core.PyTableCode.call(PyTableCode.java:165)
	at org.python.core.PyBaseCode.call(PyBaseCode.java:120)
	at org.python.core.PyFunction.__call__(PyFunction.java:307)
	at org.python.pycode._pyx0.f$0(<https://builds.apache.org/job/Qpid-proton-j/ws/trunk/tests/python/proton-test>:687)
	at org.python.pycode._pyx0.call_function(<https://builds.apache.org/job/Qpid-proton-j/ws/trunk/tests/python/proton-test)>
	at org.python.core.PyTableCode.call(PyTableCode.java:165)
	at org.python.core.PyCode.call(PyCode.java:18)
	at org.python.core.Py.runCode(Py.java:1275)
	at org.python.core.__builtin__.execfile_flags(__builtin__.java:522)
	at org.python.util.PythonInterpreter.execfile(PythonInterpreter.java:225)
	at org.apache.qpid.proton.JythonTest.runTestOnce(JythonTest.java:103)
	at org.apache.qpid.proton.JythonTest.test(JythonTest.java:95)
	at sun.reflect.NativeMethodAccessorImpl.invoke0(Native Method)
	at sun.reflect.NativeMethodAccessorImpl.invoke(NativeMethodAccessorImpl.java:39)
	at sun.reflect.DelegatingMethodAccessorImpl.invoke(DelegatingMethodAccessorImpl.java:25)
	at java.lang.reflect.Method.invoke(Method.java:597)
	at org.junit.runners.model.FrameworkMethod$1.runReflectiveCall(FrameworkMethod.java:45)
	at org.junit.internal.runners.model.ReflectiveCallable.run(ReflectiveCallable.java:15)
	at org.junit.runners.model.FrameworkMethod.invokeExplosively(FrameworkMethod.java:42)
	at org.junit.internal.runners.statements.InvokeMethod.evaluate(InvokeMethod.java:20)
	at org.junit.runners.ParentRunner.runLeaf(ParentRunner.java:263)
	at org.junit.runners.BlockJUnit4ClassRunner.runChild(BlockJUnit4ClassRunner.java:68)
	at org.junit.runners.BlockJUnit4ClassRunner.runChild(BlockJUnit4ClassRunner.java:47)
	at org.junit.runners.ParentRunner$3.run(ParentRunner.java:231)
	at org.junit.runners.ParentRunner$1.schedule(ParentRunner.java:60)
	at org.junit.runners.ParentRunner.runChildren(ParentRunner.java:229)
	at org.junit.runners.ParentRunner.access$000(ParentRunner.java:50)
	at org.junit.runners.ParentRunner$2.evaluate(ParentRunner.java:222)
	at org.junit.runners.ParentRunner.run(ParentRunner.java:300)
	at org.apache.maven.surefire.junit4.JUnit4Provider.execute(JUnit4Provider.java:252)
	at org.apache.maven.surefire.junit4.JUnit4Provider.executeTestSet(JUnit4Provider.java:141)
	at org.apache.maven.surefire.junit4.JUnit4Provider.invoke(JUnit4Provider.java:112)
	at sun.reflect.NativeMethodAccessorImpl.invoke0(Native Method)
	at sun.reflect.NativeMethodAccessorImpl.invoke(NativeMethodAccessorImpl.java:39)
	at sun.reflect.DelegatingMethodAccessorImpl.invoke(DelegatingMethodAccessorImpl.java:25)
	at java.lang.reflect.Method.invoke(Method.java:597)
	at org.apache.maven.surefire.util.ReflectionUtils.invokeMethodWithArray(ReflectionUtils.java:189)
	at org.apache.maven.surefire.booter.ProviderFactory$ProviderProxy.invoke(ProviderFactory.java:165)
	at org.apache.maven.surefire.booter.ProviderFactory.invokeProvider(ProviderFactory.java:85)
	at org.apache.maven.surefire.booter.ForkedBooter.runSuitesInProcess(ForkedBooter.java:115)
	at org.apache.maven.surefire.booter.ForkedBooter.main(ForkedBooter.java:75)
 pass
proton_tests.ssl.MessengerSSLTests.test_server_credentials_bad_cert ..... skip
  Skipped
proton_tests.ssl.MessengerSSLTests.test_server_credentials_bad_key ...... skip
  Skipped
proton_tests.ssl.MessengerSSLTests.test_server_credentials_bad_password . skip
  Skipped
proton_tests.ssl.SslTest. \
    test_allow_unsecured_client_which_connects_secured .................. pass
proton_tests.ssl.SslTest. \
    test_allow_unsecured_client_which_connects_unsecured ................ pass
proton_tests.ssl.SslTest.test_bad_server_certificate .................... pass
proton_tests.ssl.SslTest.test_client_authentication ..................... pass
proton_tests.ssl.SslTest.test_client_authentication_fail_bad_cert ....... pass
proton_tests.ssl.SslTest.test_client_authentication_fail_no_cert ........ pass
proton_tests.ssl.SslTest.test_client_server_authentication .............. pass
proton_tests.ssl.SslTest.test_defaults .................................. pass
proton_tests.ssl.SslTest.test_disallow_unsecured_client ................. pass
proton_tests.ssl.SslTest.test_multiple_sessions .........................Killed

Results :

Tests run: 8, Failures: 0, Errors: 0, Skipped: 0

[JENKINS] Recording test results
[JENKINS] Archiving disabled
[INFO]                                                                         
[INFO] ------------------------------------------------------------------------
[INFO] Building proton-j-messenger-example 1.0-SNAPSHOT
[INFO] ------------------------------------------------------------------------
[INFO] 
[INFO] --- maven-clean-plugin:2.5:clean (default-clean) @ proton-j-messenger-example ---
[INFO] 
[INFO] --- maven-remote-resources-plugin:1.4:process (default) @ proton-j-messenger-example
---
[INFO] 
[INFO] --- maven-resources-plugin:2.6:resources (default-resources) @ proton-j-messenger-example
---
[INFO] Using 'UTF-8' encoding to copy filtered resources.
[INFO] skip non existing resourceDirectory <https://builds.apache.org/job/Qpid-proton-j/ws/trunk/examples/messenger/java/src/main/resources>
[INFO] Copying 3 resources
[INFO] 
[INFO] --- maven-compiler-plugin:2.5.1:compile (default-compile) @ proton-j-messenger-example
---
[INFO] Compiling 2 source files to <https://builds.apache.org/job/Qpid-proton-j/ws/trunk/examples/messenger/java/target/classes>
[WARNING] <https://builds.apache.org/job/Qpid-proton-j/ws/trunk/examples/messenger/java/src/main/java/org/apache/qpid/proton/example/Recv.java>:[101,28]
[deprecation] MessengerImpl() in org.apache.qpid.proton.messenger.impl.MessengerImpl has been
deprecated
[WARNING] <https://builds.apache.org/job/Qpid-proton-j/ws/trunk/examples/messenger/java/src/main/java/org/apache/qpid/proton/example/Send.java>:[75,28]
[deprecation] MessengerImpl() in org.apache.qpid.proton.messenger.impl.MessengerImpl has been
deprecated
[WARNING] <https://builds.apache.org/job/Qpid-proton-j/ws/trunk/examples/messenger/java/src/main/java/org/apache/qpid/proton/example/Send.java>:[77,26]
[deprecation] MessageImpl() in org.apache.qpid.proton.message.impl.MessageImpl has been deprecated
[INFO] 
[INFO] --- maven-resources-plugin:2.6:testResources (default-testResources) @ proton-j-messenger-example
---
[INFO] Using 'UTF-8' encoding to copy filtered resources.
[INFO] skip non existing resourceDirectory <https://builds.apache.org/job/Qpid-proton-j/ws/trunk/examples/messenger/java/src/test/resources>
[INFO] Copying 3 resources
[INFO] 
[INFO] --- maven-compiler-plugin:2.5.1:testCompile (default-testCompile) @ proton-j-messenger-example
---
[INFO] No sources to compile
[INFO] 
[INFO] --- maven-surefire-plugin:2.12.4:test (default-test) @ proton-j-messenger-example ---
[JENKINS] Recording test results
[INFO] 
[INFO] --- maven-jar-plugin:2.4:jar (default-jar) @ proton-j-messenger-example ---
[INFO] Building jar: <https://builds.apache.org/job/Qpid-proton-j/ws/trunk/examples/messenger/java/target/proton-j-messenger-example-1.0-SNAPSHOT.jar>
[INFO] 
[INFO] --- maven-site-plugin:3.2:attach-descriptor (attach-descriptor) @ proton-j-messenger-example
---
[INFO] 
[INFO] --- maven-install-plugin:2.3.1:install (default-install) @ proton-j-messenger-example
---
[INFO] Installing <https://builds.apache.org/job/Qpid-proton-j/ws/trunk/examples/messenger/java/target/proton-j-messenger-example-1.0-SNAPSHOT.jar>
to /home/jenkins/jenkins-slave/maven-repositories/1/org/apache/qpid/proton-j-messenger-example/1.0-SNAPSHOT/proton-j-messenger-example-1.0-SNAPSHOT.jar
[INFO] Installing <https://builds.apache.org/job/Qpid-proton-j/ws/trunk/examples/messenger/java/pom.xml>
to /home/jenkins/jenkins-slave/maven-repositories/1/org/apache/qpid/proton-j-messenger-example/1.0-SNAPSHOT/proton-j-messenger-example-1.0-SNAPSHOT.pom
[JENKINS] Archiving disabled
[INFO] ------------------------------------------------------------------------
[INFO] Reactor Summary:
[INFO] 
[INFO] proton-project .................................... SUCCESS [10.453s]
[INFO] proton-j .......................................... SUCCESS [12.476s]
[INFO] proton-jms ........................................ SUCCESS [0.614s]
[INFO] proton-hawtdispatch ............................... SUCCESS [3.038s]
[INFO] proton-tests ...................................... FAILURE [35.758s]
[INFO] proton-j-messenger-example ........................ SUCCESS [0.336s]
[INFO] ------------------------------------------------------------------------
[INFO] BUILD FAILURE
[INFO] ------------------------------------------------------------------------
[INFO] Total time: 1:05.767s
[INFO] Finished at: Fri Jun 13 21:12:34 UTC 2014
[INFO] Final Memory: 20M/65M
[INFO] ------------------------------------------------------------------------
[JENKINS] Archiving disabled
[JENKINS] Archiving disabled
[JENKINS] Archiving disabled
[JENKINS] Archiving disabled
[JENKINS] Archiving disabled
[JENKINS] Archiving disabled
Waiting for Jenkins to finish collecting data
[ERROR] Failed to execute goal org.apache.maven.plugins:maven-surefire-plugin:2.12.4:test
(default-test) on project proton-tests: Execution default-test of goal org.apache.maven.plugins:maven-surefire-plugin:2.12.4:test
failed: The forked VM terminated without saying properly goodbye. VM crash or System.exit
called ? -> [Help 1]
org.apache.maven.lifecycle.LifecycleExecutionException: Failed to execute goal org.apache.maven.plugins:maven-surefire-plugin:2.12.4:test
(default-test) on project proton-tests: Execution default-test of goal org.apache.maven.plugins:maven-surefire-plugin:2.12.4:test
failed: The forked VM terminated without saying properly goodbye. VM crash or System.exit
called ?
	at org.apache.maven.lifecycle.internal.MojoExecutor.execute(MojoExecutor.java:225)
	at org.apache.maven.lifecycle.internal.MojoExecutor.execute(MojoExecutor.java:153)
	at org.apache.maven.lifecycle.internal.MojoExecutor.execute(MojoExecutor.java:145)
	at org.apache.maven.lifecycle.internal.LifecycleModuleBuilder.buildProject(LifecycleModuleBuilder.java:84)
	at org.apache.maven.lifecycle.internal.LifecycleModuleBuilder.buildProject(LifecycleModuleBuilder.java:59)
	at org.apache.maven.lifecycle.internal.LifecycleStarter.singleThreadedBuild(LifecycleStarter.java:183)
	at org.apache.maven.lifecycle.internal.LifecycleStarter.execute(LifecycleStarter.java:161)
	at org.apache.maven.DefaultMaven.doExecute(DefaultMaven.java:320)
	at org.apache.maven.DefaultMaven.execute(DefaultMaven.java:156)
	at org.jvnet.hudson.maven3.launcher.Maven3Launcher.main(Maven3Launcher.java:117)
	at sun.reflect.NativeMethodAccessorImpl.invoke0(Native Method)
	at sun.reflect.NativeMethodAccessorImpl.invoke(NativeMethodAccessorImpl.java:39)
	at sun.reflect.DelegatingMethodAccessorImpl.invoke(DelegatingMethodAccessorImpl.java:25)
	at java.lang.reflect.Method.invoke(Method.java:597)
	at org.codehaus.plexus.classworlds.launcher.Launcher.launchStandard(Launcher.java:329)
	at org.codehaus.plexus.classworlds.launcher.Launcher.launch(Launcher.java:239)
	at org.jvnet.hudson.maven3.agent.Maven3Main.launch(Maven3Main.java:178)
	at sun.reflect.NativeMethodAccessorImpl.invoke0(Native Method)
	at sun.reflect.NativeMethodAccessorImpl.invoke(NativeMethodAccessorImpl.java:39)
	at sun.reflect.DelegatingMethodAccessorImpl.invoke(DelegatingMethodAccessorImpl.java:25)
	at java.lang.reflect.Method.invoke(Method.java:597)
	at hudson.maven.Maven3Builder.call(Maven3Builder.java:134)
	at hudson.maven.Maven3Builder.call(Maven3Builder.java:69)
	at hudson.remoting.UserRequest.perform(UserRequest.java:118)
	at hudson.remoting.UserRequest.perform(UserRequest.java:48)
	at hudson.remoting.Request$2.run(Request.java:328)
	at hudson.remoting.InterceptingExecutorService$1.call(InterceptingExecutorService.java:72)
	at java.util.concurrent.FutureTask$Sync.innerRun(FutureTask.java:303)
	at java.util.concurrent.FutureTask.run(FutureTask.java:138)
	at java.util.concurrent.ThreadPoolExecutor$Worker.runTask(ThreadPoolExecutor.java:895)
	at java.util.concurrent.ThreadPoolExecutor$Worker.run(ThreadPoolExecutor.java:918)
	at java.lang.Thread.run(Thread.java:662)
Caused by: org.apache.maven.plugin.PluginExecutionException: Execution default-test of goal
org.apache.maven.plugins:maven-surefire-plugin:2.12.4:test failed: The forked VM terminated
without saying properly goodbye. VM crash or System.exit called ?
	at org.apache.maven.plugin.DefaultBuildPluginManager.executeMojo(DefaultBuildPluginManager.java:110)
	at org.apache.maven.lifecycle.internal.MojoExecutor.execute(MojoExecutor.java:209)
	... 31 more
Caused by: java.lang.RuntimeException: The forked VM terminated without saying properly goodbye.
VM crash or System.exit called ?
	at org.apache.maven.plugin.surefire.booterclient.output.ForkClient.close(ForkClient.java:257)
	at org.apache.maven.plugin.surefire.booterclient.ForkStarter.fork(ForkStarter.java:301)
	at org.apache.maven.plugin.surefire.booterclient.ForkStarter.run(ForkStarter.java:116)
	at org.apache.maven.plugin.surefire.AbstractSurefireMojo.executeProvider(AbstractSurefireMojo.java:740)
	at org.apache.maven.plugin.surefire.AbstractSurefireMojo.executeAllProviders(AbstractSurefireMojo.java:682)
	at org.apache.maven.plugin.surefire.AbstractSurefireMojo.executeAfterPreconditionsChecked(AbstractSurefireMojo.java:648)
	at org.apache.maven.plugin.surefire.AbstractSurefireMojo.execute(AbstractSurefireMojo.java:586)
	at org.apache.maven.plugin.DefaultBuildPluginManager.executeMojo(DefaultBuildPluginManager.java:101)
	... 32 more
[ERROR] 
[ERROR] Re-run Maven using the -X switch to enable full debug logging.
[ERROR] 
[ERROR] For more information about the errors and possible solutions, please read the following
articles:
[ERROR] [Help 1] http://cwiki.apache.org/confluence/display/MAVEN/PluginExecutionException
[ERROR] 
[ERROR] After correcting the problems, you can resume the build with the command
[ERROR]   mvn <goals> -rf :proton-tests
Sending e-mails to: notifications@qpid.apache.org
channel stopped

Mime
View raw message