qpid-notifications mailing list archives

Site index · List index
Message view « Date » · « Thread »
Top « Date » · « Thread »
From Apache Jenkins Server <jenk...@builds.apache.org>
Subject Build failed in Jenkins: Qpid-Java-Java-Test-JDK1.8 #773
Date Fri, 27 Jun 2014 02:32:18 GMT
See <https://builds.apache.org/job/Qpid-Java-Java-Test-JDK1.8/773/changes>

Changes:

[aconway] NO-JIRA: Error handling in swig_python_typemaps: don't core dump if qpid.datatypes
is not found.

[aconway] NO-JIRA: Updated java/README.txt with instructions to run examples.

[robbie] QPID-5048: add pom to build the AMQP 0-x JMS client examples

[pmoravec] [QPID-5852]: [Python client] connection.opened() returns True after unsuccessful
connection

------------------------------------------
[...truncated 13164 lines...]
main 2014-06-27 02:32:12,119 INFO [qpid.test.utils.QpidTestCase] ========== start SeriesRowTest.testDimensionAsDouble
==========
main 2014-06-27 02:32:12,120 INFO [qpid.test.utils.QpidTestCase] ========== tearDown SeriesRowTest.testDimensionAsDouble
==========
main 2014-06-27 02:32:12,121 INFO [qpid.test.utils.QpidTestCase] ========== start SeriesRowTest.testDimensionAsString
==========
main 2014-06-27 02:32:12,121 INFO [qpid.test.utils.QpidTestCase] ========== tearDown SeriesRowTest.testDimensionAsString
==========
main 2014-06-27 02:32:12,121 INFO [qpid.test.utils.QpidTestCase] ========== start SeriesRowTest.testValidSeriesRow
==========
main 2014-06-27 02:32:12,121 INFO [qpid.test.utils.QpidTestCase] ========== tearDown SeriesRowTest.testValidSeriesRow
==========
Tests run: 5, Failures: 0, Errors: 0, Skipped: 0, Time elapsed: 0.004 sec - in org.apache.qpid.disttest.charting.seriesbuilder.SeriesRowTest
Running org.apache.qpid.disttest.charting.chartbuilder.ColorFactoryTest
main 2014-06-27 02:32:12,122 INFO [qpid.test.utils.QpidTestCase] ========== start ColorFactoryTest.testDarkBlue
==========
main 2014-06-27 02:32:12,151 INFO [qpid.test.utils.QpidTestCase] ========== tearDown ColorFactoryTest.testDarkBlue
==========
main 2014-06-27 02:32:12,152 INFO [qpid.test.utils.QpidTestCase] ========== start ColorFactoryTest.testBlue
==========
main 2014-06-27 02:32:12,152 INFO [qpid.test.utils.QpidTestCase] ========== tearDown ColorFactoryTest.testBlue
==========
Tests run: 2, Failures: 0, Errors: 0, Skipped: 0, Time elapsed: 0.031 sec - in org.apache.qpid.disttest.charting.chartbuilder.ColorFactoryTest
Running org.apache.qpid.disttest.charting.chartbuilder.ChartBuilderFactoryTest
main 2014-06-27 02:32:12,160 INFO [qpid.test.utils.QpidTestCase] ========== start ChartBuilderFactoryTest.testXYLineChart
==========
main 2014-06-27 02:32:12,174 INFO [qpid.test.utils.QpidTestCase] ========== tearDown ChartBuilderFactoryTest.testXYLineChart
==========
main 2014-06-27 02:32:12,174 INFO [qpid.test.utils.QpidTestCase] ========== start ChartBuilderFactoryTest.testLineChart
==========
main 2014-06-27 02:32:12,175 INFO [qpid.test.utils.QpidTestCase] ========== tearDown ChartBuilderFactoryTest.testLineChart
==========
main 2014-06-27 02:32:12,175 INFO [qpid.test.utils.QpidTestCase] ========== start ChartBuilderFactoryTest.testBarChart
==========
main 2014-06-27 02:32:12,176 INFO [qpid.test.utils.QpidTestCase] ========== tearDown ChartBuilderFactoryTest.testBarChart
==========
main 2014-06-27 02:32:12,176 INFO [qpid.test.utils.QpidTestCase] ========== start ChartBuilderFactoryTest.testTimeSeriesLineChart
==========
main 2014-06-27 02:32:12,177 INFO [qpid.test.utils.QpidTestCase] ========== tearDown ChartBuilderFactoryTest.testTimeSeriesLineChart
==========
main 2014-06-27 02:32:12,177 INFO [qpid.test.utils.QpidTestCase] ========== start ChartBuilderFactoryTest.testLineChart3D
==========
main 2014-06-27 02:32:12,178 INFO [qpid.test.utils.QpidTestCase] ========== tearDown ChartBuilderFactoryTest.testLineChart3D
==========
main 2014-06-27 02:32:12,178 INFO [qpid.test.utils.QpidTestCase] ========== start ChartBuilderFactoryTest.testBarChart3D
==========
main 2014-06-27 02:32:12,179 INFO [qpid.test.utils.QpidTestCase] ========== tearDown ChartBuilderFactoryTest.testBarChart3D
==========
Tests run: 6, Failures: 0, Errors: 0, Skipped: 0, Time elapsed: 0.026 sec - in org.apache.qpid.disttest.charting.chartbuilder.ChartBuilderFactoryTest
Running org.apache.qpid.disttest.charting.chartbuilder.TimeSeriesBuilderCallbackTest
main 2014-06-27 02:32:12,180 INFO [qpid.test.utils.QpidTestCase] ========== start TimeSeriesBuilderCallbackTest.testAddPointToSeries
==========
main 2014-06-27 02:32:12,206 INFO [qpid.test.utils.QpidTestCase] ========== tearDown TimeSeriesBuilderCallbackTest.testAddPointToSeries
==========
Tests run: 1, Failures: 0, Errors: 0, Skipped: 0, Time elapsed: 0.028 sec - in org.apache.qpid.disttest.charting.chartbuilder.TimeSeriesBuilderCallbackTest
Running org.apache.qpid.disttest.charting.chartbuilder.BaseChartBuilderTest
main 2014-06-27 02:32:12,240 INFO [qpid.test.utils.QpidTestCase] ========== start BaseChartBuilderTest.testBuildChart
==========
main 2014-06-27 02:32:13,001 INFO [qpid.test.utils.QpidTestCase] ========== tearDown BaseChartBuilderTest.testBuildChart
==========
Tests run: 1, Failures: 0, Errors: 0, Skipped: 0, Time elapsed: 0.795 sec - in org.apache.qpid.disttest.charting.chartbuilder.BaseChartBuilderTest
Running org.apache.qpid.disttest.charting.chartbuilder.ChartProductionTest
main 2014-06-27 02:32:13,006 INFO [qpid.test.utils.QpidTestCase] ========== start ChartProductionTest.testLine3DChart
==========
main 2014-06-27 02:32:13,009 INFO [disttest.charting.writer.ChartWriter] Set chart directory:
/tmp/charts-1403836333008
main 2014-06-27 02:32:14,194 INFO [disttest.charting.writer.ChartWriter] Written /tmp/charts-1403836333008/testLine3DChart.png
chart
main 2014-06-27 02:32:14,195 INFO [qpid.test.utils.QpidTestCase] ========== tearDown ChartProductionTest.testLine3DChart
==========
main 2014-06-27 02:32:14,195 INFO [qpid.test.utils.QpidTestCase] ========== start ChartProductionTest.testXYLineChart
==========
main 2014-06-27 02:32:14,196 INFO [disttest.charting.writer.ChartWriter] Set chart directory:
/tmp/charts-1403836334196
main 2014-06-27 02:32:14,283 INFO [disttest.charting.writer.ChartWriter] Written /tmp/charts-1403836334196/testXYLineChart.png
chart
main 2014-06-27 02:32:14,283 INFO [qpid.test.utils.QpidTestCase] ========== tearDown ChartProductionTest.testXYLineChart
==========
main 2014-06-27 02:32:14,283 INFO [qpid.test.utils.QpidTestCase] ========== start ChartProductionTest.testStatisticalBarChart
==========
main 2014-06-27 02:32:14,284 INFO [disttest.charting.writer.ChartWriter] Set chart directory:
/tmp/charts-1403836334284
main 2014-06-27 02:32:14,347 INFO [disttest.charting.writer.ChartWriter] Written /tmp/charts-1403836334284/testStatisticalBarChart.png
chart
main 2014-06-27 02:32:14,347 INFO [qpid.test.utils.QpidTestCase] ========== tearDown ChartProductionTest.testStatisticalBarChart
==========
main 2014-06-27 02:32:14,347 INFO [qpid.test.utils.QpidTestCase] ========== start ChartProductionTest.testLineChart
==========
main 2014-06-27 02:32:14,348 INFO [disttest.charting.writer.ChartWriter] Set chart directory:
/tmp/charts-1403836334348
main 2014-06-27 02:32:14,408 INFO [disttest.charting.writer.ChartWriter] Written /tmp/charts-1403836334348/testLineChart.png
chart
main 2014-06-27 02:32:14,408 INFO [qpid.test.utils.QpidTestCase] ========== tearDown ChartProductionTest.testLineChart
==========
main 2014-06-27 02:32:14,408 INFO [qpid.test.utils.QpidTestCase] ========== start ChartProductionTest.testBarChart
==========
main 2014-06-27 02:32:14,409 INFO [disttest.charting.writer.ChartWriter] Set chart directory:
/tmp/charts-1403836334409
main 2014-06-27 02:32:14,466 INFO [disttest.charting.writer.ChartWriter] Written /tmp/charts-1403836334409/testBarChart.png
chart
main 2014-06-27 02:32:14,466 INFO [qpid.test.utils.QpidTestCase] ========== tearDown ChartProductionTest.testBarChart
==========
main 2014-06-27 02:32:14,466 INFO [qpid.test.utils.QpidTestCase] ========== start ChartProductionTest.testBar3DChart
==========
main 2014-06-27 02:32:14,467 INFO [disttest.charting.writer.ChartWriter] Set chart directory:
/tmp/charts-1403836334467
main 2014-06-27 02:32:14,522 INFO [disttest.charting.writer.ChartWriter] Written /tmp/charts-1403836334467/testBar3DChart.png
chart
main 2014-06-27 02:32:14,522 INFO [qpid.test.utils.QpidTestCase] ========== tearDown ChartProductionTest.testBar3DChart
==========
main 2014-06-27 02:32:14,522 INFO [qpid.test.utils.QpidTestCase] ========== start ChartProductionTest.testTimeSeriesLineChart
==========
main 2014-06-27 02:32:14,523 INFO [disttest.charting.writer.ChartWriter] Set chart directory:
/tmp/charts-1403836334523
main 2014-06-27 02:32:14,590 INFO [disttest.charting.writer.ChartWriter] Written /tmp/charts-1403836334523/testTimeSeriesLineChart.png
chart
main 2014-06-27 02:32:14,590 INFO [qpid.test.utils.QpidTestCase] ========== tearDown ChartProductionTest.testTimeSeriesLineChart
==========
main 2014-06-27 02:32:14,591 INFO [qpid.test.utils.QpidTestCase] ========== start ChartProductionTest.testXYLineChartWithColourAndWidth
==========
main 2014-06-27 02:32:14,591 INFO [disttest.charting.writer.ChartWriter] Set chart directory:
/tmp/charts-1403836334591
main 2014-06-27 02:32:14,653 INFO [disttest.charting.writer.ChartWriter] Written /tmp/charts-1403836334591/testXYLineChartWithColourAndWidth.png
chart
main 2014-06-27 02:32:14,653 INFO [qpid.test.utils.QpidTestCase] ========== tearDown ChartProductionTest.testXYLineChartWithColourAndWidth
==========
Tests run: 8, Failures: 0, Errors: 0, Skipped: 0, Time elapsed: 1.651 sec - in org.apache.qpid.disttest.charting.chartbuilder.ChartProductionTest
Running org.apache.qpid.disttest.charting.definition.SeriesDefinitionCreatorTest
main 2014-06-27 02:32:14,655 INFO [qpid.test.utils.QpidTestCase] ========== start SeriesDefinitionCreatorTest.testSeriesDirectoryAndNameSubstitution
==========
main 2014-06-27 02:32:14,655 INFO [qpid.test.utils.QpidTestCase] Set system property "SeriesDefinitionProp"
to: "propValue"
main 2014-06-27 02:32:14,660 INFO [qpid.test.utils.QpidTestCase] ========== tearDown SeriesDefinitionCreatorTest.testSeriesDirectoryAndNameSubstitution
==========
main 2014-06-27 02:32:14,660 DEBUG [qpid.test.utils.QpidTestCase] reverting 1 test properties
main 2014-06-27 02:32:14,661 INFO [qpid.test.utils.QpidTestCase] ========== start SeriesDefinitionCreatorTest.testTwoSeriesDefinitions
==========
main 2014-06-27 02:32:14,662 INFO [qpid.test.utils.QpidTestCase] ========== tearDown SeriesDefinitionCreatorTest.testTwoSeriesDefinitions
==========
main 2014-06-27 02:32:14,662 INFO [qpid.test.utils.QpidTestCase] ========== start SeriesDefinitionCreatorTest.testOneSeriesDefinition
==========
main 2014-06-27 02:32:14,663 INFO [qpid.test.utils.QpidTestCase] ========== tearDown SeriesDefinitionCreatorTest.testOneSeriesDefinition
==========
main 2014-06-27 02:32:14,663 INFO [qpid.test.utils.QpidTestCase] ========== start SeriesDefinitionCreatorTest.testNonSequentialSeriesDefinitionsIgnored
==========
main 2014-06-27 02:32:14,664 INFO [qpid.test.utils.QpidTestCase] ========== tearDown SeriesDefinitionCreatorTest.testNonSequentialSeriesDefinitionsIgnored
==========
Tests run: 4, Failures: 0, Errors: 0, Skipped: 0, Time elapsed: 0.01 sec - in org.apache.qpid.disttest.charting.definition.SeriesDefinitionCreatorTest
Running org.apache.qpid.disttest.charting.definition.ChartingDefinitionCreatorTest
main 2014-06-27 02:32:14,666 INFO [qpid.test.utils.QpidTestCase] ========== start ChartingDefinitionCreatorTest.testLoadTwoDefinitionsFromDirectory
==========
main 2014-06-27 02:32:14,671 INFO [qpid.test.utils.QpidTestCase] ========== tearDown ChartingDefinitionCreatorTest.testLoadTwoDefinitionsFromDirectory
==========
main 2014-06-27 02:32:14,671 INFO [qpid.test.utils.QpidTestCase] ========== start ChartingDefinitionCreatorTest.testLoadOneDefinitionFromFile
==========
main 2014-06-27 02:32:14,672 INFO [qpid.test.utils.QpidTestCase] ========== tearDown ChartingDefinitionCreatorTest.testLoadOneDefinitionFromFile
==========
main 2014-06-27 02:32:14,672 INFO [qpid.test.utils.QpidTestCase] ========== start ChartingDefinitionCreatorTest.testDefinitionsProperties
==========
main 2014-06-27 02:32:14,672 INFO [qpid.test.utils.QpidTestCase] Set system property "ChartingDefinitionSysProp"
to: "propValue"
main 2014-06-27 02:32:14,673 INFO [qpid.test.utils.QpidTestCase] ========== tearDown ChartingDefinitionCreatorTest.testDefinitionsProperties
==========
main 2014-06-27 02:32:14,673 DEBUG [qpid.test.utils.QpidTestCase] reverting 1 test properties
main 2014-06-27 02:32:14,674 INFO [qpid.test.utils.QpidTestCase] ========== start ChartingDefinitionCreatorTest.testDefinitionFileNotFound
==========
main 2014-06-27 02:32:14,674 INFO [qpid.test.utils.QpidTestCase] ========== tearDown ChartingDefinitionCreatorTest.testDefinitionFileNotFound
==========
Tests run: 4, Failures: 0, Errors: 0, Skipped: 0, Time elapsed: 0.009 sec - in org.apache.qpid.disttest.charting.definition.ChartingDefinitionCreatorTest
Running org.apache.qpid.disttest.charting.writer.ChartWriterTest
main 2014-06-27 02:32:14,703 INFO [disttest.charting.writer.ChartWriter] Set chart directory:
/tmp/TestFileUtils-testDir-1403836334703
main 2014-06-27 02:32:14,759 INFO [disttest.charting.writer.ChartWriter] Written /tmp/TestFileUtils-testDir-1403836334703/chart1.png
chart
main 2014-06-27 02:32:14,759 INFO [disttest.charting.writer.ChartWriter] Only 1 chart image(s)
have been written so no HTML summary file will be produced
main 2014-06-27 02:32:14,760 INFO [qpid.test.utils.QpidTestCase] ========== tearDown null
==========
main 2014-06-27 02:32:14,761 INFO [disttest.charting.writer.ChartWriter] Set chart directory:
/tmp/TestFileUtils-testDir-1403836334761
main 2014-06-27 02:32:14,807 INFO [disttest.charting.writer.ChartWriter] Written /tmp/TestFileUtils-testDir-1403836334761/chart1.png
chart
main 2014-06-27 02:32:14,807 INFO [qpid.test.utils.QpidTestCase] ========== tearDown null
==========
main 2014-06-27 02:32:14,808 INFO [disttest.charting.writer.ChartWriter] Set chart directory:
/tmp/TestFileUtils-testDir-1403836334808
main 2014-06-27 02:32:14,855 INFO [disttest.charting.writer.ChartWriter] Written /tmp/TestFileUtils-testDir-1403836334808/chart2.png
chart
main 2014-06-27 02:32:14,901 INFO [disttest.charting.writer.ChartWriter] Written /tmp/TestFileUtils-testDir-1403836334808/chart1.png
chart
main 2014-06-27 02:32:14,902 DEBUG [disttest.charting.writer.ChartWriter] About to produce
HTML summary file /tmp/TestFileUtils-testDir-1403836334808/chart-summary.html from charts
{/tmp/TestFileUtils-testDir-1403836334808/chart1.png=Mock for ChartingDefinition, hashCode:
199640888, /tmp/TestFileUtils-testDir-1403836334808/chart2.png=Mock for ChartingDefinition,
hashCode: 1000975683}
main 2014-06-27 02:32:14,909 INFO [qpid.test.utils.QpidTestCase] ========== tearDown null
==========
Tests run: 3, Failures: 0, Errors: 0, Skipped: 0, Time elapsed: 0.235 sec - in org.apache.qpid.disttest.charting.writer.ChartWriterTest

Results :

Tests run: 39, Failures: 0, Errors: 0, Skipped: 0

[INFO] 
[INFO] --- maven-jar-plugin:2.4:jar (default-jar) @ qpid-perftests-visualisation-jfc ---
[INFO] Building jar: <https://builds.apache.org/job/Qpid-Java-Java-Test-JDK1.8/ws/trunk/qpid/java/perftests/visualisation-jfc/target/qpid-perftests-visualisation-jfc-0.30-SNAPSHOT.jar>
[INFO] 
[INFO] --- maven-site-plugin:3.3:attach-descriptor (attach-descriptor) @ qpid-perftests-visualisation-jfc
---
[INFO] 
[INFO] --- maven-antrun-plugin:1.7:run (create-qbtc-output-dir) @ qpid-perftests-visualisation-jfc
---
[INFO] Executing tasks

main:
    [mkdir] Created dir: <https://builds.apache.org/job/Qpid-Java-Java-Test-JDK1.8/ws/trunk/qpid/java/perftests/visualisation-jfc/target/qbtc-output>
[INFO] Executed tasks
[INFO] 
[INFO] --- maven-site-plugin:3.3:site (default-site) @ qpid-perftests-visualisation-jfc ---
[INFO] configuring report plugin org.apache.maven.plugins:maven-project-info-reports-plugin:2.7
[INFO] configuring report plugin org.codehaus.mojo:license-maven-plugin:1.6
[INFO] configuring report plugin org.apache.maven.plugins:maven-surefire-report-plugin:2.16
[INFO] configuring report plugin org.apache.maven.plugins:maven-jxr-plugin:2.3
[INFO] configuring report plugin org.jacoco:jacoco-maven-plugin:0.7.0.201403182114
[INFO] Skipping JaCoCo execution due to missing execution data <https://builds.apache.org/job/Qpid-Java-Java-Test-JDK1.8/ws/trunk/qpid/java/perftests/visualisation-jfc/target/jacoco-it.exec>
[INFO] Skipping JaCoCo execution due to missing execution data <https://builds.apache.org/job/Qpid-Java-Java-Test-JDK1.8/ws/trunk/qpid/java/perftests/visualisation-jfc/target/jacoco.exec>
[INFO] configuring report plugin org.apache.rat:apache-rat-plugin:0.10
[INFO] Parent project loaded from repository: org.apache.qpid:qpid-parent:pom:1.0
[INFO] Parent project loaded from repository: org.apache:apache:pom:14
[INFO] Relativizing decoration links with respect to project URL: http://qpid.apache.org/qpid-java-build/perftests/qpid-perftests-visualisation-jfc
[INFO] Rendering site with org.apache.maven.skins:maven-default-skin:jar:1.0 skin.
[INFO] Generating "About" report    --- maven-project-info-reports-plugin:2.7
[INFO] Generating "Plugin Management" report    --- maven-project-info-reports-plugin:2.7
[INFO] Generating "Distribution Management" report    --- maven-project-info-reports-plugin:2.7
[INFO] Generating "Dependency Information" report    --- maven-project-info-reports-plugin:2.7
[INFO] Generating "Dependency Convergence" report    --- maven-project-info-reports-plugin:2.7
[INFO] Generating "Source Repository" report    --- maven-project-info-reports-plugin:2.7
[INFO] Generating "Mailing Lists" report    --- maven-project-info-reports-plugin:2.7
[INFO] Generating "Issue Tracking" report    --- maven-project-info-reports-plugin:2.7
[INFO] Generating "Continuous Integration" report    --- maven-project-info-reports-plugin:2.7
[INFO] Generating "Project Plugins" report    --- maven-project-info-reports-plugin:2.7
[INFO] Generating "Project License" report    --- maven-project-info-reports-plugin:2.7
[INFO] Generating "Dependency Management" report    --- maven-project-info-reports-plugin:2.7
[INFO] Generating "Project Team" report    --- maven-project-info-reports-plugin:2.7
[INFO] Generating "Project Summary" report    --- maven-project-info-reports-plugin:2.7
[INFO] Generating "Dependencies" report    --- maven-project-info-reports-plugin:2.7
[INFO] Generating "Third Parties" report    --- license-maven-plugin:1.6
[INFO] Generating "Surefire Report" report    --- maven-surefire-report-plugin:2.16
[INFO] Generating "Source Xref" report    --- maven-jxr-plugin:2.3
[INFO] Generating "Test Source Xref" report    --- maven-jxr-plugin:2.3
[INFO] Generating "Rat Report" report    --- apache-rat-plugin:0.10
[INFO] 51 implicit excludes (use -debug for more details).
[INFO] Exclude: build/**
[INFO] Exclude: lib/**
[INFO] Exclude: test-profiles/test_resources/ssl/**
[INFO] 43 resources included (use -debug for more details)
Warning:  org.apache.xerces.jaxp.SAXParserImpl$JAXPSAXParser: Property 'http://www.oracle.com/xml/jaxp/properties/entityExpansionLimit'
is not recognized.
Compiler warnings:
  WARNING:  'org.apache.xerces.jaxp.SAXParserImpl: Property 'http://javax.xml.XMLConstants/property/accessExternalDTD'
is not recognized.'
Warning:  org.apache.xerces.parsers.SAXParser: Feature 'http://javax.xml.XMLConstants/feature/secure-processing'
is not recognized.
Warning:  org.apache.xerces.parsers.SAXParser: Property 'http://javax.xml.XMLConstants/property/accessExternalDTD'
is not recognized.
Warning:  org.apache.xerces.parsers.SAXParser: Property 'http://www.oracle.com/xml/jaxp/properties/entityExpansionLimit'
is not recognized.
[INFO] 
[INFO] --- maven-site-plugin:3.3:stage (default-cli) @ qpid-perftests-visualisation-jfc ---
[INFO] Using this base directory for staging: <https://builds.apache.org/job/Qpid-Java-Java-Test-JDK1.8/ws/trunk/qpid/java/target/staging>
[INFO] Parent project loaded from repository: org.apache.qpid:qpid-parent:pom:1.0
file://<https://builds.apache.org/job/Qpid-Java-Java-Test-JDK1.8/ws/trunk/qpid/java/target/staging/>
- Session: Opened  
[INFO] Pushing <https://builds.apache.org/job/Qpid-Java-Java-Test-JDK1.8/ws/trunk/qpid/java/perftests/visualisation-jfc/target/site>
[INFO]    >>> to file://<https://builds.apache.org/job/Qpid-Java-Java-Test-JDK1.8/ws/trunk/qpid/java/target/staging/perftests/visualisation-jfc/perftests/qpid-perftests-visualisation-jfc>
file://<https://builds.apache.org/job/Qpid-Java-Java-Test-JDK1.8/ws/trunk/qpid/java/target/staging/>
- Session: Disconnecting  
file://<https://builds.apache.org/job/Qpid-Java-Java-Test-JDK1.8/ws/trunk/qpid/java/target/staging/>
- Session: Disconnected
[INFO]                                                                         
[INFO] ------------------------------------------------------------------------
[INFO] Skipping Qpid BDB Store System Tests
[INFO] This project has been banned from the build due to previous failures.
[INFO] ------------------------------------------------------------------------
[INFO] ------------------------------------------------------------------------
[INFO] Reactor Summary:
[INFO] 
[INFO] Qpid Java Build ................................... SUCCESS [53.874s]
[INFO] Qpid AMQP 1.0 Common .............................. SUCCESS [13.211s]
[INFO] Qpid AMQP 1.0 Client .............................. SUCCESS [2.168s]
[INFO] Qpid AMQP 1.0 Client JMS .......................... SUCCESS [3.218s]
[INFO] Qpid AMQP 1.0 Client WebSocket .................... SUCCESS [2.580s]
[INFO] Qpid Broker Code Generation ....................... SUCCESS [1.892s]
[INFO] Qpid Test Utilities ............................... SUCCESS [1.899s]
[INFO] Qpid Common ....................................... SUCCESS [22.577s]
[INFO] Qpid Management Common ............................ SUCCESS [2.429s]
[INFO] Qpid Java Broker Core ............................. SUCCESS [1:02.827s]
[INFO] Qpid Access Control Broker Plug-in ................ SUCCESS [4.421s]
[INFO] Qpid AMQP 0-8 Protocol Broker Plug-in ............. SUCCESS [20.154s]
[INFO] Qpid AMQP 0-10 Protocol Plug-in ................... SUCCESS [3.518s]
[INFO] Qpid AMQP 1-0 Protocol Broker Plug-in ............. SUCCESS [2.117s]
[INFO] Qpid AMQP 0-8 to 0-10 Message Conversion Broker Plug-in  SUCCESS [1.805s]
[INFO] Qpid AMQP 0-8 to 1-0 Message Conversion Broker Plug-in  SUCCESS [1.902s]
[INFO] Qpid AMQP 0-10 to 1-0 Message Conversion Broker Plug-in  SUCCESS [1.839s]
[INFO] Qpid Derby Message Store .......................... SUCCESS [3:37.821s]
[INFO] Qpid JDBC Message Store Connection Pooling Plug-in  SUCCESS [1.806s]
[INFO] Qpid JDBC Message Store Broker Plug-in ............ SUCCESS [7.425s]
[INFO] Qpid HTTP Management Broker Plug-in ............... SUCCESS [6.885s]
[INFO] Qpid JMX Management Broker Plug-in ................ SUCCESS [3.490s]
[INFO] Qpid Memory Message Store Broker Plug-in .......... SUCCESS [2.860s]
[INFO] Qpid AMQP 0-x JMS Client .......................... SUCCESS [9.141s]
[INFO] Qpid BDB Message Store ............................ SUCCESS [5.576s]
[INFO] Qpid BDB Message Store JMX ........................ SUCCESS [2.591s]
[INFO] Qpid Java Broker .................................. SUCCESS [6.089s]
[INFO] Qpid AMQP Management Protocol Broker Plug-in ...... SUCCESS [2.218s]
[INFO] Qpid WebSocket Broker Plug-in ..................... SUCCESS [1.881s]
[INFO] Qpid AMQP 0-x JMS Client Examples ................. SUCCESS [1.668s]
[INFO] Qpid JCA .......................................... SUCCESS [3.127s]
[INFO] Qpid Resource Adaptor ............................. SUCCESS [2.036s]
[INFO] Qpid Tools ........................................ SUCCESS [1.884s]
[INFO] Qpid Management Examples .......................... SUCCESS [1.655s]
[INFO] Qpid Java System Test Parent ...................... SUCCESS [2.726s]
[INFO] Qpid System Tests ................................. FAILURE [12:57.485s]
[INFO] Qpid Performance Tests ............................ SUCCESS [24.683s]
[INFO] Qpid Performance Test System Tests ................ SKIPPED
[INFO] Qpid Performance Tests Visualisation JFC .......... SUCCESS [5.733s]
[INFO] Qpid BDB Store System Tests ....................... SKIPPED
[INFO] ------------------------------------------------------------------------
[INFO] BUILD FAILURE
[INFO] ------------------------------------------------------------------------
[INFO] Total time: 21:32.104s
[INFO] Finished at: Fri Jun 27 02:32:16 UTC 2014
[INFO] Final Memory: 115M/1330M
[INFO] ------------------------------------------------------------------------
[ERROR] Failed to execute goal org.apache.maven.plugins:maven-surefire-plugin:2.16:test (integration-test)
on project qpid-systests: There are test failures.
[ERROR] 
[ERROR] Please refer to <https://builds.apache.org/job/Qpid-Java-Java-Test-JDK1.8/ws/trunk/qpid/java/systests/target/surefire-reports>
for the individual test results.
[ERROR] -> [Help 1]
[ERROR] 
[ERROR] To see the full stack trace of the errors, re-run Maven with the -e switch.
[ERROR] Re-run Maven using the -X switch to enable full debug logging.
[ERROR] 
[ERROR] For more information about the errors and possible solutions, please read the following
articles:
[ERROR] [Help 1] http://cwiki.apache.org/confluence/display/MAVEN/MojoFailureException
[ERROR] 
[ERROR] After correcting the problems, you can resume the build with the command
[ERROR]   mvn <goals> -rf :qpid-systests
Build step 'Invoke top-level Maven targets' marked build as failure
[locks-and-latches] Releasing all the locks
[locks-and-latches] All the locks released

Mime
View raw message