qpid-notifications mailing list archives

Site index · List index
Message view « Date » · « Thread »
Top « Date » · « Thread »
From Apache Jenkins Server <jenk...@builds.apache.org>
Subject Build failed in Jenkins: Qpid-Java-Java-Test-JDK1.8 #771
Date Fri, 09 May 2014 02:24:15 GMT
See <https://builds.apache.org/job/Qpid-Java-Java-Test-JDK1.8/771/changes>

Changes:

[rgodfrey] QPID-5754 : [Java Broker] close the qmf agent when the plugin is closed

[rgodfrey] QPID-5754 : [Java Broker] Make state change operations methods rather than calls
to setDesiredState

[orudyy] QPID-5413: Add functionality to close the deleted tab of virtual host node.
           Display user friendly values for BDB HA VHN priority and quorum override
           Fix tree view

[robbie] QPID-5752: qpid-java-build POM special char removal

Patch Supplied by Andrew MacBean <andymacbean@gmail.com>.

------------------------------------------
[...truncated 6292 lines...]
    [junit] Running org.apache.qpid.test.unit.message.JMSPropertiesTest
    [junit] Tests run: 2, Failures: 0, Errors: 0, Time elapsed: 0.059 sec
    [junit] Running org.apache.qpid.test.unit.message.StreamMessageTest
    [junit] Tests run: 2, Failures: 0, Errors: 0, Time elapsed: 0.046 sec
    [junit] Running org.apache.qpid.test.unit.message.UTF8Test
    [junit] Tests run: 2, Failures: 0, Errors: 0, Time elapsed: 0.041 sec
    [junit] Running org.apache.qpid.test.unit.topic.DurableSubscriptionTest
    [junit] Tests run: 17, Failures: 0, Errors: 0, Time elapsed: 28.311 sec
    [junit] Running org.apache.qpid.test.unit.topic.TemporaryTopicTest
    [junit] Tests run: 5, Failures: 0, Errors: 0, Time elapsed: 0.09 sec
    [junit] Running org.apache.qpid.test.unit.topic.TopicPublisherTest
    [junit] Tests run: 1, Failures: 0, Errors: 0, Time elapsed: 0.02 sec
    [junit] Running org.apache.qpid.test.unit.topic.TopicSessionTest
    [junit] Tests run: 9, Failures: 0, Errors: 0, Time elapsed: 9.68 sec
    [junit] Running org.apache.qpid.test.unit.transacted.CommitRollbackTest
    [junit] Tests run: 14, Failures: 0, Errors: 0, Time elapsed: 15.705 sec
    [junit] Running org.apache.qpid.test.unit.transacted.TransactedTest
    [junit] Tests run: 7, Failures: 0, Errors: 0, Time elapsed: 7.714 sec
    [junit] Running org.apache.qpid.test.unit.transacted.TransactionTimeoutDisabledTest
    [junit] Tests run: 2, Failures: 0, Errors: 0, Time elapsed: 3.541 sec
    [junit] Running org.apache.qpid.test.unit.transacted.TransactionTimeoutTest
    [junit] Tests run: 15, Failures: 1, Errors: 0, Time elapsed: 54.005 sec
    [junit] TEST org.apache.qpid.test.unit.transacted.TransactionTimeoutTest FAILED
    [junit] Running org.apache.qpid.test.unit.xa.FaultTest
    [junit] Tests run: 10, Failures: 0, Errors: 0, Time elapsed: 11.76 sec
    [junit] Running org.apache.qpid.test.unit.xa.QueueTest
    [junit] Tests run: 1, Failures: 0, Errors: 0, Time elapsed: 1.029 sec
    [junit] Running org.apache.qpid.test.unit.xa.TopicTest
    [junit] Tests run: 4, Failures: 0, Errors: 0, Time elapsed: 4.166 sec
    [junit] Running org.apache.qpid.test.utils.BrokerCommandHelperTest
    [junit] Tests run: 2, Failures: 0, Errors: 0, Time elapsed: 0.002 sec
    [junit] Running org.apache.qpid.util.LogMonitorTest
    [junit] Tests run: 9, Failures: 0, Errors: 0, Time elapsed: 2.058 sec
    [junit] Tests FAILED
     [echo] Running ant for module : systests

touch-failed:
    [touch] Creating <https://builds.apache.org/job/Qpid-Java-Java-Test-JDK1.8/ws/trunk/qpid/java/build/results/systests/FAILED>
    [touch] Creating <https://builds.apache.org/job/Qpid-Java-Java-Test-JDK1.8/ws/trunk/qpid/java/build/results/FAILED>
     [echo] Running ant for module : perftests

prepare:

precompile:

compile:
     [echo] Targeting : 1.7

copy-extra-resources:

copy-resources:
     [echo] Copying resources from <https://builds.apache.org/job/Qpid-Java-Java-Test-JDK1.8/ws/trunk/qpid/java/perftests/src/main/resources>
to <https://builds.apache.org/job/Qpid-Java-Java-Test-JDK1.8/ws/trunk/qpid/java/build/scratch/perftests/classes...>

copy-project-resources-metainf:

copy-module-resources-metainf:

copy-module-src-resources-metainf:

copy-files-to-module-metainf:

jar.manifest:

jar.nomanifest:

jar:

precompile-tests:

compile-tests:

copy-test-resources:

jar-tests:

jar-sources:

libs:

copy-bin:

copy-etc:

postbuild:

copy-broker-plugin-jars-deps:

copy-broker-plugin-jars:

build:

test:
     [echo] Using profile:java-mms.0-10
    [junit] Running org.apache.qpid.disttest.ArgumentParserTest
    [junit] Tests run: 3, Failures: 0, Errors: 0, Time elapsed: 0.028 sec
    [junit] Running org.apache.qpid.disttest.ConfigFileHelperTest
    [junit] Tests run: 1, Failures: 0, Errors: 0, Time elapsed: 0.011 sec
    [junit] Running org.apache.qpid.disttest.VisitorTest
    [junit] Tests run: 3, Failures: 0, Errors: 0, Time elapsed: 0.006 sec
    [junit] Running org.apache.qpid.disttest.client.ClientCommandVisitorTest
    [junit] Tests run: 8, Failures: 0, Errors: 0, Time elapsed: 0.184 sec
    [junit] Running org.apache.qpid.disttest.client.ClientTest
    [junit] Tests run: 8, Failures: 0, Errors: 0, Time elapsed: 0.564 sec
    [junit] Running org.apache.qpid.disttest.client.ConsumerParticipantTest
    [junit] Tests run: 7, Failures: 0, Errors: 0, Time elapsed: 0.155 sec
    [junit] Running org.apache.qpid.disttest.client.MessageProviderTest
    [junit] Tests run: 3, Failures: 0, Errors: 0, Time elapsed: 0.086 sec
    [junit] Running org.apache.qpid.disttest.client.ParticipantExecutorTest
    [junit] Tests run: 4, Failures: 0, Errors: 0, Time elapsed: 0.028 sec
    [junit] Running org.apache.qpid.disttest.client.ParticipantRegistryTest
    [junit] Tests run: 2, Failures: 0, Errors: 0, Time elapsed: 0.002 sec
    [junit] Running org.apache.qpid.disttest.client.ParticipantResultFactoryTest
    [junit] Tests run: 3, Failures: 0, Errors: 0, Time elapsed: 0.003 sec
    [junit] Running org.apache.qpid.disttest.client.ProducerParticipantTest
    [junit] Tests run: 9, Failures: 0, Errors: 0, Time elapsed: 3.515 sec
    [junit] Running org.apache.qpid.disttest.client.property.ListPropertyValueTest
    [junit] Tests run: 3, Failures: 0, Errors: 0, Time elapsed: 0.003 sec
    [junit] Running org.apache.qpid.disttest.client.property.PropertyValueFactoryTest
    [junit] Tests run: 5, Failures: 0, Errors: 0, Time elapsed: 0.005 sec
    [junit] Running org.apache.qpid.disttest.client.property.RandomPropertyValueTest
    [junit] Tests run: 5, Failures: 0, Errors: 0, Time elapsed: 0.003 sec
    [junit] Running org.apache.qpid.disttest.client.property.RangePropertyValueTest
    [junit] Tests run: 8, Failures: 0, Errors: 0, Time elapsed: 0.007 sec
    [junit] Running org.apache.qpid.disttest.client.property.SimplePropertyValueTest
    [junit] Tests run: 1, Failures: 0, Errors: 0, Time elapsed: 0.002 sec
    [junit] Running org.apache.qpid.disttest.client.utils.ExecutorWithNoLimitsTest
    [junit] Tests run: 2, Failures: 0, Errors: 0, Time elapsed: 0.003 sec
    [junit] Running org.apache.qpid.disttest.client.utils.ExecutorWithTimeLimitTest
    [junit] Tests run: 4, Failures: 0, Errors: 0, Time elapsed: 0.508 sec
    [junit] Running org.apache.qpid.disttest.controller.ClientRegistryTest
    [junit] Tests run: 8, Failures: 0, Errors: 0, Time elapsed: 2.567 sec
    [junit] Running org.apache.qpid.disttest.controller.ControllerTest
    [junit] Tests run: 6, Failures: 0, Errors: 0, Time elapsed: 0.038 sec
    [junit] Running org.apache.qpid.disttest.controller.ParticipatingClientsTest
    [junit] Tests run: 5, Failures: 0, Errors: 0, Time elapsed: 0.004 sec
    [junit] Running org.apache.qpid.disttest.controller.TestRunnerTest
    [junit] Tests run: 6, Failures: 0, Errors: 0, Time elapsed: 1.138 sec
    [junit] Running org.apache.qpid.disttest.controller.config.ClientConfigTest
    [junit] Tests run: 4, Failures: 0, Errors: 0, Time elapsed: 0.007 sec
    [junit] Running org.apache.qpid.disttest.controller.config.ConfigReaderTest
    [junit] Tests run: 5, Failures: 0, Errors: 0, Time elapsed: 0.937 sec
    [junit] Running org.apache.qpid.disttest.controller.config.ConfigTest
    [junit] Tests run: 1, Failures: 0, Errors: 0, Time elapsed: 0.005 sec
    [junit] Running org.apache.qpid.disttest.controller.config.ConnectionConfigTest
    [junit] Tests run: 3, Failures: 0, Errors: 0, Time elapsed: 0.007 sec
    [junit] Running org.apache.qpid.disttest.controller.config.ConsumerConfigTest
    [junit] Tests run: 2, Failures: 0, Errors: 0, Time elapsed: 0.003 sec
    [junit] Running org.apache.qpid.disttest.controller.config.IterationValueTest
    [junit] Tests run: 3, Failures: 0, Errors: 0, Time elapsed: 0.029 sec
    [junit] Running org.apache.qpid.disttest.controller.config.JavaScriptConfigEvaluatorTest
    [junit] Tests run: 2, Failures: 0, Errors: 0, Time elapsed: 0.238 sec
    [junit] Running org.apache.qpid.disttest.controller.config.MessageProviderConfigTest
    [junit] Tests run: 2, Failures: 0, Errors: 0, Time elapsed: 0.002 sec
    [junit] Running org.apache.qpid.disttest.controller.config.ParticipantConfigTest
    [junit] Tests run: 1, Failures: 0, Errors: 0, Time elapsed: 0.007 sec
    [junit] Running org.apache.qpid.disttest.controller.config.ProducerConfigTest
    [junit] Tests run: 5, Failures: 0, Errors: 0, Time elapsed: 0.003 sec
    [junit] Running org.apache.qpid.disttest.controller.config.SessionConfigTest
    [junit] Tests run: 3, Failures: 0, Errors: 0, Time elapsed: 0.015 sec
    [junit] Running org.apache.qpid.disttest.controller.config.TestConfigTest
    [junit] Tests run: 5, Failures: 0, Errors: 0, Time elapsed: 0.006 sec
    [junit] Running org.apache.qpid.disttest.controller.config.TestInstanceTest
    [junit] Tests run: 3, Failures: 0, Errors: 0, Time elapsed: 0.006 sec
    [junit] Running org.apache.qpid.disttest.db.ResultsDbWriterTest
    [junit] Tests run: 2, Failures: 0, Errors: 0, Time elapsed: 8.152 sec
    [junit] Running org.apache.qpid.disttest.jms.JmsMessageAdaptorTest
    [junit] Tests run: 1, Failures: 0, Errors: 0, Time elapsed: 0.004 sec
    [junit] Running org.apache.qpid.disttest.message.JsonHandlerTest
    [junit] Tests run: 2, Failures: 0, Errors: 0, Time elapsed: 0.042 sec
    [junit] Running org.apache.qpid.disttest.message.ParticipantResultTest
    [junit] Tests run: 3, Failures: 0, Errors: 0, Time elapsed: 0.216 sec
    [junit] Running org.apache.qpid.disttest.results.ResultsFileWriterTest
    [junit] Tests run: 2, Failures: 0, Errors: 0, Time elapsed: 0.072 sec
    [junit] Running org.apache.qpid.disttest.results.aggregation.AggregatorTest
    [junit] Tests run: 1, Failures: 0, Errors: 0, Time elapsed: 0.046 sec
    [junit] Running org.apache.qpid.disttest.results.aggregation.ParticipantResultAggregatorTest
    [junit] Tests run: 14, Failures: 0, Errors: 0, Time elapsed: 0.11 sec
    [junit] Running org.apache.qpid.disttest.results.aggregation.SeriesStatisticsTest
    [junit] Tests run: 1, Failures: 0, Errors: 0, Time elapsed: 0.01 sec
    [junit] Running org.apache.qpid.disttest.results.aggregation.TestResultAggregatorTest
    [junit] Tests run: 4, Failures: 0, Errors: 0, Time elapsed: 0.137 sec
    [junit] Running org.apache.qpid.disttest.results.formatting.CSVFormatterTest
    [junit] Tests run: 1, Failures: 0, Errors: 0, Time elapsed: 0.026 sec
    [junit] Running org.apache.qpid.disttest.results.formatting.CSVOrderParticipantResultComparatorTest
    [junit] Tests run: 6, Failures: 0, Errors: 0, Time elapsed: 0.171 sec
     [echo] Running ant for module : perftests

touch-failed:
     [echo] Running ant for module : qpid-perftests-systests

prepare:

precompile:

compile:
     [echo] Targeting : 1.7

copy-extra-resources:

copy-resources:

copy-project-resources-metainf:

copy-module-resources-metainf:

copy-module-src-resources-metainf:

copy-files-to-module-metainf:

jar.manifest:

jar.nomanifest:

jar:

precompile-tests:

compile-tests:

copy-test-resources:

jar-tests:

jar-sources:

libs:

copy-bin:

copy-etc:

postbuild:

copy-broker-plugin-jars-deps:

copy-broker-plugin-jars:

build:

test:

BUILD FAILED
<https://builds.apache.org/job/Qpid-Java-Java-Test-JDK1.8/ws/trunk/qpid/java/build.xml>:107:
TEST SUITE FAILED

Total time: 20 minutes 28 seconds
Build step 'Invoke Ant' marked build as failure
[locks-and-latches] Releasing all the locks
[locks-and-latches] All the locks released
Recording test results

Mime
View raw message