qpid-notifications mailing list archives

Site index · List index
Message view « Date » · « Thread »
Top « Date » · « Thread »
From Apache Jenkins Server <jenk...@builds.apache.org>
Subject Build failed in Jenkins: Qpid-Java-Cpp-Test #1696
Date Sun, 02 Feb 2014 14:13:57 GMT
See <https://builds.apache.org/job/Qpid-Java-Cpp-Test/1696/changes>

Changes:

[pmoravec] QPID-5121: Store module does not raise exception when attempting to enqueue a message
bigger than the journal size

------------------------------------------
[...truncated 5099 lines...]
/home/hudson/jenkins-slave/workspace/Qpid-Java-Cpp-Test/cpp-build/bindings/qmf2/ruby/rubyRUBY_wrap.cxx:
In function 'VALUE _wrap_SchemaId_getHash(int, VALUE*, VALUE)':
/home/hudson/jenkins-slave/workspace/Qpid-Java-Cpp-Test/cpp-build/bindings/qmf2/ruby/rubyRUBY_wrap.cxx:11843:36:
warning: format not a string literal and no format arguments [-Wformat-security]/home/hudson/jenkins-slave/workspace/Qpid-Java-Cpp-Test/cpp-build/bindings/qpid/ruby/rubyRUBY_wrap.cxx:22487:36:
warning: format not a string literal and no format arguments [-Wformat-security]

/home/hudson/jenkins-slave/workspace/Qpid-Java-Cpp-Test/cpp-build/bindings/qpid/ruby/rubyRUBY_wrap.cxx:22491:36:
warning: format not a string literal and no format arguments [-Wformat-security]
/home/hudson/jenkins-slave/workspace/Qpid-Java-Cpp-Test/cpp-build/bindings/qpid/ruby/rubyRUBY_wrap.cxx:22495:36:
warning: format not a string literal and no format arguments [-Wformat-security]
/home/hudson/jenkins-slave/workspace/Qpid-Java-Cpp-Test/cpp-build/bindings/qpid/ruby/rubyRUBY_wrap.cxx:22499:36:
warning: format not a string literal and no format arguments [-Wformat-security]
/home/hudson/jenkins-slave/workspace/Qpid-Java-Cpp-Test/cpp-build/bindings/qpid/ruby/rubyRUBY_wrap.cxx:22503:36:
warning: format not a string literal and no format arguments [-Wformat-security]
/home/hudson/jenkins-slave/workspace/Qpid-Java-Cpp-Test/cpp-build/bindings/qmf2/ruby/rubyRUBY_wrap.cxx:
In function 'VALUE _wrap_new_SchemaMethod__SWIG_0(int, VALUE*, VALUE)':
/home/hudson/jenkins-slave/workspace/Qpid-Java-Cpp-Test/cpp-build/bindings/qmf2/ruby/rubyRUBY_wrap.cxx:11877:36:
warning: format not a string literal and no format arguments [-Wformat-security]
/home/hudson/jenkins-slave/workspace/Qpid-Java-Cpp-Test/cpp-build/bindings/qpid/ruby/rubyRUBY_wrap.cxx:22507:36:
warning: format not a string literal and no format arguments [-Wformat-security]
/home/hudson/jenkins-slave/workspace/Qpid-Java-Cpp-Test/cpp-build/bindings/qpid/ruby/rubyRUBY_wrap.cxx:22511:36:
warning: format not a string literal and no format arguments [-Wformat-security]
/home/hudson/jenkins-slave/workspace/Qpid-Java-Cpp-Test/cpp-build/bindings/qpid/ruby/rubyRUBY_wrap.cxx:22515:36:
warning: format not a string literal and no format arguments [-Wformat-security]
/home/hudson/jenkins-slave/workspace/Qpid-Java-Cpp-Test/cpp-build/bindings/qmf2/ruby/rubyRUBY_wrap.cxx:
In function 'VALUE _wrap_new_SchemaMethod__SWIG_1(int, VALUE*, VALUE)':
/home/hudson/jenkins-slave/workspace/Qpid-Java-Cpp-Test/cpp-build/bindings/qmf2/ruby/rubyRUBY_wrap.cxx:11900:36:
warning: format not a string literal and no format arguments [-Wformat-security]
/home/hudson/jenkins-slave/workspace/Qpid-Java-Cpp-Test/cpp-build/bindings/qpid/ruby/rubyRUBY_wrap.cxx:22519:36:
warning: format not a string literal and no format arguments [-Wformat-security]
/home/hudson/jenkins-slave/workspace/Qpid-Java-Cpp-Test/cpp-build/bindings/qpid/ruby/rubyRUBY_wrap.cxx:22522:45:
warning: format not a string literal and no format arguments [-Wformat-security]
/home/hudson/jenkins-slave/workspace/Qpid-Java-Cpp-Test/cpp-build/bindings/qmf2/ruby/rubyRUBY_wrap.cxx:
In function 'VALUE _wrap_new_SchemaMethod__SWIG_2(int, VALUE*, VALUE)':
/home/hudson/jenkins-slave/workspace/Qpid-Java-Cpp-Test/cpp-build/bindings/qmf2/ruby/rubyRUBY_wrap.cxx:11934:36:
warning: format not a string literal and no format arguments [-Wformat-security]
/home/hudson/jenkins-slave/workspace/Qpid-Java-Cpp-Test/cpp-build/bindings/qpid/ruby/rubyRUBY_wrap.cxx:
In function 'VALUE _wrap_decodeMap(int, VALUE*, VALUE)':
/home/hudson/jenkins-slave/workspace/Qpid-Java-Cpp-Test/cpp-build/bindings/qpid/ruby/rubyRUBY_wrap.cxx:22564:36:
warning: format not a string literal and no format arguments [-Wformat-security]
/home/hudson/jenkins-slave/workspace/Qpid-Java-Cpp-Test/cpp-build/bindings/qpid/ruby/rubyRUBY_wrap.cxx:22568:36:
warning: format not a string literal and no format arguments [-Wformat-security]
/home/hudson/jenkins-slave/workspace/Qpid-Java-Cpp-Test/cpp-build/bindings/qpid/ruby/rubyRUBY_wrap.cxx:22572:36:
warning: format not a string literal and no format arguments [-Wformat-security]
/home/hudson/jenkins-slave/workspace/Qpid-Java-Cpp-Test/cpp-build/bindings/qmf2/ruby/rubyRUBY_wrap.cxx:
In function 'VALUE _wrap_new_SchemaMethod__SWIG_3(int, VALUE*, VALUE)':
/home/hudson/jenkins-slave/workspace/Qpid-Java-Cpp-Test/cpp-build/bindings/qmf2/ruby/rubyRUBY_wrap.cxx:11988:36:
warning: format not a string literal and no format arguments [-Wformat-security]
/home/hudson/jenkins-slave/workspace/Qpid-Java-Cpp-Test/cpp-build/bindings/qpid/ruby/rubyRUBY_wrap.cxx:22576:36:
warning: format not a string literal and no format arguments [-Wformat-security]
/home/hudson/jenkins-slave/workspace/Qpid-Java-Cpp-Test/cpp-build/bindings/qpid/ruby/rubyRUBY_wrap.cxx:22580:36:
warning: format not a string literal and no format arguments [-Wformat-security]
/home/hudson/jenkins-slave/workspace/Qpid-Java-Cpp-Test/cpp-build/bindings/qpid/ruby/rubyRUBY_wrap.cxx:22584:36:
warning: format not a string literal and no format arguments [-Wformat-security]
/home/hudson/jenkins-slave/workspace/Qpid-Java-Cpp-Test/cpp-build/bindings/qpid/ruby/rubyRUBY_wrap.cxx:22588:36:
warning: format not a string literal and no format arguments [-Wformat-security]
/home/hudson/jenkins-slave/workspace/Qpid-Java-Cpp-Test/cpp-build/bindings/qpid/ruby/rubyRUBY_wrap.cxx:22592:36:
warning: format not a string literal and no format arguments [-Wformat-security]
/home/hudson/jenkins-slave/workspace/Qpid-Java-Cpp-Test/cpp-build/bindings/qpid/ruby/rubyRUBY_wrap.cxx:22596:36:
warning: format not a string literal and no format arguments [-Wformat-security]
/home/hudson/jenkins-slave/workspace/Qpid-Java-Cpp-Test/cpp-build/bindings/qpid/ruby/rubyRUBY_wrap.cxx:22600:36:
warning: format not a string literal and no format arguments [-Wformat-security]
/home/hudson/jenkins-slave/workspace/Qpid-Java-Cpp-Test/cpp-build/bindings/qmf2/ruby/rubyRUBY_wrap.cxx:
In function 'VALUE _wrap_new_SchemaMethod__SWIG_4(int, VALUE*, VALUE)':
/home/hudson/jenkins-slave/workspace/Qpid-Java-Cpp-Test/cpp-build/bindings/qmf2/ruby/rubyRUBY_wrap.cxx:12045:36:
warning: format not a string literal and no format arguments [-Wformat-security]
/home/hudson/jenkins-slave/workspace/Qpid-Java-Cpp-Test/cpp-build/bindings/qpid/ruby/rubyRUBY_wrap.cxx:22604:36:
warning: format not a string literal and no format arguments [-Wformat-security]
/home/hudson/jenkins-slave/workspace/Qpid-Java-Cpp-Test/cpp-build/bindings/qpid/ruby/rubyRUBY_wrap.cxx:22608:36:
warning: format not a string literal and no format arguments [-Wformat-security]
/home/hudson/jenkins-slave/workspace/Qpid-Java-Cpp-Test/cpp-build/bindings/qpid/ruby/rubyRUBY_wrap.cxx:22612:36:
warning: format not a string literal and no format arguments [-Wformat-security]
/home/hudson/jenkins-slave/workspace/Qpid-Java-Cpp-Test/cpp-build/bindings/qpid/ruby/rubyRUBY_wrap.cxx:22616:36:
warning: format not a string literal and no format arguments [-Wformat-security]
/home/hudson/jenkins-slave/workspace/Qpid-Java-Cpp-Test/cpp-build/bindings/qpid/ruby/rubyRUBY_wrap.cxx:22620:36:
warning: format not a string literal and no format arguments [-Wformat-security]
/home/hudson/jenkins-slave/workspace/Qpid-Java-Cpp-Test/cpp-build/bindings/qpid/ruby/rubyRUBY_wrap.cxx:22624:36:
warning: format not a string literal and no format arguments [-Wformat-security]
/home/hudson/jenkins-slave/workspace/Qpid-Java-Cpp-Test/cpp-build/bindings/qpid/ruby/rubyRUBY_wrap.cxx:22628:36:
warning: format not a string literal and no format arguments [-Wformat-security]
/home/hudson/jenkins-slave/workspace/Qpid-Java-Cpp-Test/cpp-build/bindings/qpid/ruby/rubyRUBY_wrap.cxx:22632:36:
warning: format not a string literal and no format arguments [-Wformat-security]
/home/hudson/jenkins-slave/workspace/Qpid-Java-Cpp-Test/cpp-build/bindings/qpid/ruby/rubyRUBY_wrap.cxx:22636:36:
warning: format not a string literal and no format arguments [-Wformat-security]
/home/hudson/jenkins-slave/workspace/Qpid-Java-Cpp-Test/cpp-build/bindings/qpid/ruby/rubyRUBY_wrap.cxx:22640:36:
warning: format not a string literal and no format arguments [-Wformat-security]
/home/hudson/jenkins-slave/workspace/Qpid-Java-Cpp-Test/cpp-build/bindings/qpid/ruby/rubyRUBY_wrap.cxx:22643:45:
warning: format not a string literal and no format arguments [-Wformat-security]
/home/hudson/jenkins-slave/workspace/Qpid-Java-Cpp-Test/cpp-build/bindings/qmf2/ruby/rubyRUBY_wrap.cxx:
In function 'VALUE _wrap_SchemaMethod_setDesc(int, VALUE*, VALUE)':
/home/hudson/jenkins-slave/workspace/Qpid-Java-Cpp-Test/cpp-build/bindings/qmf2/ruby/rubyRUBY_wrap.cxx:12153:36:
warning: format not a string literal and no format arguments [-Wformat-security]
/home/hudson/jenkins-slave/workspace/Qpid-Java-Cpp-Test/cpp-build/bindings/qmf2/ruby/rubyRUBY_wrap.cxx:
In function 'VALUE _wrap_SchemaMethod_addArgument(int, VALUE*, VALUE)':
/home/hudson/jenkins-slave/workspace/Qpid-Java-Cpp-Test/cpp-build/bindings/qmf2/ruby/rubyRUBY_wrap.cxx:12195:36:
warning: format not a string literal and no format arguments [-Wformat-security]
/home/hudson/jenkins-slave/workspace/Qpid-Java-Cpp-Test/cpp-build/bindings/qpid/ruby/rubyRUBY_wrap.cxx:
In function 'VALUE _wrap_decodeList(int, VALUE*, VALUE)':
/home/hudson/jenkins-slave/workspace/Qpid-Java-Cpp-Test/cpp-build/bindings/qpid/ruby/rubyRUBY_wrap.cxx:22683:36:
warning: format not a string literal and no format arguments [-Wformat-security]
/home/hudson/jenkins-slave/workspace/Qpid-Java-Cpp-Test/cpp-build/bindings/qpid/ruby/rubyRUBY_wrap.cxx:22687:36:
warning: format not a string literal and no format arguments [-Wformat-security]
/home/hudson/jenkins-slave/workspace/Qpid-Java-Cpp-Test/cpp-build/bindings/qpid/ruby/rubyRUBY_wrap.cxx:22691:36:
warning: format not a string literal and no format arguments [-Wformat-security]
/home/hudson/jenkins-slave/workspace/Qpid-Java-Cpp-Test/cpp-build/bindings/qpid/ruby/rubyRUBY_wrap.cxx:22695:36:
warning: format not a string literal and no format arguments [-Wformat-security]
/home/hudson/jenkins-slave/workspace/Qpid-Java-Cpp-Test/cpp-build/bindings/qmf2/ruby/rubyRUBY_wrap.cxx:
In function 'VALUE _wrap_SchemaMethod_getName(int, VALUE*, VALUE)':
/home/hudson/jenkins-slave/workspace/Qpid-Java-Cpp-Test/cpp-build/bindings/qmf2/ruby/rubyRUBY_wrap.cxx:12226:36:
warning: format not a string literal and no format arguments [-Wformat-security]
/home/hudson/jenkins-slave/workspace/Qpid-Java-Cpp-Test/cpp-build/bindings/qpid/ruby/rubyRUBY_wrap.cxx:22699:36:
warning: format not a string literal and no format arguments [-Wformat-security]
/home/hudson/jenkins-slave/workspace/Qpid-Java-Cpp-Test/cpp-build/bindings/qpid/ruby/rubyRUBY_wrap.cxx:22703:36:
warning: format not a string literal and no format arguments [-Wformat-security]
/home/hudson/jenkins-slave/workspace/Qpid-Java-Cpp-Test/cpp-build/bindings/qpid/ruby/rubyRUBY_wrap.cxx:22707:36:
warning: format not a string literal and no format arguments [-Wformat-security]
/home/hudson/jenkins-slave/workspace/Qpid-Java-Cpp-Test/cpp-build/bindings/qpid/ruby/rubyRUBY_wrap.cxx:22711:36:
warning: format not a string literal and no format arguments [-Wformat-security]
/home/hudson/jenkins-slave/workspace/Qpid-Java-Cpp-Test/cpp-build/bindings/qpid/ruby/rubyRUBY_wrap.cxx:22715:36:
warning: format not a string literal and no format arguments [-Wformat-security]
/home/hudson/jenkins-slave/workspace/Qpid-Java-Cpp-Test/cpp-build/bindings/qmf2/ruby/rubyRUBY_wrap.cxx:
In function 'VALUE _wrap_SchemaMethod_getDesc(int, VALUE*, VALUE)':
/home/hudson/jenkins-slave/workspace/Qpid-Java-Cpp-Test/cpp-build/bindings/qmf2/ruby/rubyRUBY_wrap.cxx:12258:36:
warning: format not a string literal and no format arguments [-Wformat-security]
/home/hudson/jenkins-slave/workspace/Qpid-Java-Cpp-Test/cpp-build/bindings/qpid/ruby/rubyRUBY_wrap.cxx:22719:36:
warning: format not a string literal and no format arguments [-Wformat-security]
/home/hudson/jenkins-slave/workspace/Qpid-Java-Cpp-Test/cpp-build/bindings/qpid/ruby/rubyRUBY_wrap.cxx:22723:36:
warning: format not a string literal and no format arguments [-Wformat-security]
/home/hudson/jenkins-slave/workspace/Qpid-Java-Cpp-Test/cpp-build/bindings/qpid/ruby/rubyRUBY_wrap.cxx:22727:36:
warning: format not a string literal and no format arguments [-Wformat-security]
/home/hudson/jenkins-slave/workspace/Qpid-Java-Cpp-Test/cpp-build/bindings/qpid/ruby/rubyRUBY_wrap.cxx:22731:36:
warning: format not a string literal and no format arguments [-Wformat-security]
/home/hudson/jenkins-slave/workspace/Qpid-Java-Cpp-Test/cpp-build/bindings/qmf2/ruby/rubyRUBY_wrap.cxx:
In function 'VALUE _wrap_SchemaMethod_getArgumentCount(int, VALUE*, VALUE)':
/home/hudson/jenkins-slave/workspace/Qpid-Java-Cpp-Test/cpp-build/bindings/qmf2/ruby/rubyRUBY_wrap.cxx:12290:36:
warning: format not a string literal and no format arguments [-Wformat-security]
/home/hudson/jenkins-slave/workspace/Qpid-Java-Cpp-Test/cpp-build/bindings/qpid/ruby/rubyRUBY_wrap.cxx:22735:36:
warning: format not a string literal and no format arguments [-Wformat-security]
/home/hudson/jenkins-slave/workspace/Qpid-Java-Cpp-Test/cpp-build/bindings/qpid/ruby/rubyRUBY_wrap.cxx:22739:36:
warning: format not a string literal and no format arguments [-Wformat-security]
/home/hudson/jenkins-slave/workspace/Qpid-Java-Cpp-Test/cpp-build/bindings/qpid/ruby/rubyRUBY_wrap.cxx:22743:36:
warning: format not a string literal and no format arguments [-Wformat-security]
/home/hudson/jenkins-slave/workspace/Qpid-Java-Cpp-Test/cpp-build/bindings/qpid/ruby/rubyRUBY_wrap.cxx:22747:36:
warning: format not a string literal and no format arguments [-Wformat-security]
/home/hudson/jenkins-slave/workspace/Qpid-Java-Cpp-Test/cpp-build/bindings/qpid/ruby/rubyRUBY_wrap.cxx:22751:36:
warning: format not a string literal and no format arguments [-Wformat-security]
/home/hudson/jenkins-slave/workspace/Qpid-Java-Cpp-Test/cpp-build/bindings/qmf2/ruby/rubyRUBY_wrap.cxx:
In function 'VALUE _wrap_SchemaMethod_getArgument(int, VALUE*, VALUE)':
/home/hudson/jenkins-slave/workspace/Qpid-Java-Cpp-Test/cpp-build/bindings/qmf2/ruby/rubyRUBY_wrap.cxx:12331:36:
warning: format not a string literal and no format arguments [-Wformat-security]
/home/hudson/jenkins-slave/workspace/Qpid-Java-Cpp-Test/cpp-build/bindings/qpid/ruby/rubyRUBY_wrap.cxx:22755:36:
warning: format not a string literal and no format arguments [-Wformat-security]
/home/hudson/jenkins-slave/workspace/Qpid-Java-Cpp-Test/cpp-build/bindings/qpid/ruby/rubyRUBY_wrap.cxx:22759:36:
warning: format not a string literal and no format arguments [-Wformat-security]
/home/hudson/jenkins-slave/workspace/Qpid-Java-Cpp-Test/cpp-build/bindings/qpid/ruby/rubyRUBY_wrap.cxx:22762:45:
warning: format not a string literal and no format arguments [-Wformat-security]
/home/hudson/jenkins-slave/workspace/Qpid-Java-Cpp-Test/cpp-build/bindings/qmf2/ruby/rubyRUBY_wrap.cxx:
In function 'VALUE _wrap_new_SchemaProperty__SWIG_0(int, VALUE*, VALUE)':
/home/hudson/jenkins-slave/workspace/Qpid-Java-Cpp-Test/cpp-build/bindings/qmf2/ruby/rubyRUBY_wrap.cxx:12365:36:
warning: format not a string literal and no format arguments [-Wformat-security]
/home/hudson/jenkins-slave/workspace/Qpid-Java-Cpp-Test/cpp-build/bindings/qmf2/ruby/rubyRUBY_wrap.cxx:
In function 'VALUE _wrap_new_SchemaProperty__SWIG_1(int, VALUE*, VALUE)':
/home/hudson/jenkins-slave/workspace/Qpid-Java-Cpp-Test/cpp-build/bindings/qmf2/ruby/rubyRUBY_wrap.cxx:12388:36:
warning: format not a string literal and no format arguments [-Wformat-security]
/home/hudson/jenkins-slave/workspace/Qpid-Java-Cpp-Test/cpp-build/bindings/qmf2/ruby/rubyRUBY_wrap.cxx:
In function 'VALUE _wrap_new_SchemaProperty__SWIG_2(int, VALUE*, VALUE)':
/home/hudson/jenkins-slave/workspace/Qpid-Java-Cpp-Test/cpp-build/bindings/qmf2/ruby/rubyRUBY_wrap.cxx:12422:36:
warning: format not a string literal and no format arguments [-Wformat-security]
/home/hudson/jenkins-slave/workspace/Qpid-Java-Cpp-Test/cpp-build/bindings/qmf2/ruby/rubyRUBY_wrap.cxx:
In function 'VALUE _wrap_new_SchemaProperty__SWIG_3(int, VALUE*, VALUE)':
/home/hudson/jenkins-slave/workspace/Qpid-Java-Cpp-Test/cpp-build/bindings/qmf2/ruby/rubyRUBY_wrap.cxx:12484:36:
warning: format not a string literal and no format arguments [-Wformat-security]
/home/hudson/jenkins-slave/workspace/Qpid-Java-Cpp-Test/cpp-build/bindings/qmf2/ruby/rubyRUBY_wrap.cxx:
In function 'VALUE _wrap_new_SchemaProperty__SWIG_4(int, VALUE*, VALUE)':
/home/hudson/jenkins-slave/workspace/Qpid-Java-Cpp-Test/cpp-build/bindings/qmf2/ruby/rubyRUBY_wrap.cxx:12549:36:
warning: format not a string literal and no format arguments [-Wformat-security]
/home/hudson/jenkins-slave/workspace/Qpid-Java-Cpp-Test/cpp-build/bindings/qmf2/ruby/rubyRUBY_wrap.cxx:
In function 'VALUE _wrap_SchemaProperty_setAccess(int, VALUE*, VALUE)':
/home/hudson/jenkins-slave/workspace/Qpid-Java-Cpp-Test/cpp-build/bindings/qmf2/ruby/rubyRUBY_wrap.cxx:12664:36:
warning: format not a string literal and no format arguments [-Wformat-security]
/home/hudson/jenkins-slave/workspace/Qpid-Java-Cpp-Test/cpp-build/bindings/qmf2/ruby/rubyRUBY_wrap.cxx:
In function 'VALUE _wrap_SchemaProperty_setIndex(int, VALUE*, VALUE)':
/home/hudson/jenkins-slave/workspace/Qpid-Java-Cpp-Test/cpp-build/bindings/qmf2/ruby/rubyRUBY_wrap.cxx:12701:36:
warning: format not a string literal and no format arguments [-Wformat-security]
/home/hudson/jenkins-slave/workspace/Qpid-Java-Cpp-Test/cpp-build/bindings/qmf2/ruby/rubyRUBY_wrap.cxx:
In function 'VALUE _wrap_SchemaProperty_setOptional(int, VALUE*, VALUE)':
/home/hudson/jenkins-slave/workspace/Qpid-Java-Cpp-Test/cpp-build/bindings/qmf2/ruby/rubyRUBY_wrap.cxx:12738:36:
warning: format not a string literal and no format arguments [-Wformat-security]
/home/hudson/jenkins-slave/workspace/Qpid-Java-Cpp-Test/cpp-build/bindings/qmf2/ruby/rubyRUBY_wrap.cxx:
In function 'VALUE _wrap_SchemaProperty_setUnit(int, VALUE*, VALUE)':
/home/hudson/jenkins-slave/workspace/Qpid-Java-Cpp-Test/cpp-build/bindings/qmf2/ruby/rubyRUBY_wrap.cxx:12780:36:
warning: format not a string literal and no format arguments [-Wformat-security]
/home/hudson/jenkins-slave/workspace/Qpid-Java-Cpp-Test/cpp-build/bindings/qmf2/ruby/rubyRUBY_wrap.cxx:
In function 'VALUE _wrap_SchemaProperty_setDesc(int, VALUE*, VALUE)':
/home/hudson/jenkins-slave/workspace/Qpid-Java-Cpp-Test/cpp-build/bindings/qmf2/ruby/rubyRUBY_wrap.cxx:12824:36:
warning: format not a string literal and no format arguments [-Wformat-security]
/home/hudson/jenkins-slave/workspace/Qpid-Java-Cpp-Test/cpp-build/bindings/qmf2/ruby/rubyRUBY_wrap.cxx:
In function 'VALUE _wrap_SchemaProperty_setSubtype(int, VALUE*, VALUE)':
/home/hudson/jenkins-slave/workspace/Qpid-Java-Cpp-Test/cpp-build/bindings/qmf2/ruby/rubyRUBY_wrap.cxx:12868:36:
warning: format not a string literal and no format arguments [-Wformat-security]
/home/hudson/jenkins-slave/workspace/Qpid-Java-Cpp-Test/cpp-build/bindings/qmf2/ruby/rubyRUBY_wrap.cxx:
In function 'VALUE _wrap_SchemaProperty_setDirection(int, VALUE*, VALUE)':
/home/hudson/jenkins-slave/workspace/Qpid-Java-Cpp-Test/cpp-build/bindings/qmf2/ruby/rubyRUBY_wrap.cxx:12907:36:
warning: format not a string literal and no format arguments [-Wformat-security]
/home/hudson/jenkins-slave/workspace/Qpid-Java-Cpp-Test/cpp-build/bindings/qmf2/ruby/rubyRUBY_wrap.cxx:
In function 'VALUE _wrap_SchemaProperty_getName(int, VALUE*, VALUE)':
/home/hudson/jenkins-slave/workspace/Qpid-Java-Cpp-Test/cpp-build/bindings/qmf2/ruby/rubyRUBY_wrap.cxx:12938:36:
warning: format not a string literal and no format arguments [-Wformat-security]
/home/hudson/jenkins-slave/workspace/Qpid-Java-Cpp-Test/cpp-build/bindings/qmf2/ruby/rubyRUBY_wrap.cxx:
In function 'VALUE _wrap_SchemaProperty_getType(int, VALUE*, VALUE)':
/home/hudson/jenkins-slave/workspace/Qpid-Java-Cpp-Test/cpp-build/bindings/qmf2/ruby/rubyRUBY_wrap.cxx:12970:36:
warning: format not a string literal and no format arguments [-Wformat-security]
/home/hudson/jenkins-slave/workspace/Qpid-Java-Cpp-Test/cpp-build/bindings/qmf2/ruby/rubyRUBY_wrap.cxx:
In function 'VALUE _wrap_SchemaProperty_getAccess(int, VALUE*, VALUE)':
/home/hudson/jenkins-slave/workspace/Qpid-Java-Cpp-Test/cpp-build/bindings/qmf2/ruby/rubyRUBY_wrap.cxx:13002:36:
warning: format not a string literal and no format arguments [-Wformat-security]
/home/hudson/jenkins-slave/workspace/Qpid-Java-Cpp-Test/cpp-build/bindings/qmf2/ruby/rubyRUBY_wrap.cxx:
In function 'VALUE _wrap_SchemaProperty_isIndex(int, VALUE*, VALUE)':
/home/hudson/jenkins-slave/workspace/Qpid-Java-Cpp-Test/cpp-build/bindings/qmf2/ruby/rubyRUBY_wrap.cxx:13034:36:
warning: format not a string literal and no format arguments [-Wformat-security]
/home/hudson/jenkins-slave/workspace/Qpid-Java-Cpp-Test/cpp-build/bindings/qmf2/ruby/rubyRUBY_wrap.cxx:
In function 'VALUE _wrap_SchemaProperty_isOptional(int, VALUE*, VALUE)':
/home/hudson/jenkins-slave/workspace/Qpid-Java-Cpp-Test/cpp-build/bindings/qmf2/ruby/rubyRUBY_wrap.cxx:13066:36:
warning: format not a string literal and no format arguments [-Wformat-security]
/home/hudson/jenkins-slave/workspace/Qpid-Java-Cpp-Test/cpp-build/bindings/qmf2/ruby/rubyRUBY_wrap.cxx:
In function 'VALUE _wrap_SchemaProperty_getUnit(int, VALUE*, VALUE)':
/home/hudson/jenkins-slave/workspace/Qpid-Java-Cpp-Test/cpp-build/bindings/qmf2/ruby/rubyRUBY_wrap.cxx:13098:36:
warning: format not a string literal and no format arguments [-Wformat-security]
/home/hudson/jenkins-slave/workspace/Qpid-Java-Cpp-Test/cpp-build/bindings/qmf2/ruby/rubyRUBY_wrap.cxx:
In function 'VALUE _wrap_SchemaProperty_getDesc(int, VALUE*, VALUE)':
/home/hudson/jenkins-slave/workspace/Qpid-Java-Cpp-Test/cpp-build/bindings/qmf2/ruby/rubyRUBY_wrap.cxx:13130:36:
warning: format not a string literal and no format arguments [-Wformat-security]
/home/hudson/jenkins-slave/workspace/Qpid-Java-Cpp-Test/cpp-build/bindings/qmf2/ruby/rubyRUBY_wrap.cxx:
In function 'VALUE _wrap_SchemaProperty_getSubtype(int, VALUE*, VALUE)':
/home/hudson/jenkins-slave/workspace/Qpid-Java-Cpp-Test/cpp-build/bindings/qmf2/ruby/rubyRUBY_wrap.cxx:13162:36:
warning: format not a string literal and no format arguments [-Wformat-security]
/home/hudson/jenkins-slave/workspace/Qpid-Java-Cpp-Test/cpp-build/bindings/qmf2/ruby/rubyRUBY_wrap.cxx:
In function 'VALUE _wrap_SchemaProperty_getDirection(int, VALUE*, VALUE)':
/home/hudson/jenkins-slave/workspace/Qpid-Java-Cpp-Test/cpp-build/bindings/qmf2/ruby/rubyRUBY_wrap.cxx:13194:36:
warning: format not a string literal and no format arguments [-Wformat-security]
/home/hudson/jenkins-slave/workspace/Qpid-Java-Cpp-Test/cpp-build/bindings/qmf2/ruby/rubyRUBY_wrap.cxx:
In function 'VALUE _wrap_new_Subscription__SWIG_0(int, VALUE*, VALUE)':
/home/hudson/jenkins-slave/workspace/Qpid-Java-Cpp-Test/cpp-build/bindings/qmf2/ruby/rubyRUBY_wrap.cxx:13444:36:
warning: format not a string literal and no format arguments [-Wformat-security]
/home/hudson/jenkins-slave/workspace/Qpid-Java-Cpp-Test/cpp-build/bindings/qmf2/ruby/rubyRUBY_wrap.cxx:
In function 'VALUE _wrap_new_Subscription__SWIG_1(int, VALUE*, VALUE)':
/home/hudson/jenkins-slave/workspace/Qpid-Java-Cpp-Test/cpp-build/bindings/qmf2/ruby/rubyRUBY_wrap.cxx:13467:36:
warning: format not a string literal and no format arguments [-Wformat-security]
/home/hudson/jenkins-slave/workspace/Qpid-Java-Cpp-Test/cpp-build/bindings/qmf2/ruby/rubyRUBY_wrap.cxx:
In function 'VALUE _wrap_new_Subscription__SWIG_2(int, VALUE*, VALUE)':
/home/hudson/jenkins-slave/workspace/Qpid-Java-Cpp-Test/cpp-build/bindings/qmf2/ruby/rubyRUBY_wrap.cxx:13518:36:
warning: format not a string literal and no format arguments [-Wformat-security]
/home/hudson/jenkins-slave/workspace/Qpid-Java-Cpp-Test/cpp-build/bindings/qmf2/ruby/rubyRUBY_wrap.cxx:
In function 'VALUE _wrap_Subscription_cancel(int, VALUE*, VALUE)':
/home/hudson/jenkins-slave/workspace/Qpid-Java-Cpp-Test/cpp-build/bindings/qmf2/ruby/rubyRUBY_wrap.cxx:13594:36:
warning: format not a string literal and no format arguments [-Wformat-security]
/home/hudson/jenkins-slave/workspace/Qpid-Java-Cpp-Test/cpp-build/bindings/qmf2/ruby/rubyRUBY_wrap.cxx:
In function 'VALUE _wrap_Subscription_isActive(int, VALUE*, VALUE)':
/home/hudson/jenkins-slave/workspace/Qpid-Java-Cpp-Test/cpp-build/bindings/qmf2/ruby/rubyRUBY_wrap.cxx:13625:36:
warning: format not a string literal and no format arguments [-Wformat-security]
/home/hudson/jenkins-slave/workspace/Qpid-Java-Cpp-Test/cpp-build/bindings/qmf2/ruby/rubyRUBY_wrap.cxx:
In function 'VALUE _wrap_Subscription_lock(int, VALUE*, VALUE)':
/home/hudson/jenkins-slave/workspace/Qpid-Java-Cpp-Test/cpp-build/bindings/qmf2/ruby/rubyRUBY_wrap.cxx:13655:36:
warning: format not a string literal and no format arguments [-Wformat-security]
/home/hudson/jenkins-slave/workspace/Qpid-Java-Cpp-Test/cpp-build/bindings/qmf2/ruby/rubyRUBY_wrap.cxx:
In function 'VALUE _wrap_Subscription_unlock(int, VALUE*, VALUE)':
/home/hudson/jenkins-slave/workspace/Qpid-Java-Cpp-Test/cpp-build/bindings/qmf2/ruby/rubyRUBY_wrap.cxx:13684:36:
warning: format not a string literal and no format arguments [-Wformat-security]
/home/hudson/jenkins-slave/workspace/Qpid-Java-Cpp-Test/cpp-build/bindings/qmf2/ruby/rubyRUBY_wrap.cxx:
In function 'VALUE _wrap_Subscription_getDataCount(int, VALUE*, VALUE)':
/home/hudson/jenkins-slave/workspace/Qpid-Java-Cpp-Test/cpp-build/bindings/qmf2/ruby/rubyRUBY_wrap.cxx:13715:36:
warning: format not a string literal and no format arguments [-Wformat-security]
/home/hudson/jenkins-slave/workspace/Qpid-Java-Cpp-Test/cpp-build/bindings/qmf2/ruby/rubyRUBY_wrap.cxx:
In function 'VALUE _wrap_Subscription_getData(int, VALUE*, VALUE)':
/home/hudson/jenkins-slave/workspace/Qpid-Java-Cpp-Test/cpp-build/bindings/qmf2/ruby/rubyRUBY_wrap.cxx:13756:36:
warning: format not a string literal and no format arguments [-Wformat-security]
Linking CXX shared module _cqmf2.so
[ 73%] Built target _cqmf2
Scanning dependencies of target qmf2_agent
[ 73%] Building CXX object bindings/qmf2/examples/cpp/CMakeFiles/qmf2_agent.dir/agent.o
[ 73%] Building CXX object src/CMakeFiles/qpidbroker.dir/qpid/amqp_0_10/Connection.cpp.o
Linking CXX executable agent
[ 73%] Built target qmf2_agent
Scanning dependencies of target qmf2_event_driven_list_agents
[ 73%] Building CXX object bindings/qmf2/examples/cpp/CMakeFiles/qmf2_event_driven_list_agents.dir/event_driven_list_agents.o
Linking CXX shared module libcqmf2_ruby.so
/usr/bin/ld: /usr/local/lib/libruby-static.a(array.o): relocation R_X86_64_32 against `.rodata.str1.1'
can not be used when making a shared object; recompile with -fPIC
/usr/local/lib/libruby-static.a: could not read symbols: Bad value
collect2: ld returned 1 exit status
make[2]: *** [bindings/qmf2/ruby/libcqmf2_ruby.so] Error 1
make[1]: *** [bindings/qmf2/ruby/CMakeFiles/cqmf2_ruby.dir/all] Error 2
make[1]: *** Waiting for unfinished jobs....
[ 73%] Building CXX object src/CMakeFiles/qpidbroker.dir/qpid/broker/AsyncCommandCallback.cpp.o
Linking CXX executable event_driven_list_agents
[ 73%] Built target qmf2_event_driven_list_agents
[ 73%] Building CXX object src/CMakeFiles/qpidbroker.dir/qpid/broker/Broker.cpp.o
[ 73%] Building CXX object src/CMakeFiles/qpidbroker.dir/qpid/broker/Credit.cpp.o
[ 73%] Building CXX object src/CMakeFiles/qpidbroker.dir/qpid/broker/Exchange.cpp.o
[ 74%] Building CXX object src/CMakeFiles/qpidbroker.dir/qpid/broker/ExpiryPolicy.cpp.o
[ 74%] Building CXX object src/CMakeFiles/qpidbroker.dir/qpid/broker/Fairshare.cpp.o
[ 74%] Building CXX object src/CMakeFiles/qpidbroker.dir/qpid/broker/MessageDeque.cpp.o
Linking CXX shared module libcqpid_ruby.so
/usr/bin/ld: /usr/local/lib/libruby-static.a(array.o): relocation R_X86_64_32 against `.rodata.str1.1'
can not be used when making a shared object; recompile with -fPIC
/usr/local/lib/libruby-static.a: could not read symbols: Bad value
collect2: ld returned 1 exit status
make[2]: *** [bindings/qpid/ruby/libcqpid_ruby.so] Error 1
make[1]: *** [bindings/qpid/ruby/CMakeFiles/cqpid_ruby.dir/all] Error 2
[ 74%] Building CXX object src/CMakeFiles/qpidbroker.dir/qpid/broker/MessageMap.cpp.o
[ 74%] Building CXX object src/CMakeFiles/qpidbroker.dir/qpid/broker/ObjectFactory.cpp.o
[ 74%] Building CXX object src/CMakeFiles/qpidbroker.dir/qpid/broker/PriorityQueue.cpp.o
[ 75%] Building CXX object src/CMakeFiles/qpidbroker.dir/qpid/broker/Protocol.cpp.o
[ 75%] Building CXX object src/CMakeFiles/qpidbroker.dir/qpid/broker/Queue.cpp.o
[ 75%] Building CXX object src/CMakeFiles/qpidbroker.dir/qpid/broker/QueueCleaner.cpp.o
[ 75%] Building CXX object src/CMakeFiles/qpidbroker.dir/qpid/broker/QueueListeners.cpp.o
[ 75%] Building CXX object src/CMakeFiles/qpidbroker.dir/qpid/broker/FifoDistributor.cpp.o
[ 75%] Building CXX object src/CMakeFiles/qpidbroker.dir/qpid/broker/MessageGroupManager.cpp.o
[ 76%] Building CXX object src/CMakeFiles/qpidbroker.dir/qpid/broker/PersistableMessage.cpp.o
[ 76%] Building CXX object src/CMakeFiles/qpidbroker.dir/qpid/broker/PersistableObject.cpp.o
[ 76%] Building CXX object src/CMakeFiles/qpidbroker.dir/qpid/broker/Bridge.cpp.o
[ 76%] Building CXX object src/CMakeFiles/qpidbroker.dir/qpid/broker/amqp_0_10/Connection.cpp.o
[ 76%] Building CXX object src/CMakeFiles/qpidbroker.dir/qpid/broker/ConnectionHandler.cpp.o
[ 77%] Building CXX object src/CMakeFiles/qpidbroker.dir/qpid/broker/DeliverableMessage.cpp.o
[ 77%] Building CXX object src/CMakeFiles/qpidbroker.dir/qpid/broker/DeliveryRecord.cpp.o
[ 77%] Building CXX object src/CMakeFiles/qpidbroker.dir/qpid/broker/DirectExchange.cpp.o
[ 77%] Building CXX object src/CMakeFiles/qpidbroker.dir/qpid/broker/DtxAck.cpp.o
[ 77%] Building CXX object src/CMakeFiles/qpidbroker.dir/qpid/broker/DtxBuffer.cpp.o
[ 77%] Building CXX object src/CMakeFiles/qpidbroker.dir/qpid/broker/DtxManager.cpp.o
[ 78%] Building CXX object src/CMakeFiles/qpidbroker.dir/qpid/broker/DtxTimeout.cpp.o
[ 78%] Building CXX object src/CMakeFiles/qpidbroker.dir/qpid/broker/DtxWorkRecord.cpp.o
[ 78%] Building CXX object src/CMakeFiles/qpidbroker.dir/qpid/broker/ExchangeRegistry.cpp.o
[ 78%] Building CXX object src/CMakeFiles/qpidbroker.dir/qpid/broker/FanOutExchange.cpp.o
[ 78%] Building CXX object src/CMakeFiles/qpidbroker.dir/qpid/broker/HeadersExchange.cpp.o
[ 78%] Building CXX object src/CMakeFiles/qpidbroker.dir/qpid/broker/IngressCompletion.cpp.o
[ 79%] Building CXX object src/CMakeFiles/qpidbroker.dir/qpid/broker/Link.cpp.o
[ 79%] Building CXX object src/CMakeFiles/qpidbroker.dir/qpid/broker/LinkRegistry.cpp.o
[ 79%] Building CXX object src/CMakeFiles/qpidbroker.dir/qpid/broker/LossyQueue.cpp.o
[ 79%] Building CXX object src/CMakeFiles/qpidbroker.dir/qpid/broker/Lvq.cpp.o
[ 79%] Building CXX object src/CMakeFiles/qpidbroker.dir/qpid/broker/Message.cpp.o
[ 79%] Building CXX object src/CMakeFiles/qpidbroker.dir/qpid/broker/MessageAdapter.cpp.o
[ 80%] [ 80%] Building CXX object src/CMakeFiles/qpidbroker.dir/qpid/broker/MessageStoreModule.cpp.o
Building CXX object src/CMakeFiles/qpidbroker.dir/qpid/broker/MessageBuilder.cpp.o
[ 80%] Building CXX object src/CMakeFiles/qpidbroker.dir/qpid/broker/NameGenerator.cpp.o
[ 80%] [ 80%] Building CXX object src/CMakeFiles/qpidbroker.dir/qpid/broker/PagedQueue.cpp.o
Building CXX object src/CMakeFiles/qpidbroker.dir/qpid/broker/NullMessageStore.cpp.o
[ 80%] Building CXX object src/CMakeFiles/qpidbroker.dir/qpid/broker/QueueBindings.cpp.o
[ 81%] Building CXX object src/CMakeFiles/qpidbroker.dir/qpid/broker/QueuedMessage.cpp.o
[ 81%] Building CXX object src/CMakeFiles/qpidbroker.dir/qpid/broker/QueueCursor.cpp.o
[ 81%] Building CXX object src/CMakeFiles/qpidbroker.dir/qpid/broker/QueueDepth.cpp.o
[ 81%] Building CXX object src/CMakeFiles/qpidbroker.dir/qpid/broker/QueueFactory.cpp.o
[ 81%] Building CXX object src/CMakeFiles/qpidbroker.dir/qpid/broker/QueueRegistry.cpp.o
[ 81%] Building CXX object src/CMakeFiles/qpidbroker.dir/qpid/broker/QueueSettings.cpp.o
[ 82%] Building CXX object src/CMakeFiles/qpidbroker.dir/qpid/broker/QueueFlowLimit.cpp.o
[ 82%] Building CXX object src/CMakeFiles/qpidbroker.dir/qpid/broker/RecoveryManagerImpl.cpp.o
[ 82%] [ 82%] Building CXX object src/CMakeFiles/qpidbroker.dir/qpid/broker/RecoveredDequeue.cpp.o
Building CXX object src/CMakeFiles/qpidbroker.dir/qpid/broker/RecoveredEnqueue.cpp.o
[ 82%] Building CXX object src/CMakeFiles/qpidbroker.dir/qpid/broker/RetryList.cpp.o
[ 83%] Building CXX object src/CMakeFiles/qpidbroker.dir/qpid/broker/SecureConnection.cpp.o
[ 83%] Building CXX object src/CMakeFiles/qpidbroker.dir/qpid/broker/SecureConnectionFactory.cpp.o
[ 83%] Building CXX object src/CMakeFiles/qpidbroker.dir/qpid/broker/Selector.cpp.o
[ 83%] [ 83%] Building CXX object src/CMakeFiles/qpidbroker.dir/qpid/broker/SelectorToken.cpp.o
Building CXX object src/CMakeFiles/qpidbroker.dir/qpid/broker/SelectorExpression.cpp.o
[ 83%] Building CXX object src/CMakeFiles/qpidbroker.dir/qpid/broker/SelectorValue.cpp.o
[ 84%] Building CXX object src/CMakeFiles/qpidbroker.dir/qpid/broker/SelfDestructQueue.cpp.o
[ 84%] Building CXX object src/CMakeFiles/qpidbroker.dir/qpid/broker/SemanticState.cpp.o
[ 84%] Building CXX object src/CMakeFiles/qpidbroker.dir/qpid/broker/SessionAdapter.cpp.o
[ 84%] Building CXX object src/CMakeFiles/qpidbroker.dir/qpid/broker/SessionState.cpp.o
[ 84%] Building CXX object src/CMakeFiles/qpidbroker.dir/qpid/broker/SessionManager.cpp.o
[ 84%] Building CXX object src/CMakeFiles/qpidbroker.dir/qpid/broker/SessionHandler.cpp.o
[ 85%] Building CXX object src/CMakeFiles/qpidbroker.dir/qpid/broker/System.cpp.o
[ 85%] Building CXX object src/CMakeFiles/qpidbroker.dir/qpid/broker/ThresholdAlerts.cpp.o
[ 85%] Building CXX object src/CMakeFiles/qpidbroker.dir/qpid/broker/TopicExchange.cpp.o
[ 85%] Building CXX object src/CMakeFiles/qpidbroker.dir/qpid/broker/TxAccept.cpp.o
[ 85%] Building CXX object src/CMakeFiles/qpidbroker.dir/qpid/broker/TxBuffer.cpp.o
[ 85%] Building CXX object src/CMakeFiles/qpidbroker.dir/qpid/broker/Vhost.cpp.o
[ 86%] Building CXX object src/CMakeFiles/qpidbroker.dir/qpid/broker/amqp_0_10/MessageTransfer.cpp.o
[ 86%] Building CXX object src/CMakeFiles/qpidbroker.dir/qpid/management/ManagementAgent.cpp.o
[ 86%] Building CXX object src/CMakeFiles/qpidbroker.dir/qpid/management/ManagementDirectExchange.cpp.o
[ 86%] Building CXX object src/CMakeFiles/qpidbroker.dir/qpid/management/ManagementTopicExchange.cpp.o
[ 86%] Building CXX object src/CMakeFiles/qpidbroker.dir/qpid/sys/SocketTransport.cpp.o
[ 86%] Building CXX object src/CMakeFiles/qpidbroker.dir/qpid/sys/TCPIOPlugin.cpp.o
Linking CXX shared library libqpidbroker.so
[ 86%] Built target qpidbroker
make: *** [all] Error 2
Build step 'Execute shell' marked build as failure
[locks-and-latches] Releasing all the locks
[locks-and-latches] All the locks released
Recording test results

Mime
View raw message