qpid-notifications mailing list archives

Site index · List index
Message view « Date » · « Thread »
Top « Date » · « Thread »
From Apache Jenkins Server <jenk...@builds.apache.org>
Subject Build failed in Jenkins: Qpid-Java-Java-Test-IBMJDK1.6 #671
Date Sat, 01 Feb 2014 02:48:22 GMT
See <https://builds.apache.org/job/Qpid-Java-Java-Test-IBMJDK1.6/671/changes>

Changes:

[kwall] NO-JIRA: [JMS Client 0-8 documentation] Correct pub/sub example to use a integer price
property (suitable for the inequality in the example's message selector).  Correct typo in
'Maximum Delivery Count' section and add note that JMSXDeliveryCount optional property is
not supported.

[kwall] QPID-5514: [Java Broker Documentation] Change ports section to note that fact that
only HTTP/JMX ports remain listening after port deletion.

[kwall] QPID-5525: [Java Broker Documentation] Add simple JMX documentation: simple guide
to connecting with jconsole,
simple jmx client example and MBean summary with links to interfaces source files.

[astitcher] QPID-5485: If no directory for paging file is enabled print warning (as if
memory mapped files were not supported) but still create a queue.
- Also improve DataDir const correctness.

[robbie] QPID-5527: Upgrade to Jetty 8

Applied patch from Emmanuel Bourg.

[astitcher] QPID-5485: Fixes to broken original checkin
- Fix signatures of dummy windows memory mapped file implementation
- Fix detecting no data dir

[gsim] QPID-5529: remove failed send from delivery buffer

------------------------------------------
[...truncated 5045 lines...]
    [junit] Running org.apache.qpid.test.unit.client.MaxDeliveryCountTest
    [junit] Tests run: 7, Failures: 0, Errors: 0, Time elapsed: 3.504 sec
    [junit] Running org.apache.qpid.test.unit.client.QueueSessionFactoryTest
    [junit] Tests run: 5, Failures: 0, Errors: 0, Time elapsed: 0.207 sec
    [junit] Running org.apache.qpid.test.unit.client.TopicSessionFactoryTest
    [junit] Tests run: 4, Failures: 0, Errors: 0, Time elapsed: 0.139 sec
    [junit] Running org.apache.qpid.test.unit.client.channelclose.CloseWithBlockingReceiveTest
    [junit] Tests run: 1, Failures: 0, Errors: 0, Time elapsed: 1.031 sec
    [junit] Running org.apache.qpid.test.unit.client.connection.BrokerClosesClientConnectionTest
    [junit] Tests run: 3, Failures: 0, Errors: 0, Time elapsed: 12.126 sec
    [junit] Running org.apache.qpid.test.unit.client.connection.ConnectionFactoryTest
    [junit] Tests run: 2, Failures: 0, Errors: 0, Time elapsed: 0.06 sec
    [junit] Running org.apache.qpid.test.unit.client.connection.ConnectionStartTest
    [junit] Tests run: 2, Failures: 0, Errors: 0, Time elapsed: 0.097 sec
    [junit] Running org.apache.qpid.test.unit.client.connection.ConnectionTest
    [junit] Tests run: 12, Failures: 0, Errors: 0, Time elapsed: 0.399 sec
    [junit] Running org.apache.qpid.test.unit.client.connection.ExceptionListenerTest
    [junit] Tests run: 3, Failures: 0, Errors: 0, Time elapsed: 0.117 sec
    [junit] Running org.apache.qpid.test.unit.client.message.ObjectMessageTest
    [junit] Tests run: 10, Failures: 0, Errors: 0, Time elapsed: 0.355 sec
    [junit] Running org.apache.qpid.test.unit.client.protocol.AMQProtocolSessionTest
    [junit] Tests run: 5, Failures: 0, Errors: 0, Time elapsed: 0.176 sec
    [junit] Running org.apache.qpid.test.unit.client.temporaryqueue.TemporaryQueueTest
    [junit] Tests run: 4, Failures: 0, Errors: 0, Time elapsed: 0.121 sec
    [junit] Running org.apache.qpid.test.unit.close.JavaServerCloseRaceConditionTest
    [junit] Tests run: 0, Failures: 0, Errors: 0, Time elapsed: 0.002 sec
    [junit] Running org.apache.qpid.test.unit.close.MessageConsumerCloseTest
    [junit] Tests run: 1, Failures: 0, Errors: 0, Time elapsed: 0.033 sec
    [junit] Running org.apache.qpid.test.unit.close.MessageRequeueTest
    [junit] Tests run: 3, Failures: 0, Errors: 0, Time elapsed: 16.335 sec
    [junit] Running org.apache.qpid.test.unit.close.TopicPublisherCloseTest
    [junit] Tests run: 1, Failures: 0, Errors: 0, Time elapsed: 3.031 sec
    [junit] Running org.apache.qpid.test.unit.ct.DurableSubscriberTest
    [junit] Tests run: 0, Failures: 0, Errors: 0, Time elapsed: 0.001 sec
    [junit] Running org.apache.qpid.test.unit.message.JMSPropertiesTest
    [junit] Tests run: 2, Failures: 0, Errors: 0, Time elapsed: 0.107 sec
    [junit] Running org.apache.qpid.test.unit.message.StreamMessageTest
    [junit] Tests run: 2, Failures: 0, Errors: 0, Time elapsed: 0.068 sec
    [junit] Running org.apache.qpid.test.unit.message.UTF8Test
    [junit] Tests run: 2, Failures: 0, Errors: 0, Time elapsed: 0.061 sec
    [junit] Running org.apache.qpid.test.unit.topic.DurableSubscriptionTest
    [junit] Tests run: 17, Failures: 0, Errors: 0, Time elapsed: 28.235 sec
    [junit] Running org.apache.qpid.test.unit.topic.TemporaryTopicTest
    [junit] Tests run: 5, Failures: 0, Errors: 0, Time elapsed: 0.151 sec
    [junit] Running org.apache.qpid.test.unit.topic.TopicPublisherTest
    [junit] Tests run: 1, Failures: 0, Errors: 0, Time elapsed: 0.06 sec
    [junit] Running org.apache.qpid.test.unit.topic.TopicSessionTest
    [junit] Tests run: 9, Failures: 0, Errors: 0, Time elapsed: 9.714 sec
    [junit] Running org.apache.qpid.test.unit.transacted.CommitRollbackTest
    [junit] Tests run: 12, Failures: 0, Errors: 0, Time elapsed: 15.487 sec
    [junit] Running org.apache.qpid.test.unit.transacted.TransactedTest
    [junit] Tests run: 7, Failures: 0, Errors: 0, Time elapsed: 7.834 sec
    [junit] Running org.apache.qpid.test.unit.transacted.TransactionTimeoutDisabledTest
    [junit] Tests run: 2, Failures: 0, Errors: 0, Time elapsed: 3.594 sec
    [junit] Running org.apache.qpid.test.unit.transacted.TransactionTimeoutTest
    [junit] Tests run: 15, Failures: 0, Errors: 0, Time elapsed: 42.555 sec
    [junit] Running org.apache.qpid.test.unit.xa.FaultTest
    [junit] Tests run: 10, Failures: 0, Errors: 0, Time elapsed: 11.862 sec
    [junit] Running org.apache.qpid.test.unit.xa.QueueTest
    [junit] Tests run: 1, Failures: 0, Errors: 0, Time elapsed: 1.04 sec
    [junit] Running org.apache.qpid.test.unit.xa.TopicTest
    [junit] Tests run: 4, Failures: 0, Errors: 0, Time elapsed: 4.227 sec
    [junit] Running org.apache.qpid.test.utils.BrokerCommandHelperTest
    [junit] Tests run: 2, Failures: 0, Errors: 0, Time elapsed: 0.032 sec
    [junit] Running org.apache.qpid.util.LogMonitorTest
    [junit] Tests run: 9, Failures: 0, Errors: 0, Time elapsed: 2.014 sec
     [echo] Running ant for module : systests

touch-failed:
     [echo] Running ant for module : perftests

prepare:

precompile:

compile:
     [echo] Targeting : 1.6

copy-extra-resources:

copy-resources:
     [echo] Copying resources from <https://builds.apache.org/job/Qpid-Java-Java-Test-IBMJDK1.6/ws/trunk/qpid/java/perftests/src/main/resources>
to <https://builds.apache.org/job/Qpid-Java-Java-Test-IBMJDK1.6/ws/trunk/qpid/java/build/scratch/perftests/classes...>

copy-project-resources-metainf:

copy-module-resources-metainf:

copy-module-src-resources-metainf:

copy-files-to-module-metainf:

jar.manifest:

jar.nomanifest:

jar:

precompile-tests:

compile-tests:

copy-test-resources:

jar-tests:

jar-sources:

libs:

copy-bin:

copy-etc:

postbuild:

copy-broker-plugin-jars-deps:

copy-broker-plugin-jars:

build:

test:
     [echo] Using profile:java-mms.0-10
    [junit] Running org.apache.qpid.disttest.ArgumentParserTest
    [junit] Tests run: 3, Failures: 0, Errors: 0, Time elapsed: 0.054 sec
    [junit] Running org.apache.qpid.disttest.ConfigFileHelperTest
    [junit] Tests run: 1, Failures: 0, Errors: 0, Time elapsed: 0.031 sec
    [junit] Running org.apache.qpid.disttest.ResultsFileWriterTest
    [junit] Tests run: 2, Failures: 0, Errors: 0, Time elapsed: 0.143 sec
    [junit] Running org.apache.qpid.disttest.VisitorTest
    [junit] Tests run: 3, Failures: 0, Errors: 0, Time elapsed: 0.005 sec
    [junit] Running org.apache.qpid.disttest.client.ClientCommandVisitorTest
    [junit] Tests run: 8, Failures: 0, Errors: 0, Time elapsed: 0.062 sec
    [junit] Running org.apache.qpid.disttest.client.ClientTest
    [junit] Tests run: 8, Failures: 0, Errors: 0, Time elapsed: 0.562 sec
    [junit] Running org.apache.qpid.disttest.client.ConsumerParticipantTest
    [junit] Tests run: 7, Failures: 0, Errors: 0, Time elapsed: 0.203 sec
    [junit] Running org.apache.qpid.disttest.client.MessageProviderTest
    [junit] Tests run: 3, Failures: 0, Errors: 0, Time elapsed: 0.188 sec
    [junit] Running org.apache.qpid.disttest.client.ParticipantExecutorTest
    [junit] Tests run: 4, Failures: 0, Errors: 0, Time elapsed: 0.026 sec
    [junit] Running org.apache.qpid.disttest.client.ParticipantRegistryTest
    [junit] Tests run: 2, Failures: 0, Errors: 0, Time elapsed: 0.003 sec
    [junit] Running org.apache.qpid.disttest.client.ParticipantResultFactoryTest
    [junit] Tests run: 3, Failures: 0, Errors: 0, Time elapsed: 0.004 sec
    [junit] Running org.apache.qpid.disttest.client.ProducerParticipantTest
    [junit] Tests run: 9, Failures: 0, Errors: 0, Time elapsed: 1.796 sec
    [junit] Running org.apache.qpid.disttest.client.property.ListPropertyValueTest
    [junit] Tests run: 3, Failures: 0, Errors: 0, Time elapsed: 0.003 sec
    [junit] Running org.apache.qpid.disttest.client.property.PropertyValueFactoryTest
    [junit] Tests run: 5, Failures: 0, Errors: 0, Time elapsed: 0.005 sec
    [junit] Running org.apache.qpid.disttest.client.property.RandomPropertyValueTest
    [junit] Tests run: 5, Failures: 0, Errors: 0, Time elapsed: 0.003 sec
    [junit] Running org.apache.qpid.disttest.client.property.RangePropertyValueTest
    [junit] Tests run: 8, Failures: 0, Errors: 0, Time elapsed: 0.005 sec
    [junit] Running org.apache.qpid.disttest.client.property.SimplePropertyValueTest
    [junit] Tests run: 1, Failures: 0, Errors: 0, Time elapsed: 0.002 sec
    [junit] Running org.apache.qpid.disttest.client.utils.ExecutorWithNoLimitsTest
    [junit] Tests run: 2, Failures: 0, Errors: 0, Time elapsed: 0.003 sec
    [junit] Running org.apache.qpid.disttest.client.utils.ExecutorWithTimeLimitTest
    [junit] Tests run: 4, Failures: 0, Errors: 0, Time elapsed: 0.506 sec
    [junit] Running org.apache.qpid.disttest.controller.ClientRegistryTest
    [junit] Tests run: 8, Failures: 0, Errors: 0, Time elapsed: 2.557 sec
    [junit] Running org.apache.qpid.disttest.controller.ControllerTest
    [junit] Tests run: 6, Failures: 0, Errors: 0, Time elapsed: 0.462 sec
    [junit] Running org.apache.qpid.disttest.controller.ParticipatingClientsTest
    [junit] Tests run: 5, Failures: 0, Errors: 0, Time elapsed: 0.005 sec
    [junit] Running org.apache.qpid.disttest.controller.TestRunnerTest
    [junit] Tests run: 6, Failures: 0, Errors: 1, Time elapsed: 4.215 sec
    [junit] TEST org.apache.qpid.disttest.controller.TestRunnerTest FAILED
    [junit] Running org.apache.qpid.disttest.controller.config.ClientConfigTest
    [junit] Tests run: 4, Failures: 0, Errors: 0, Time elapsed: 0.008 sec
    [junit] Running org.apache.qpid.disttest.controller.config.ConfigReaderTest
    [junit] Tests run: 5, Failures: 0, Errors: 0, Time elapsed: 2.373 sec
    [junit] Running org.apache.qpid.disttest.controller.config.ConfigTest
    [junit] Tests run: 1, Failures: 0, Errors: 0, Time elapsed: 0.007 sec
    [junit] Running org.apache.qpid.disttest.controller.config.ConnectionConfigTest
    [junit] Tests run: 3, Failures: 0, Errors: 0, Time elapsed: 0.009 sec
    [junit] Running org.apache.qpid.disttest.controller.config.ConsumerConfigTest
    [junit] Tests run: 2, Failures: 0, Errors: 0, Time elapsed: 0.005 sec
    [junit] Running org.apache.qpid.disttest.controller.config.IterationValueTest
    [junit] Tests run: 3, Failures: 0, Errors: 0, Time elapsed: 0.026 sec
    [junit] Running org.apache.qpid.disttest.controller.config.JavaScriptConfigEvaluatorTest
    [junit] Tests run: 1, Failures: 0, Errors: 0, Time elapsed: 0.045 sec
    [junit] Running org.apache.qpid.disttest.controller.config.MessageProviderConfigTest
    [junit] Tests run: 2, Failures: 0, Errors: 0, Time elapsed: 0.002 sec
    [junit] Running org.apache.qpid.disttest.controller.config.ParticipantConfigTest
    [junit] Tests run: 1, Failures: 0, Errors: 0, Time elapsed: 0.007 sec
    [junit] Running org.apache.qpid.disttest.controller.config.ProducerConfigTest
    [junit] Tests run: 3, Failures: 0, Errors: 0, Time elapsed: 0.003 sec
    [junit] Running org.apache.qpid.disttest.controller.config.SessionConfigTest
    [junit] Tests run: 3, Failures: 0, Errors: 0, Time elapsed: 0.015 sec
    [junit] Running org.apache.qpid.disttest.controller.config.TestConfigTest
    [junit] Tests run: 5, Failures: 0, Errors: 0, Time elapsed: 0.007 sec
    [junit] Running org.apache.qpid.disttest.controller.config.TestInstanceTest
    [junit] Tests run: 3, Failures: 0, Errors: 0, Time elapsed: 0.006 sec
    [junit] Running org.apache.qpid.disttest.db.ResultsDbWriterTest
    [junit] Tests run: 2, Failures: 0, Errors: 0, Time elapsed: 1.745 sec
    [junit] Running org.apache.qpid.disttest.jms.JmsMessageAdaptorTest
    [junit] Tests run: 1, Failures: 0, Errors: 0, Time elapsed: 0.003 sec
    [junit] Running org.apache.qpid.disttest.message.JsonHandlerTest
    [junit] Tests run: 2, Failures: 0, Errors: 0, Time elapsed: 0.022 sec
    [junit] Running org.apache.qpid.disttest.message.ParticipantResultTest
    [junit] Tests run: 3, Failures: 0, Errors: 0, Time elapsed: 0.05 sec
    [junit] Running org.apache.qpid.disttest.results.aggregation.AggregatorTest
    [junit] Tests run: 1, Failures: 0, Errors: 0, Time elapsed: 0.008 sec
    [junit] Running org.apache.qpid.disttest.results.aggregation.ParticipantResultAggregatorTest
    [junit] Tests run: 14, Failures: 0, Errors: 0, Time elapsed: 0.006 sec
    [junit] Running org.apache.qpid.disttest.results.aggregation.SeriesStatisticsTest
    [junit] Tests run: 1, Failures: 0, Errors: 0, Time elapsed: 0.002 sec
    [junit] Running org.apache.qpid.disttest.results.aggregation.TestResultAggregatorTest
    [junit] Tests run: 4, Failures: 0, Errors: 0, Time elapsed: 0.004 sec
    [junit] Running org.apache.qpid.disttest.results.formatting.CSVFormatterTest
    [junit] Tests run: 1, Failures: 0, Errors: 0, Time elapsed: 0.003 sec
    [junit] Running org.apache.qpid.disttest.results.formatting.CSVOrderParticipantResultComparatorTest
    [junit] Tests run: 6, Failures: 0, Errors: 0, Time elapsed: 0.011 sec
    [junit] Running org.apache.qpid.systest.disttest.QpidQueueCreatorTest
    [junit] Tests run: 3, Failures: 0, Errors: 0, Time elapsed: 1.116 sec
    [junit] Running org.apache.qpid.systest.disttest.clientonly.BasicDistributedClientTest
    [junit] Tests run: 5, Failures: 0, Errors: 0, Time elapsed: 0.518 sec
    [junit] Running org.apache.qpid.systest.disttest.clientonly.ConsumerParticipantTest
    [junit] Tests run: 3, Failures: 0, Errors: 0, Time elapsed: 6.282 sec
    [junit] Running org.apache.qpid.systest.disttest.clientonly.DistributedClientTest
    [junit] Tests run: 9, Failures: 0, Errors: 0, Time elapsed: 0.808 sec
    [junit] Running org.apache.qpid.systest.disttest.clientonly.MessageProviderTest
    [junit] Tests run: 2, Failures: 0, Errors: 0, Time elapsed: 0.124 sec
    [junit] Running org.apache.qpid.systest.disttest.clientonly.ProducerParticipantTest
    [junit] Tests run: 1, Failures: 0, Errors: 0, Time elapsed: 0.567 sec
    [junit] Running org.apache.qpid.systest.disttest.controllerandclient.ControllerAndClientTest
    [junit] Tests run: 5, Failures: 0, Errors: 0, Time elapsed: 1.828 sec
    [junit] Running org.apache.qpid.systest.disttest.controlleronly.DistributedControllerTest
    [junit] Tests run: 1, Failures: 0, Errors: 0, Time elapsed: 1.072 sec
    [junit] Running org.apache.qpid.systest.disttest.endtoend.EndToEndTest
    [junit] Tests run: 1, Failures: 0, Errors: 0, Time elapsed: 0.299 sec
    [junit] Tests FAILED
     [echo] Running ant for module : perftests

touch-failed:
    [touch] Creating <https://builds.apache.org/job/Qpid-Java-Java-Test-IBMJDK1.6/ws/trunk/qpid/java/build/results/perftests/FAILED>
    [touch] Creating <https://builds.apache.org/job/Qpid-Java-Java-Test-IBMJDK1.6/ws/trunk/qpid/java/build/results/FAILED>

BUILD FAILED
<https://builds.apache.org/job/Qpid-Java-Java-Test-IBMJDK1.6/ws/trunk/qpid/java/build.xml>:107:
TEST SUITE FAILED

Total time: 16 minutes 1 second
Build step 'Invoke Ant' marked build as failure
[locks-and-latches] Releasing all the locks
[locks-and-latches] All the locks released
Recording test results

Mime
View raw message