qpid-notifications mailing list archives

Site index · List index
Message view « Date » · « Thread »
Top « Date » · « Thread »
From Apache Jenkins Server <jenk...@builds.apache.org>
Subject Build failed in Jenkins: Qpid-Java-Cpp-Test #1631
Date Fri, 10 Jan 2014 23:26:53 GMT
See <https://builds.apache.org/job/Qpid-Java-Cpp-Test/1631/changes>

Changes:

[gsim] QPID-5469: link should not override a topic policy specifying autodeletion

[gsim] QPID-5468: fix handling of delete-if-unused for sending links

------------------------------------------
[...truncated 5192 lines...]
/home/hudson/jenkins-slave/workspace/Qpid-Java-Cpp-Test/cpp-build/bindings/qpid/ruby/rubyRUBY_wrap.cxx:21933:36:
warning: format not a string literal and no format arguments [-Wformat-security]
/home/hudson/jenkins-slave/workspace/Qpid-Java-Cpp-Test/cpp-build/bindings/qpid/ruby/rubyRUBY_wrap.cxx:21937:36:
warning: format not a string literal and no format arguments [-Wformat-security]
/home/hudson/jenkins-slave/workspace/Qpid-Java-Cpp-Test/cpp-build/bindings/qpid/ruby/rubyRUBY_wrap.cxx:21941:36:
warning: format not a string literal and no format arguments [-Wformat-security]
/home/hudson/jenkins-slave/workspace/Qpid-Java-Cpp-Test/cpp-build/bindings/qpid/ruby/rubyRUBY_wrap.cxx:21945:36:
warning: format not a string literal and no format arguments [-Wformat-security]
/home/hudson/jenkins-slave/workspace/Qpid-Java-Cpp-Test/cpp-build/bindings/qpid/ruby/rubyRUBY_wrap.cxx:21949:36:
warning: format not a string literal and no format arguments [-Wformat-security]
/home/hudson/jenkins-slave/workspace/Qpid-Java-Cpp-Test/cpp-build/bindings/qpid/ruby/rubyRUBY_wrap.cxx:21953:36:
warning: format not a string literal and no format arguments [-Wformat-security]
/home/hudson/jenkins-slave/workspace/Qpid-Java-Cpp-Test/cpp-build/bindings/qpid/ruby/rubyRUBY_wrap.cxx:21957:36:
warning: format not a string literal and no format arguments [-Wformat-security]
/home/hudson/jenkins-slave/workspace/Qpid-Java-Cpp-Test/cpp-build/bindings/qpid/ruby/rubyRUBY_wrap.cxx:21961:36:
warning: format not a string literal and no format arguments [-Wformat-security]
/home/hudson/jenkins-slave/workspace/Qpid-Java-Cpp-Test/cpp-build/bindings/qpid/ruby/rubyRUBY_wrap.cxx:21965:36:
warning: format not a string literal and no format arguments [-Wformat-security]
/home/hudson/jenkins-slave/workspace/Qpid-Java-Cpp-Test/cpp-build/bindings/qpid/ruby/rubyRUBY_wrap.cxx:21969:36:
warning: format not a string literal and no format arguments [-Wformat-security]
/home/hudson/jenkins-slave/workspace/Qpid-Java-Cpp-Test/cpp-build/bindings/qpid/ruby/rubyRUBY_wrap.cxx:21973:36:
warning: format not a string literal and no format arguments [-Wformat-security]
/home/hudson/jenkins-slave/workspace/Qpid-Java-Cpp-Test/cpp-build/bindings/qpid/ruby/rubyRUBY_wrap.cxx:21977:36:
warning: format not a string literal and no format arguments [-Wformat-security]
/home/hudson/jenkins-slave/workspace/Qpid-Java-Cpp-Test/cpp-build/bindings/qpid/ruby/rubyRUBY_wrap.cxx:21981:36:
warning: format not a string literal and no format arguments [-Wformat-security]
/home/hudson/jenkins-slave/workspace/Qpid-Java-Cpp-Test/cpp-build/bindings/qpid/ruby/rubyRUBY_wrap.cxx:21984:45:
warning: format not a string literal and no format arguments [-Wformat-security]
/home/hudson/jenkins-slave/workspace/Qpid-Java-Cpp-Test/cpp-build/bindings/qpid/ruby/rubyRUBY_wrap.cxx:
In function 'VALUE _wrap_Connection_createSession__SWIG_1(int, VALUE*, VALUE)':
/home/hudson/jenkins-slave/workspace/Qpid-Java-Cpp-Test/cpp-build/bindings/qpid/ruby/rubyRUBY_wrap.cxx:22021:36:
warning: format not a string literal and no format arguments [-Wformat-security]
/home/hudson/jenkins-slave/workspace/Qpid-Java-Cpp-Test/cpp-build/bindings/qpid/ruby/rubyRUBY_wrap.cxx:22025:36:
warning: format not a string literal and no format arguments [-Wformat-security]
/home/hudson/jenkins-slave/workspace/Qpid-Java-Cpp-Test/cpp-build/bindings/qpid/ruby/rubyRUBY_wrap.cxx:22029:36:
warning: format not a string literal and no format arguments [-Wformat-security]
/home/hudson/jenkins-slave/workspace/Qpid-Java-Cpp-Test/cpp-build/bindings/qpid/ruby/rubyRUBY_wrap.cxx:22033:36:
warning: format not a string literal and no format arguments [-Wformat-security]
/home/hudson/jenkins-slave/workspace/Qpid-Java-Cpp-Test/cpp-build/bindings/qpid/ruby/rubyRUBY_wrap.cxx:22037:36:
warning: format not a string literal and no format arguments [-Wformat-security]
/home/hudson/jenkins-slave/workspace/Qpid-Java-Cpp-Test/cpp-build/bindings/qpid/ruby/rubyRUBY_wrap.cxx:22041:36:
warning: format not a string literal and no format arguments [-Wformat-security]
/home/hudson/jenkins-slave/workspace/Qpid-Java-Cpp-Test/cpp-build/bindings/qpid/ruby/rubyRUBY_wrap.cxx:22045:36:
warning: format not a string literal and no format arguments [-Wformat-security]
/home/hudson/jenkins-slave/workspace/Qpid-Java-Cpp-Test/cpp-build/bindings/qpid/ruby/rubyRUBY_wrap.cxx:22049:36:
warning: format not a string literal and no format arguments [-Wformat-security]
/home/hudson/jenkins-slave/workspace/Qpid-Java-Cpp-Test/cpp-build/bindings/qpid/ruby/rubyRUBY_wrap.cxx:22053:36:
warning: format not a string literal and no format arguments [-Wformat-security]
/home/hudson/jenkins-slave/workspace/Qpid-Java-Cpp-Test/cpp-build/bindings/qpid/ruby/rubyRUBY_wrap.cxx:22057:36:
warning: format not a string literal and no format arguments [-Wformat-security]
/home/hudson/jenkins-slave/workspace/Qpid-Java-Cpp-Test/cpp-build/bindings/qpid/ruby/rubyRUBY_wrap.cxx:22061:36:
warning: format not a string literal and no format arguments [-Wformat-security]
/home/hudson/jenkins-slave/workspace/Qpid-Java-Cpp-Test/cpp-build/bindings/qpid/ruby/rubyRUBY_wrap.cxx:22065:36:
warning: format not a string literal and no format arguments [-Wformat-security]
/home/hudson/jenkins-slave/workspace/Qpid-Java-Cpp-Test/cpp-build/bindings/qpid/ruby/rubyRUBY_wrap.cxx:22069:36:
warning: format not a string literal and no format arguments [-Wformat-security]
/home/hudson/jenkins-slave/workspace/Qpid-Java-Cpp-Test/cpp-build/bindings/qpid/ruby/rubyRUBY_wrap.cxx:22073:36:
warning: format not a string literal and no format arguments [-Wformat-security]
/home/hudson/jenkins-slave/workspace/Qpid-Java-Cpp-Test/cpp-build/bindings/qpid/ruby/rubyRUBY_wrap.cxx:22077:36:
warning: format not a string literal and no format arguments [-Wformat-security]
/home/hudson/jenkins-slave/workspace/Qpid-Java-Cpp-Test/cpp-build/bindings/qpid/ruby/rubyRUBY_wrap.cxx:22081:36:
warning: format not a string literal and no format arguments [-Wformat-security]
/home/hudson/jenkins-slave/workspace/Qpid-Java-Cpp-Test/cpp-build/bindings/qpid/ruby/rubyRUBY_wrap.cxx:22085:36:
warning: format not a string literal and no format arguments [-Wformat-security]
/home/hudson/jenkins-slave/workspace/Qpid-Java-Cpp-Test/cpp-build/bindings/qpid/ruby/rubyRUBY_wrap.cxx:22089:36:
warning: format not a string literal and no format arguments [-Wformat-security]
/home/hudson/jenkins-slave/workspace/Qpid-Java-Cpp-Test/cpp-build/bindings/qpid/ruby/rubyRUBY_wrap.cxx:22093:36:
warning: format not a string literal and no format arguments [-Wformat-security]
/home/hudson/jenkins-slave/workspace/Qpid-Java-Cpp-Test/cpp-build/bindings/qpid/ruby/rubyRUBY_wrap.cxx:22097:36:
warning: format not a string literal and no format arguments [-Wformat-security]
/home/hudson/jenkins-slave/workspace/Qpid-Java-Cpp-Test/cpp-build/bindings/qpid/ruby/rubyRUBY_wrap.cxx:22100:45:
warning: format not a string literal and no format arguments [-Wformat-security]
/home/hudson/jenkins-slave/workspace/Qpid-Java-Cpp-Test/cpp-build/bindings/qpid/ruby/rubyRUBY_wrap.cxx:
In function 'VALUE _wrap_Connection_getSession(int, VALUE*, VALUE)':
/home/hudson/jenkins-slave/workspace/Qpid-Java-Cpp-Test/cpp-build/bindings/qpid/ruby/rubyRUBY_wrap.cxx:22191:36:
warning: format not a string literal and no format arguments [-Wformat-security]
/home/hudson/jenkins-slave/workspace/Qpid-Java-Cpp-Test/cpp-build/bindings/qpid/ruby/rubyRUBY_wrap.cxx:22195:36:
warning: format not a string literal and no format arguments [-Wformat-security]
/home/hudson/jenkins-slave/workspace/Qpid-Java-Cpp-Test/cpp-build/bindings/qpid/ruby/rubyRUBY_wrap.cxx:22199:36:
warning: format not a string literal and no format arguments [-Wformat-security]
/home/hudson/jenkins-slave/workspace/Qpid-Java-Cpp-Test/cpp-build/bindings/qpid/ruby/rubyRUBY_wrap.cxx:22203:36:
warning: format not a string literal and no format arguments [-Wformat-security]
/home/hudson/jenkins-slave/workspace/Qpid-Java-Cpp-Test/cpp-build/bindings/qpid/ruby/rubyRUBY_wrap.cxx:22207:36:
warning: format not a string literal and no format arguments [-Wformat-security]
/home/hudson/jenkins-slave/workspace/Qpid-Java-Cpp-Test/cpp-build/bindings/qpid/ruby/rubyRUBY_wrap.cxx:22211:36:
warning: format not a string literal and no format arguments [-Wformat-security]
/home/hudson/jenkins-slave/workspace/Qpid-Java-Cpp-Test/cpp-build/bindings/qpid/ruby/rubyRUBY_wrap.cxx:22215:36:
warning: format not a string literal and no format arguments [-Wformat-security]
/home/hudson/jenkins-slave/workspace/Qpid-Java-Cpp-Test/cpp-build/bindings/qpid/ruby/rubyRUBY_wrap.cxx:22219:36:
warning: format not a string literal and no format arguments [-Wformat-security]
/home/hudson/jenkins-slave/workspace/Qpid-Java-Cpp-Test/cpp-build/bindings/qpid/ruby/rubyRUBY_wrap.cxx:22223:36:
warning: format not a string literal and no format arguments [-Wformat-security]
/home/hudson/jenkins-slave/workspace/Qpid-Java-Cpp-Test/cpp-build/bindings/qpid/ruby/rubyRUBY_wrap.cxx:22227:36:
warning: format not a string literal and no format arguments [-Wformat-security]
/home/hudson/jenkins-slave/workspace/Qpid-Java-Cpp-Test/cpp-build/bindings/qpid/ruby/rubyRUBY_wrap.cxx:22231:36:
warning: format not a string literal and no format arguments [-Wformat-security]
/home/hudson/jenkins-slave/workspace/Qpid-Java-Cpp-Test/cpp-build/bindings/qpid/ruby/rubyRUBY_wrap.cxx:22235:36:
warning: format not a string literal and no format arguments [-Wformat-security]
/home/hudson/jenkins-slave/workspace/Qpid-Java-Cpp-Test/cpp-build/bindings/qpid/ruby/rubyRUBY_wrap.cxx:22239:36:
warning: format not a string literal and no format arguments [-Wformat-security]
/home/hudson/jenkins-slave/workspace/Qpid-Java-Cpp-Test/cpp-build/bindings/qpid/ruby/rubyRUBY_wrap.cxx:22243:36:
warning: format not a string literal and no format arguments [-Wformat-security]
/home/hudson/jenkins-slave/workspace/Qpid-Java-Cpp-Test/cpp-build/bindings/qpid/ruby/rubyRUBY_wrap.cxx:22247:36:
warning: format not a string literal and no format arguments [-Wformat-security]
/home/hudson/jenkins-slave/workspace/Qpid-Java-Cpp-Test/cpp-build/bindings/qpid/ruby/rubyRUBY_wrap.cxx:22251:36:
warning: format not a string literal and no format arguments [-Wformat-security]
/home/hudson/jenkins-slave/workspace/Qpid-Java-Cpp-Test/cpp-build/bindings/qpid/ruby/rubyRUBY_wrap.cxx:22255:36:
warning: format not a string literal and no format arguments [-Wformat-security]
/home/hudson/jenkins-slave/workspace/Qpid-Java-Cpp-Test/cpp-build/bindings/qpid/ruby/rubyRUBY_wrap.cxx:22259:36:
warning: format not a string literal and no format arguments [-Wformat-security]
/home/hudson/jenkins-slave/workspace/Qpid-Java-Cpp-Test/cpp-build/bindings/qpid/ruby/rubyRUBY_wrap.cxx:22263:36:
warning: format not a string literal and no format arguments [-Wformat-security]
/home/hudson/jenkins-slave/workspace/Qpid-Java-Cpp-Test/cpp-build/bindings/qpid/ruby/rubyRUBY_wrap.cxx:22267:36:
warning: format not a string literal and no format arguments [-Wformat-security]
/home/hudson/jenkins-slave/workspace/Qpid-Java-Cpp-Test/cpp-build/bindings/qpid/ruby/rubyRUBY_wrap.cxx:22270:45:
warning: format not a string literal and no format arguments [-Wformat-security]
/home/hudson/jenkins-slave/workspace/Qpid-Java-Cpp-Test/cpp-build/bindings/qpid/ruby/rubyRUBY_wrap.cxx:
In function 'VALUE _wrap_Connection_getAuthenticatedUsername(int, VALUE*, VALUE)':
/home/hudson/jenkins-slave/workspace/Qpid-Java-Cpp-Test/cpp-build/bindings/qpid/ruby/rubyRUBY_wrap.cxx:22307:36:
warning: format not a string literal and no format arguments [-Wformat-security]
/home/hudson/jenkins-slave/workspace/Qpid-Java-Cpp-Test/cpp-build/bindings/qpid/ruby/rubyRUBY_wrap.cxx:22311:36:
warning: format not a string literal and no format arguments [-Wformat-security]
/home/hudson/jenkins-slave/workspace/Qpid-Java-Cpp-Test/cpp-build/bindings/qpid/ruby/rubyRUBY_wrap.cxx:22315:36:
warning: format not a string literal and no format arguments [-Wformat-security]
/home/hudson/jenkins-slave/workspace/Qpid-Java-Cpp-Test/cpp-build/bindings/qpid/ruby/rubyRUBY_wrap.cxx:22319:36:
warning: format not a string literal and no format arguments [-Wformat-security]
/home/hudson/jenkins-slave/workspace/Qpid-Java-Cpp-Test/cpp-build/bindings/qpid/ruby/rubyRUBY_wrap.cxx:22323:36:
warning: format not a string literal and no format arguments [-Wformat-security]
/home/hudson/jenkins-slave/workspace/Qpid-Java-Cpp-Test/cpp-build/bindings/qpid/ruby/rubyRUBY_wrap.cxx:22327:36:
warning: format not a string literal and no format arguments [-Wformat-security]
/home/hudson/jenkins-slave/workspace/Qpid-Java-Cpp-Test/cpp-build/bindings/qpid/ruby/rubyRUBY_wrap.cxx:22331:36:
warning: format not a string literal and no format arguments [-Wformat-security]
/home/hudson/jenkins-slave/workspace/Qpid-Java-Cpp-Test/cpp-build/bindings/qpid/ruby/rubyRUBY_wrap.cxx:22335:36:
warning: format not a string literal and no format arguments [-Wformat-security]
/home/hudson/jenkins-slave/workspace/Qpid-Java-Cpp-Test/cpp-build/bindings/qpid/ruby/rubyRUBY_wrap.cxx:22339:36:
warning: format not a string literal and no format arguments [-Wformat-security]
/home/hudson/jenkins-slave/workspace/Qpid-Java-Cpp-Test/cpp-build/bindings/qpid/ruby/rubyRUBY_wrap.cxx:22343:36:
warning: format not a string literal and no format arguments [-Wformat-security]
/home/hudson/jenkins-slave/workspace/Qpid-Java-Cpp-Test/cpp-build/bindings/qpid/ruby/rubyRUBY_wrap.cxx:22347:36:
warning: format not a string literal and no format arguments [-Wformat-security]
/home/hudson/jenkins-slave/workspace/Qpid-Java-Cpp-Test/cpp-build/bindings/qpid/ruby/rubyRUBY_wrap.cxx:22351:36:
warning: format not a string literal and no format arguments [-Wformat-security]
/home/hudson/jenkins-slave/workspace/Qpid-Java-Cpp-Test/cpp-build/bindings/qpid/ruby/rubyRUBY_wrap.cxx:22355:36:
warning: format not a string literal and no format arguments [-Wformat-security]
/home/hudson/jenkins-slave/workspace/Qpid-Java-Cpp-Test/cpp-build/bindings/qpid/ruby/rubyRUBY_wrap.cxx:22359:36:
warning: format not a string literal and no format arguments [-Wformat-security]
/home/hudson/jenkins-slave/workspace/Qpid-Java-Cpp-Test/cpp-build/bindings/qpid/ruby/rubyRUBY_wrap.cxx:22363:36:
warning: format not a string literal and no format arguments [-Wformat-security]
/home/hudson/jenkins-slave/workspace/Qpid-Java-Cpp-Test/cpp-build/bindings/qpid/ruby/rubyRUBY_wrap.cxx:22367:36:
warning: format not a string literal and no format arguments [-Wformat-security]
/home/hudson/jenkins-slave/workspace/Qpid-Java-Cpp-Test/cpp-build/bindings/qpid/ruby/rubyRUBY_wrap.cxx:22371:36:
warning: format not a string literal and no format arguments [-Wformat-security]
/home/hudson/jenkins-slave/workspace/Qpid-Java-Cpp-Test/cpp-build/bindings/qpid/ruby/rubyRUBY_wrap.cxx:22375:36:
warning: format not a string literal and no format arguments [-Wformat-security]
/home/hudson/jenkins-slave/workspace/Qpid-Java-Cpp-Test/cpp-build/bindings/qpid/ruby/rubyRUBY_wrap.cxx:22379:36:
warning: format not a string literal and no format arguments [-Wformat-security]
/home/hudson/jenkins-slave/workspace/Qpid-Java-Cpp-Test/cpp-build/bindings/qpid/ruby/rubyRUBY_wrap.cxx:22383:36:
warning: format not a string literal and no format arguments [-Wformat-security]
/home/hudson/jenkins-slave/workspace/Qpid-Java-Cpp-Test/cpp-build/bindings/qpid/ruby/rubyRUBY_wrap.cxx:22386:45:
warning: format not a string literal and no format arguments [-Wformat-security]
/home/hudson/jenkins-slave/workspace/Qpid-Java-Cpp-Test/cpp-build/bindings/qpid/ruby/rubyRUBY_wrap.cxx:
In function 'VALUE _wrap_new_FailoverUpdates(int, VALUE*, VALUE)':
/home/hudson/jenkins-slave/workspace/Qpid-Java-Cpp-Test/cpp-build/bindings/qpid/ruby/rubyRUBY_wrap.cxx:22443:36:
warning: format not a string literal and no format arguments [-Wformat-security]
/home/hudson/jenkins-slave/workspace/Qpid-Java-Cpp-Test/cpp-build/bindings/qpid/ruby/rubyRUBY_wrap.cxx:22447:36:
warning: format not a string literal and no format arguments [-Wformat-security]
/home/hudson/jenkins-slave/workspace/Qpid-Java-Cpp-Test/cpp-build/bindings/qpid/ruby/rubyRUBY_wrap.cxx:22451:36:
warning: format not a string literal and no format arguments [-Wformat-security]
/home/hudson/jenkins-slave/workspace/Qpid-Java-Cpp-Test/cpp-build/bindings/qpid/ruby/rubyRUBY_wrap.cxx:22455:36:
warning: format not a string literal and no format arguments [-Wformat-security]
/home/hudson/jenkins-slave/workspace/Qpid-Java-Cpp-Test/cpp-build/bindings/qpid/ruby/rubyRUBY_wrap.cxx:22459:36:
warning: format not a string literal and no format arguments [-Wformat-security]
/home/hudson/jenkins-slave/workspace/Qpid-Java-Cpp-Test/cpp-build/bindings/qpid/ruby/rubyRUBY_wrap.cxx:22463:36:
warning: format not a string literal and no format arguments [-Wformat-security]
/home/hudson/jenkins-slave/workspace/Qpid-Java-Cpp-Test/cpp-build/bindings/qpid/ruby/rubyRUBY_wrap.cxx:22467:36:
warning: format not a string literal and no format arguments [-Wformat-security]
/home/hudson/jenkins-slave/workspace/Qpid-Java-Cpp-Test/cpp-build/bindings/qpid/ruby/rubyRUBY_wrap.cxx:22471:36:
warning: format not a string literal and no format arguments [-Wformat-security]
/home/hudson/jenkins-slave/workspace/Qpid-Java-Cpp-Test/cpp-build/bindings/qpid/ruby/rubyRUBY_wrap.cxx:22475:36:
warning: format not a string literal and no format arguments [-Wformat-security]
/home/hudson/jenkins-slave/workspace/Qpid-Java-Cpp-Test/cpp-build/bindings/qpid/ruby/rubyRUBY_wrap.cxx:22479:36:
warning: format not a string literal and no format arguments [-Wformat-security]
/home/hudson/jenkins-slave/workspace/Qpid-Java-Cpp-Test/cpp-build/bindings/qpid/ruby/rubyRUBY_wrap.cxx:22483:36:
warning: format not a string literal and no format arguments [-Wformat-security]
/home/hudson/jenkins-slave/workspace/Qpid-Java-Cpp-Test/cpp-build/bindings/qpid/ruby/rubyRUBY_wrap.cxx:22487:36:
warning: format not a string literal and no format arguments [-Wformat-security]
/home/hudson/jenkins-slave/workspace/Qpid-Java-Cpp-Test/cpp-build/bindings/qpid/ruby/rubyRUBY_wrap.cxx:22491:36:
warning: format not a string literal and no format arguments [-Wformat-security]
/home/hudson/jenkins-slave/workspace/Qpid-Java-Cpp-Test/cpp-build/bindings/qpid/ruby/rubyRUBY_wrap.cxx:22495:36:
warning: format not a string literal and no format arguments [-Wformat-security]
/home/hudson/jenkins-slave/workspace/Qpid-Java-Cpp-Test/cpp-build/bindings/qpid/ruby/rubyRUBY_wrap.cxx:22499:36:
warning: format not a string literal and no format arguments [-Wformat-security]
/home/hudson/jenkins-slave/workspace/Qpid-Java-Cpp-Test/cpp-build/bindings/qpid/ruby/rubyRUBY_wrap.cxx:22503:36:
warning: format not a string literal and no format arguments [-Wformat-security]
/home/hudson/jenkins-slave/workspace/Qpid-Java-Cpp-Test/cpp-build/bindings/qpid/ruby/rubyRUBY_wrap.cxx:22507:36:
warning: format not a string literal and no format arguments [-Wformat-security]
/home/hudson/jenkins-slave/workspace/Qpid-Java-Cpp-Test/cpp-build/bindings/qpid/ruby/rubyRUBY_wrap.cxx:22511:36:
warning: format not a string literal and no format arguments [-Wformat-security]
/home/hudson/jenkins-slave/workspace/Qpid-Java-Cpp-Test/cpp-build/bindings/qpid/ruby/rubyRUBY_wrap.cxx:22515:36:
warning: format not a string literal and no format arguments [-Wformat-security]
/home/hudson/jenkins-slave/workspace/Qpid-Java-Cpp-Test/cpp-build/bindings/qpid/ruby/rubyRUBY_wrap.cxx:22519:36:
warning: format not a string literal and no format arguments [-Wformat-security]
/home/hudson/jenkins-slave/workspace/Qpid-Java-Cpp-Test/cpp-build/bindings/qpid/ruby/rubyRUBY_wrap.cxx:22522:45:
warning: format not a string literal and no format arguments [-Wformat-security]
/home/hudson/jenkins-slave/workspace/Qpid-Java-Cpp-Test/cpp-build/bindings/qpid/ruby/rubyRUBY_wrap.cxx:
In function 'VALUE _wrap_decodeMap(int, VALUE*, VALUE)':
/home/hudson/jenkins-slave/workspace/Qpid-Java-Cpp-Test/cpp-build/bindings/qpid/ruby/rubyRUBY_wrap.cxx:22564:36:
warning: format not a string literal and no format arguments [-Wformat-security]
/home/hudson/jenkins-slave/workspace/Qpid-Java-Cpp-Test/cpp-build/bindings/qpid/ruby/rubyRUBY_wrap.cxx:22568:36:
warning: format not a string literal and no format arguments [-Wformat-security]
/home/hudson/jenkins-slave/workspace/Qpid-Java-Cpp-Test/cpp-build/bindings/qpid/ruby/rubyRUBY_wrap.cxx:22572:36:
warning: format not a string literal and no format arguments [-Wformat-security]
/home/hudson/jenkins-slave/workspace/Qpid-Java-Cpp-Test/cpp-build/bindings/qpid/ruby/rubyRUBY_wrap.cxx:22576:36:
warning: format not a string literal and no format arguments [-Wformat-security]
/home/hudson/jenkins-slave/workspace/Qpid-Java-Cpp-Test/cpp-build/bindings/qpid/ruby/rubyRUBY_wrap.cxx:22580:36:
warning: format not a string literal and no format arguments [-Wformat-security]
/home/hudson/jenkins-slave/workspace/Qpid-Java-Cpp-Test/cpp-build/bindings/qpid/ruby/rubyRUBY_wrap.cxx:22584:36:
warning: format not a string literal and no format arguments [-Wformat-security]
/home/hudson/jenkins-slave/workspace/Qpid-Java-Cpp-Test/cpp-build/bindings/qpid/ruby/rubyRUBY_wrap.cxx:22588:36:
warning: format not a string literal and no format arguments [-Wformat-security]
/home/hudson/jenkins-slave/workspace/Qpid-Java-Cpp-Test/cpp-build/bindings/qpid/ruby/rubyRUBY_wrap.cxx:22592:36:
warning: format not a string literal and no format arguments [-Wformat-security]
/home/hudson/jenkins-slave/workspace/Qpid-Java-Cpp-Test/cpp-build/bindings/qpid/ruby/rubyRUBY_wrap.cxx:22596:36:
warning: format not a string literal and no format arguments [-Wformat-security]
/home/hudson/jenkins-slave/workspace/Qpid-Java-Cpp-Test/cpp-build/bindings/qpid/ruby/rubyRUBY_wrap.cxx:22600:36:
warning: format not a string literal and no format arguments [-Wformat-security]
/home/hudson/jenkins-slave/workspace/Qpid-Java-Cpp-Test/cpp-build/bindings/qpid/ruby/rubyRUBY_wrap.cxx:22604:36:
warning: format not a string literal and no format arguments [-Wformat-security]
/home/hudson/jenkins-slave/workspace/Qpid-Java-Cpp-Test/cpp-build/bindings/qpid/ruby/rubyRUBY_wrap.cxx:22608:36:
warning: format not a string literal and no format arguments [-Wformat-security]
/home/hudson/jenkins-slave/workspace/Qpid-Java-Cpp-Test/cpp-build/bindings/qpid/ruby/rubyRUBY_wrap.cxx:22612:36:
warning: format not a string literal and no format arguments [-Wformat-security]
/home/hudson/jenkins-slave/workspace/Qpid-Java-Cpp-Test/cpp-build/bindings/qpid/ruby/rubyRUBY_wrap.cxx:22616:36:
warning: format not a string literal and no format arguments [-Wformat-security]
/home/hudson/jenkins-slave/workspace/Qpid-Java-Cpp-Test/cpp-build/bindings/qpid/ruby/rubyRUBY_wrap.cxx:22620:36:
warning: format not a string literal and no format arguments [-Wformat-security]
/home/hudson/jenkins-slave/workspace/Qpid-Java-Cpp-Test/cpp-build/bindings/qpid/ruby/rubyRUBY_wrap.cxx:22624:36:
warning: format not a string literal and no format arguments [-Wformat-security]
/home/hudson/jenkins-slave/workspace/Qpid-Java-Cpp-Test/cpp-build/bindings/qpid/ruby/rubyRUBY_wrap.cxx:22628:36:
warning: format not a string literal and no format arguments [-Wformat-security]
/home/hudson/jenkins-slave/workspace/Qpid-Java-Cpp-Test/cpp-build/bindings/qpid/ruby/rubyRUBY_wrap.cxx:22632:36:
warning: format not a string literal and no format arguments [-Wformat-security]
/home/hudson/jenkins-slave/workspace/Qpid-Java-Cpp-Test/cpp-build/bindings/qpid/ruby/rubyRUBY_wrap.cxx:22636:36:
warning: format not a string literal and no format arguments [-Wformat-security]
/home/hudson/jenkins-slave/workspace/Qpid-Java-Cpp-Test/cpp-build/bindings/qpid/ruby/rubyRUBY_wrap.cxx:22640:36:
warning: format not a string literal and no format arguments [-Wformat-security]
/home/hudson/jenkins-slave/workspace/Qpid-Java-Cpp-Test/cpp-build/bindings/qpid/ruby/rubyRUBY_wrap.cxx:22643:45:
warning: format not a string literal and no format arguments [-Wformat-security]
/home/hudson/jenkins-slave/workspace/Qpid-Java-Cpp-Test/cpp-build/bindings/qpid/ruby/rubyRUBY_wrap.cxx:
In function 'VALUE _wrap_decodeList(int, VALUE*, VALUE)':
/home/hudson/jenkins-slave/workspace/Qpid-Java-Cpp-Test/cpp-build/bindings/qpid/ruby/rubyRUBY_wrap.cxx:22683:36:
warning: format not a string literal and no format arguments [-Wformat-security]
/home/hudson/jenkins-slave/workspace/Qpid-Java-Cpp-Test/cpp-build/bindings/qpid/ruby/rubyRUBY_wrap.cxx:22687:36:
warning: format not a string literal and no format arguments [-Wformat-security]
/home/hudson/jenkins-slave/workspace/Qpid-Java-Cpp-Test/cpp-build/bindings/qpid/ruby/rubyRUBY_wrap.cxx:22691:36:
warning: format not a string literal and no format arguments [-Wformat-security]
/home/hudson/jenkins-slave/workspace/Qpid-Java-Cpp-Test/cpp-build/bindings/qpid/ruby/rubyRUBY_wrap.cxx:22695:36:
warning: format not a string literal and no format arguments [-Wformat-security]
/home/hudson/jenkins-slave/workspace/Qpid-Java-Cpp-Test/cpp-build/bindings/qpid/ruby/rubyRUBY_wrap.cxx:22699:36:
warning: format not a string literal and no format arguments [-Wformat-security]
/home/hudson/jenkins-slave/workspace/Qpid-Java-Cpp-Test/cpp-build/bindings/qpid/ruby/rubyRUBY_wrap.cxx:22703:36:
warning: format not a string literal and no format arguments [-Wformat-security]
/home/hudson/jenkins-slave/workspace/Qpid-Java-Cpp-Test/cpp-build/bindings/qpid/ruby/rubyRUBY_wrap.cxx:22707:36:
warning: format not a string literal and no format arguments [-Wformat-security]
/home/hudson/jenkins-slave/workspace/Qpid-Java-Cpp-Test/cpp-build/bindings/qpid/ruby/rubyRUBY_wrap.cxx:22711:36:
warning: format not a string literal and no format arguments [-Wformat-security]
/home/hudson/jenkins-slave/workspace/Qpid-Java-Cpp-Test/cpp-build/bindings/qpid/ruby/rubyRUBY_wrap.cxx:22715:36:
warning: format not a string literal and no format arguments [-Wformat-security]
/home/hudson/jenkins-slave/workspace/Qpid-Java-Cpp-Test/cpp-build/bindings/qpid/ruby/rubyRUBY_wrap.cxx:22719:36:
warning: format not a string literal and no format arguments [-Wformat-security]
/home/hudson/jenkins-slave/workspace/Qpid-Java-Cpp-Test/cpp-build/bindings/qpid/ruby/rubyRUBY_wrap.cxx:22723:36:
warning: format not a string literal and no format arguments [-Wformat-security]
/home/hudson/jenkins-slave/workspace/Qpid-Java-Cpp-Test/cpp-build/bindings/qpid/ruby/rubyRUBY_wrap.cxx:22727:36:
warning: format not a string literal and no format arguments [-Wformat-security]
/home/hudson/jenkins-slave/workspace/Qpid-Java-Cpp-Test/cpp-build/bindings/qpid/ruby/rubyRUBY_wrap.cxx:22731:36:
warning: format not a string literal and no format arguments [-Wformat-security]
/home/hudson/jenkins-slave/workspace/Qpid-Java-Cpp-Test/cpp-build/bindings/qpid/ruby/rubyRUBY_wrap.cxx:22735:36:
warning: format not a string literal and no format arguments [-Wformat-security]
/home/hudson/jenkins-slave/workspace/Qpid-Java-Cpp-Test/cpp-build/bindings/qpid/ruby/rubyRUBY_wrap.cxx:22739:36:
warning: format not a string literal and no format arguments [-Wformat-security]
/home/hudson/jenkins-slave/workspace/Qpid-Java-Cpp-Test/cpp-build/bindings/qpid/ruby/rubyRUBY_wrap.cxx:22743:36:
warning: format not a string literal and no format arguments [-Wformat-security]
/home/hudson/jenkins-slave/workspace/Qpid-Java-Cpp-Test/cpp-build/bindings/qpid/ruby/rubyRUBY_wrap.cxx:22747:36:
warning: format not a string literal and no format arguments [-Wformat-security]
/home/hudson/jenkins-slave/workspace/Qpid-Java-Cpp-Test/cpp-build/bindings/qpid/ruby/rubyRUBY_wrap.cxx:22751:36:
warning: format not a string literal and no format arguments [-Wformat-security]
/home/hudson/jenkins-slave/workspace/Qpid-Java-Cpp-Test/cpp-build/bindings/qpid/ruby/rubyRUBY_wrap.cxx:22755:36:
warning: format not a string literal and no format arguments [-Wformat-security]
/home/hudson/jenkins-slave/workspace/Qpid-Java-Cpp-Test/cpp-build/bindings/qpid/ruby/rubyRUBY_wrap.cxx:22759:36:
warning: format not a string literal and no format arguments [-Wformat-security]
/home/hudson/jenkins-slave/workspace/Qpid-Java-Cpp-Test/cpp-build/bindings/qpid/ruby/rubyRUBY_wrap.cxx:22762:45:
warning: format not a string literal and no format arguments [-Wformat-security]
[ 75%] Building CXX object src/CMakeFiles/qpidbroker.dir/qpid/broker/MessageMap.cpp.o
Linking CXX shared module _cqmf2.so
[ 75%] Built target _cqmf2
Scanning dependencies of target qmf2_agent
[ 75%] Building CXX object bindings/qmf2/examples/cpp/CMakeFiles/qmf2_agent.dir/agent.o
Linking CXX executable agent
Linking CXX shared module libcqmf2_ruby.so
[ 75%] Built target qmf2_agent
/usr/bin/ld: /usr/local/lib/libruby-static.a(array.o): relocation R_X86_64_32 against `.rodata.str1.1'
can not be used when making a shared object; recompile with -fPIC
/usr/local/lib/libruby-static.a: could not read symbols: Bad value
collect2: ld returned 1 exit status
make[2]: *** [bindings/qmf2/ruby/libcqmf2_ruby.so] Error 1
make[1]: *** [bindings/qmf2/ruby/CMakeFiles/cqmf2_ruby.dir/all] Error 2
make[1]: *** Waiting for unfinished jobs....
Scanning dependencies of target qmf2_event_driven_list_agents
[ 75%] [ 75%] Building CXX object src/CMakeFiles/qpidbroker.dir/qpid/broker/ObjectFactory.cpp.o
Building CXX object bindings/qmf2/examples/cpp/CMakeFiles/qmf2_event_driven_list_agents.dir/event_driven_list_agents.o
[ 75%] Building CXX object src/CMakeFiles/qpidbroker.dir/qpid/broker/PriorityQueue.cpp.o
Linking CXX executable event_driven_list_agents
[ 75%] Built target qmf2_event_driven_list_agents
[ 75%] Building CXX object src/CMakeFiles/qpidbroker.dir/qpid/broker/Protocol.cpp.o
[ 76%] Building CXX object src/CMakeFiles/qpidbroker.dir/qpid/broker/Queue.cpp.o
[ 76%] Building CXX object src/CMakeFiles/qpidbroker.dir/qpid/broker/QueueCleaner.cpp.o
[ 76%] Building CXX object src/CMakeFiles/qpidbroker.dir/qpid/broker/QueueListeners.cpp.o
[ 76%] Building CXX object src/CMakeFiles/qpidbroker.dir/qpid/broker/FifoDistributor.cpp.o
[ 76%] Building CXX object src/CMakeFiles/qpidbroker.dir/qpid/broker/MessageGroupManager.cpp.o
Linking CXX shared module libcqpid_ruby.so
/usr/bin/ld: /usr/local/lib/libruby-static.a(array.o): relocation R_X86_64_32 against `.rodata.str1.1'
can not be used when making a shared object; recompile with -fPIC
/usr/local/lib/libruby-static.a: could not read symbols: Bad value
collect2: ld returned 1 exit status
make[2]: *** [bindings/qpid/ruby/libcqpid_ruby.so] Error 1
make[1]: *** [bindings/qpid/ruby/CMakeFiles/cqpid_ruby.dir/all] Error 2
[ 76%] Building CXX object src/CMakeFiles/qpidbroker.dir/qpid/broker/PersistableMessage.cpp.o
[ 77%] Building CXX object src/CMakeFiles/qpidbroker.dir/qpid/broker/PersistableObject.cpp.o
[ 77%] Building CXX object src/CMakeFiles/qpidbroker.dir/qpid/broker/Bridge.cpp.o
[ 77%] Building CXX object src/CMakeFiles/qpidbroker.dir/qpid/broker/amqp_0_10/Connection.cpp.o
[ 77%] Building CXX object src/CMakeFiles/qpidbroker.dir/qpid/broker/ConnectionHandler.cpp.o
[ 77%] Building CXX object src/CMakeFiles/qpidbroker.dir/qpid/broker/DeliverableMessage.cpp.o
[ 77%] Building CXX object src/CMakeFiles/qpidbroker.dir/qpid/broker/DeliveryRecord.cpp.o
[ 78%] Building CXX object src/CMakeFiles/qpidbroker.dir/qpid/broker/DirectExchange.cpp.o
[ 78%] Building CXX object src/CMakeFiles/qpidbroker.dir/qpid/broker/DtxAck.cpp.o
[ 78%] Building CXX object src/CMakeFiles/qpidbroker.dir/qpid/broker/DtxBuffer.cpp.o
[ 78%] Building CXX object src/CMakeFiles/qpidbroker.dir/qpid/broker/DtxManager.cpp.o
[ 78%] Building CXX object src/CMakeFiles/qpidbroker.dir/qpid/broker/DtxTimeout.cpp.o
[ 78%] Building CXX object src/CMakeFiles/qpidbroker.dir/qpid/broker/DtxWorkRecord.cpp.o
[ 79%] Building CXX object src/CMakeFiles/qpidbroker.dir/qpid/broker/ExchangeRegistry.cpp.o
[ 79%] Building CXX object src/CMakeFiles/qpidbroker.dir/qpid/broker/FanOutExchange.cpp.o
[ 79%] Building CXX object src/CMakeFiles/qpidbroker.dir/qpid/broker/HeadersExchange.cpp.o
[ 79%] Building CXX object src/CMakeFiles/qpidbroker.dir/qpid/broker/IngressCompletion.cpp.o
[ 79%] Building CXX object src/CMakeFiles/qpidbroker.dir/qpid/broker/Link.cpp.o
[ 80%] Building CXX object src/CMakeFiles/qpidbroker.dir/qpid/broker/LinkRegistry.cpp.o
[ 80%] Building CXX object src/CMakeFiles/qpidbroker.dir/qpid/broker/LossyQueue.cpp.o
[ 80%] Building CXX object src/CMakeFiles/qpidbroker.dir/qpid/broker/Lvq.cpp.o
[ 80%] Building CXX object src/CMakeFiles/qpidbroker.dir/qpid/broker/Message.cpp.o
[ 80%] Building CXX object src/CMakeFiles/qpidbroker.dir/qpid/broker/MessageAdapter.cpp.o
[ 80%] Building CXX object src/CMakeFiles/qpidbroker.dir/qpid/broker/MessageBuilder.cpp.o
[ 81%] Building CXX object src/CMakeFiles/qpidbroker.dir/qpid/broker/MessageStoreModule.cpp.o
[ 81%] Building CXX object src/CMakeFiles/qpidbroker.dir/qpid/broker/NameGenerator.cpp.o
[ 81%] Building CXX object src/CMakeFiles/qpidbroker.dir/qpid/broker/NullMessageStore.cpp.o
[ 81%] Building CXX object src/CMakeFiles/qpidbroker.dir/qpid/broker/PagedQueue.cpp.o
[ 81%] Building CXX object src/CMakeFiles/qpidbroker.dir/qpid/broker/QueueBindings.cpp.o
[ 81%] Building CXX object src/CMakeFiles/qpidbroker.dir/qpid/broker/QueuedMessage.cpp.o
[ 82%] Building CXX object src/CMakeFiles/qpidbroker.dir/qpid/broker/QueueCursor.cpp.o
[ 82%] Building CXX object src/CMakeFiles/qpidbroker.dir/qpid/broker/QueueDepth.cpp.o
[ 82%] Building CXX object src/CMakeFiles/qpidbroker.dir/qpid/broker/QueueFactory.cpp.o
[ 82%] Building CXX object src/CMakeFiles/qpidbroker.dir/qpid/broker/QueueRegistry.cpp.o
[ 82%] Building CXX object src/CMakeFiles/qpidbroker.dir/qpid/broker/QueueSettings.cpp.o
[ 82%] Building CXX object src/CMakeFiles/qpidbroker.dir/qpid/broker/QueueFlowLimit.cpp.o
[ 83%] Building CXX object src/CMakeFiles/qpidbroker.dir/qpid/broker/RecoveryManagerImpl.cpp.o
[ 83%] Building CXX object src/CMakeFiles/qpidbroker.dir/qpid/broker/RecoveredEnqueue.cpp.o
[ 83%] Building CXX object src/CMakeFiles/qpidbroker.dir/qpid/broker/RecoveredDequeue.cpp.o
[ 83%] Building CXX object src/CMakeFiles/qpidbroker.dir/qpid/broker/RetryList.cpp.o
[ 83%] Building CXX object src/CMakeFiles/qpidbroker.dir/qpid/broker/SecureConnection.cpp.o
[ 83%] Building CXX object src/CMakeFiles/qpidbroker.dir/qpid/broker/SecureConnectionFactory.cpp.o
[ 84%] Building CXX object src/CMakeFiles/qpidbroker.dir/qpid/broker/Selector.cpp.o
[ 84%] Building CXX object src/CMakeFiles/qpidbroker.dir/qpid/broker/SelectorExpression.cpp.o
[ 84%] Building CXX object src/CMakeFiles/qpidbroker.dir/qpid/broker/SelectorToken.cpp.o
[ 84%] Building CXX object src/CMakeFiles/qpidbroker.dir/qpid/broker/SelectorValue.cpp.o
[ 84%] Building CXX object src/CMakeFiles/qpidbroker.dir/qpid/broker/SelfDestructQueue.cpp.o
[ 85%] Building CXX object src/CMakeFiles/qpidbroker.dir/qpid/broker/SemanticState.cpp.o
[ 85%] Building CXX object src/CMakeFiles/qpidbroker.dir/qpid/broker/SessionAdapter.cpp.o
[ 85%] Building CXX object src/CMakeFiles/qpidbroker.dir/qpid/broker/SessionState.cpp.o
[ 85%] Building CXX object src/CMakeFiles/qpidbroker.dir/qpid/broker/SessionManager.cpp.o
[ 85%] Building CXX object src/CMakeFiles/qpidbroker.dir/qpid/broker/SessionHandler.cpp.o
[ 85%] Building CXX object src/CMakeFiles/qpidbroker.dir/qpid/broker/System.cpp.o
[ 86%] Building CXX object src/CMakeFiles/qpidbroker.dir/qpid/broker/ThresholdAlerts.cpp.o
[ 86%] Building CXX object src/CMakeFiles/qpidbroker.dir/qpid/broker/TopicExchange.cpp.o
[ 86%] Building CXX object src/CMakeFiles/qpidbroker.dir/qpid/broker/TxAccept.cpp.o
[ 86%] Building CXX object src/CMakeFiles/qpidbroker.dir/qpid/broker/TxBuffer.cpp.o
[ 86%] Building CXX object src/CMakeFiles/qpidbroker.dir/qpid/broker/Vhost.cpp.o
[ 86%] Building CXX object src/CMakeFiles/qpidbroker.dir/qpid/broker/amqp_0_10/MessageTransfer.cpp.o
[ 87%] Building CXX object src/CMakeFiles/qpidbroker.dir/qpid/management/ManagementAgent.cpp.o
[ 87%] Building CXX object src/CMakeFiles/qpidbroker.dir/qpid/management/ManagementDirectExchange.cpp.o
[ 87%] Building CXX object src/CMakeFiles/qpidbroker.dir/qpid/management/ManagementTopicExchange.cpp.o
[ 87%] Building CXX object src/CMakeFiles/qpidbroker.dir/qpid/sys/SocketTransport.cpp.o
[ 87%] Building CXX object src/CMakeFiles/qpidbroker.dir/qpid/sys/TCPIOPlugin.cpp.o
Linking CXX shared library libqpidbroker.so
[ 87%] Built target qpidbroker
make: *** [all] Error 2
Build step 'Execute shell' marked build as failure
[locks-and-latches] Releasing all the locks
[locks-and-latches] All the locks released
Recording test results

Mime
View raw message