qpid-notifications mailing list archives

Site index · List index
Message view « Date » · « Thread »
Top « Date » · « Thread »
From Apache Jenkins Server <jenk...@builds.apache.org>
Subject Build failed in Jenkins: Qpid-Java-Java-Test-JDK1.7 #641
Date Wed, 18 Dec 2013 06:43:17 GMT
See <https://builds.apache.org/job/Qpid-Java-Java-Test-JDK1.7/641/changes>

Changes:

[aconway] QPID-5255: Add missing licenses in qpid/cpp tree.

Added licenses to:

qpid/cpp/src/qmf2.pc.in
qpid/cpp/src/qpid.linkmap
qpid/cpp/src/qpid.pc.in

[kpvdr] NO_JIRA: Roll back change to CMakeLists.txt in which a test example was added which
is not part of the build.

------------------------------------------
[...truncated 4917 lines...]
    [junit] Running org.apache.qpid.test.unit.client.MaxDeliveryCountTest
    [junit] Tests run: 7, Failures: 0, Errors: 0, Time elapsed: 3.477 sec
    [junit] Running org.apache.qpid.test.unit.client.QueueSessionFactoryTest
    [junit] Tests run: 5, Failures: 0, Errors: 0, Time elapsed: 0.128 sec
    [junit] Running org.apache.qpid.test.unit.client.TopicSessionFactoryTest
    [junit] Tests run: 4, Failures: 0, Errors: 0, Time elapsed: 0.102 sec
    [junit] Running org.apache.qpid.test.unit.client.channelclose.CloseWithBlockingReceiveTest
    [junit] Tests run: 1, Failures: 0, Errors: 0, Time elapsed: 1.028 sec
    [junit] Running org.apache.qpid.test.unit.client.connection.BrokerClosesClientConnectionTest
    [junit] Tests run: 3, Failures: 0, Errors: 0, Time elapsed: 12.101 sec
    [junit] Running org.apache.qpid.test.unit.client.connection.ConnectionFactoryTest
    [junit] Tests run: 2, Failures: 0, Errors: 0, Time elapsed: 0.052 sec
    [junit] Running org.apache.qpid.test.unit.client.connection.ConnectionStartTest
    [junit] Tests run: 2, Failures: 0, Errors: 0, Time elapsed: 0.06 sec
    [junit] Running org.apache.qpid.test.unit.client.connection.ConnectionTest
    [junit] Tests run: 12, Failures: 0, Errors: 0, Time elapsed: 0.36 sec
    [junit] Running org.apache.qpid.test.unit.client.connection.ExceptionListenerTest
    [junit] Tests run: 3, Failures: 0, Errors: 0, Time elapsed: 0.07 sec
    [junit] Running org.apache.qpid.test.unit.client.message.ObjectMessageTest
    [junit] Tests run: 10, Failures: 0, Errors: 0, Time elapsed: 0.302 sec
    [junit] Running org.apache.qpid.test.unit.client.protocol.AMQProtocolSessionTest
    [junit] Tests run: 5, Failures: 0, Errors: 0, Time elapsed: 0.131 sec
    [junit] Running org.apache.qpid.test.unit.client.temporaryqueue.TemporaryQueueTest
    [junit] Tests run: 4, Failures: 0, Errors: 0, Time elapsed: 0.116 sec
    [junit] Running org.apache.qpid.test.unit.close.JavaServerCloseRaceConditionTest
    [junit] Tests run: 0, Failures: 0, Errors: 0, Time elapsed: 0.001 sec
    [junit] Running org.apache.qpid.test.unit.close.MessageConsumerCloseTest
    [junit] Tests run: 1, Failures: 0, Errors: 0, Time elapsed: 0.034 sec
    [junit] Running org.apache.qpid.test.unit.close.MessageRequeueTest
    [junit] Tests run: 3, Failures: 0, Errors: 0, Time elapsed: 16.405 sec
    [junit] Running org.apache.qpid.test.unit.close.TopicPublisherCloseTest
    [junit] Tests run: 1, Failures: 0, Errors: 0, Time elapsed: 3.026 sec
    [junit] Running org.apache.qpid.test.unit.ct.DurableSubscriberTest
    [junit] Tests run: 0, Failures: 0, Errors: 0, Time elapsed: 0.001 sec
    [junit] Running org.apache.qpid.test.unit.message.JMSPropertiesTest
    [junit] Tests run: 2, Failures: 0, Errors: 0, Time elapsed: 0.061 sec
    [junit] Running org.apache.qpid.test.unit.message.StreamMessageTest
    [junit] Tests run: 2, Failures: 0, Errors: 0, Time elapsed: 0.065 sec
    [junit] Running org.apache.qpid.test.unit.message.UTF8Test
    [junit] Tests run: 2, Failures: 0, Errors: 0, Time elapsed: 0.059 sec
    [junit] Running org.apache.qpid.test.unit.topic.DurableSubscriptionTest
    [junit] Tests run: 17, Failures: 0, Errors: 0, Time elapsed: 30.074 sec
    [junit] Running org.apache.qpid.test.unit.topic.TemporaryTopicTest
    [junit] Tests run: 5, Failures: 0, Errors: 0, Time elapsed: 0.149 sec
    [junit] Running org.apache.qpid.test.unit.topic.TopicPublisherTest
    [junit] Tests run: 1, Failures: 0, Errors: 0, Time elapsed: 0.028 sec
    [junit] Running org.apache.qpid.test.unit.topic.TopicSessionTest
    [junit] Tests run: 9, Failures: 0, Errors: 0, Time elapsed: 9.614 sec
    [junit] Running org.apache.qpid.test.unit.transacted.CommitRollbackTest
    [junit] Tests run: 12, Failures: 0, Errors: 0, Time elapsed: 15.446 sec
    [junit] Running org.apache.qpid.test.unit.transacted.TransactedTest
    [junit] Tests run: 7, Failures: 0, Errors: 0, Time elapsed: 7.814 sec
    [junit] Running org.apache.qpid.test.unit.transacted.TransactionTimeoutDisabledTest
    [junit] Tests run: 2, Failures: 0, Errors: 0, Time elapsed: 4.15 sec
    [junit] Running org.apache.qpid.test.unit.transacted.TransactionTimeoutTest
    [junit] Tests run: 15, Failures: 0, Errors: 1, Time elapsed: 42.583 sec
    [junit] TEST org.apache.qpid.test.unit.transacted.TransactionTimeoutTest FAILED
    [junit] Running org.apache.qpid.test.unit.xa.FaultTest
    [junit] Tests run: 10, Failures: 0, Errors: 0, Time elapsed: 11.973 sec
    [junit] Running org.apache.qpid.test.unit.xa.QueueTest
    [junit] Tests run: 1, Failures: 0, Errors: 0, Time elapsed: 1.043 sec
    [junit] Running org.apache.qpid.test.unit.xa.TopicTest
    [junit] Tests run: 4, Failures: 0, Errors: 0, Time elapsed: 4.171 sec
    [junit] Running org.apache.qpid.test.utils.BrokerCommandHelperTest
    [junit] Tests run: 2, Failures: 0, Errors: 0, Time elapsed: 0.002 sec
    [junit] Running org.apache.qpid.util.LogMonitorTest
    [junit] Tests run: 9, Failures: 0, Errors: 0, Time elapsed: 2.008 sec
    [junit] Tests FAILED
     [echo] Running ant for module : systests

touch-failed:
    [touch] Creating <https://builds.apache.org/job/Qpid-Java-Java-Test-JDK1.7/ws/trunk/qpid/java/build/results/systests/FAILED>
    [touch] Creating <https://builds.apache.org/job/Qpid-Java-Java-Test-JDK1.7/ws/trunk/qpid/java/build/results/FAILED>
     [echo] Running ant for module : perftests

prepare:

precompile:

compile:
     [echo] Targeting : 1.6

copy-extra-resources:

copy-resources:
     [echo] Copying resources from <https://builds.apache.org/job/Qpid-Java-Java-Test-JDK1.7/ws/trunk/qpid/java/perftests/src/main/resources>
to <https://builds.apache.org/job/Qpid-Java-Java-Test-JDK1.7/ws/trunk/qpid/java/build/scratch/perftests/classes...>

copy-project-resources-metainf:

copy-module-resources-metainf:

copy-module-src-resources-metainf:

copy-files-to-module-metainf:

jar.manifest:

jar.nomanifest:

jar:

precompile-tests:

compile-tests:

copy-test-resources:

jar-tests:

jar-sources:

libs:

copy-bin:

copy-etc:

postbuild:

copy-broker-plugin-jars-deps:

copy-broker-plugin-jars:

build:

test:
     [echo] Using profile:java-mms.0-10
    [junit] Running org.apache.qpid.disttest.ArgumentParserTest
    [junit] Tests run: 3, Failures: 0, Errors: 0, Time elapsed: 0.025 sec
    [junit] Running org.apache.qpid.disttest.ConfigFileHelperTest
    [junit] Tests run: 1, Failures: 0, Errors: 0, Time elapsed: 0.015 sec
    [junit] Running org.apache.qpid.disttest.ResultsFileWriterTest
    [junit] Tests run: 2, Failures: 0, Errors: 0, Time elapsed: 0.035 sec
    [junit] Running org.apache.qpid.disttest.VisitorTest
    [junit] Tests run: 3, Failures: 0, Errors: 0, Time elapsed: 0.011 sec
    [junit] Running org.apache.qpid.disttest.client.ClientCommandVisitorTest
    [junit] Tests run: 8, Failures: 0, Errors: 0, Time elapsed: 0.07 sec
    [junit] Running org.apache.qpid.disttest.client.ClientTest
    [junit] Tests run: 8, Failures: 0, Errors: 0, Time elapsed: 0.565 sec
    [junit] Running org.apache.qpid.disttest.client.ConsumerParticipantTest
    [junit] Tests run: 7, Failures: 0, Errors: 0, Time elapsed: 0.168 sec
    [junit] Running org.apache.qpid.disttest.client.MessageProviderTest
    [junit] Tests run: 3, Failures: 0, Errors: 0, Time elapsed: 0.105 sec
    [junit] Running org.apache.qpid.disttest.client.ParticipantExecutorTest
    [junit] Tests run: 4, Failures: 0, Errors: 0, Time elapsed: 0.034 sec
    [junit] Running org.apache.qpid.disttest.client.ParticipantRegistryTest
    [junit] Tests run: 2, Failures: 0, Errors: 0, Time elapsed: 0.007 sec
    [junit] Running org.apache.qpid.disttest.client.ParticipantResultFactoryTest
    [junit] Tests run: 3, Failures: 0, Errors: 0, Time elapsed: 0.006 sec
    [junit] Running org.apache.qpid.disttest.client.ProducerParticipantTest
    [junit] Tests run: 9, Failures: 0, Errors: 0, Time elapsed: 1.558 sec
    [junit] Running org.apache.qpid.disttest.client.property.ListPropertyValueTest
    [junit] Tests run: 3, Failures: 0, Errors: 0, Time elapsed: 0.006 sec
    [junit] Running org.apache.qpid.disttest.client.property.PropertyValueFactoryTest
    [junit] Tests run: 5, Failures: 0, Errors: 0, Time elapsed: 0.008 sec
    [junit] Running org.apache.qpid.disttest.client.property.RandomPropertyValueTest
    [junit] Tests run: 5, Failures: 0, Errors: 0, Time elapsed: 0.005 sec
    [junit] Running org.apache.qpid.disttest.client.property.RangePropertyValueTest
    [junit] Tests run: 8, Failures: 0, Errors: 0, Time elapsed: 0.006 sec
    [junit] Running org.apache.qpid.disttest.client.property.SimplePropertyValueTest
    [junit] Tests run: 1, Failures: 0, Errors: 0, Time elapsed: 0.002 sec
    [junit] Running org.apache.qpid.disttest.client.utils.ExecutorWithNoLimitsTest
    [junit] Tests run: 2, Failures: 0, Errors: 0, Time elapsed: 0.002 sec
    [junit] Running org.apache.qpid.disttest.client.utils.ExecutorWithTimeLimitTest
    [junit] Tests run: 4, Failures: 0, Errors: 0, Time elapsed: 0.504 sec
    [junit] Running org.apache.qpid.disttest.controller.ClientRegistryTest
    [junit] Tests run: 8, Failures: 0, Errors: 0, Time elapsed: 2.563 sec
    [junit] Running org.apache.qpid.disttest.controller.ControllerTest
    [junit] Tests run: 6, Failures: 0, Errors: 0, Time elapsed: 0.044 sec
    [junit] Running org.apache.qpid.disttest.controller.ParticipatingClientsTest
    [junit] Tests run: 5, Failures: 0, Errors: 0, Time elapsed: 0.003 sec
    [junit] Running org.apache.qpid.disttest.controller.TestRunnerTest
    [junit] Tests run: 6, Failures: 0, Errors: 0, Time elapsed: 1.141 sec
    [junit] Running org.apache.qpid.disttest.controller.config.ClientConfigTest
    [junit] Tests run: 4, Failures: 0, Errors: 0, Time elapsed: 0.008 sec
    [junit] Running org.apache.qpid.disttest.controller.config.ConfigReaderTest
    [junit] Tests run: 5, Failures: 0, Errors: 0, Time elapsed: 0.26 sec
    [junit] Running org.apache.qpid.disttest.controller.config.ConfigTest
    [junit] Tests run: 1, Failures: 0, Errors: 0, Time elapsed: 0.007 sec
    [junit] Running org.apache.qpid.disttest.controller.config.ConnectionConfigTest
    [junit] Tests run: 3, Failures: 0, Errors: 0, Time elapsed: 0.012 sec
    [junit] Running org.apache.qpid.disttest.controller.config.ConsumerConfigTest
    [junit] Tests run: 2, Failures: 0, Errors: 0, Time elapsed: 0.005 sec
    [junit] Running org.apache.qpid.disttest.controller.config.IterationValueTest
    [junit] Tests run: 3, Failures: 0, Errors: 0, Time elapsed: 0.034 sec
    [junit] Running org.apache.qpid.disttest.controller.config.JavaScriptConfigEvaluatorTest
    [junit] Tests run: 1, Failures: 0, Errors: 0, Time elapsed: 0.045 sec
    [junit] Running org.apache.qpid.disttest.controller.config.MessageProviderConfigTest
    [junit] Tests run: 2, Failures: 0, Errors: 0, Time elapsed: 0.001 sec
    [junit] Running org.apache.qpid.disttest.controller.config.ParticipantConfigTest
    [junit] Tests run: 1, Failures: 0, Errors: 0, Time elapsed: 0.009 sec
    [junit] Running org.apache.qpid.disttest.controller.config.ProducerConfigTest
    [junit] Tests run: 3, Failures: 0, Errors: 0, Time elapsed: 0.002 sec
    [junit] Running org.apache.qpid.disttest.controller.config.SessionConfigTest
    [junit] Tests run: 3, Failures: 0, Errors: 0, Time elapsed: 0.021 sec
    [junit] Running org.apache.qpid.disttest.controller.config.TestConfigTest
    [junit] Tests run: 5, Failures: 0, Errors: 0, Time elapsed: 0.008 sec
    [junit] Running org.apache.qpid.disttest.controller.config.TestInstanceTest
    [junit] Tests run: 3, Failures: 0, Errors: 0, Time elapsed: 0.013 sec
    [junit] Running org.apache.qpid.disttest.db.ResultsDbWriterTest
    [junit] Tests run: 2, Failures: 0, Errors: 0, Time elapsed: 11.334 sec
    [junit] Running org.apache.qpid.disttest.jms.JmsMessageAdaptorTest
    [junit] Tests run: 1, Failures: 0, Errors: 0, Time elapsed: 0.003 sec
    [junit] Running org.apache.qpid.disttest.message.JsonHandlerTest
    [junit] Tests run: 2, Failures: 0, Errors: 0, Time elapsed: 0.021 sec
    [junit] Running org.apache.qpid.disttest.message.ParticipantResultTest
    [junit] Tests run: 3, Failures: 0, Errors: 0, Time elapsed: 0.044 sec
    [junit] Running org.apache.qpid.disttest.results.aggregation.AggregatorTest
    [junit] Tests run: 1, Failures: 0, Errors: 0, Time elapsed: 0.01 sec
    [junit] Running org.apache.qpid.disttest.results.aggregation.ParticipantResultAggregatorTest
    [junit] Tests run: 14, Failures: 0, Errors: 0, Time elapsed: 0.004 sec
    [junit] Running org.apache.qpid.disttest.results.aggregation.SeriesStatisticsTest
    [junit] Tests run: 1, Failures: 0, Errors: 0, Time elapsed: 0.001 sec
    [junit] Running org.apache.qpid.disttest.results.aggregation.TestResultAggregatorTest
    [junit] Tests run: 4, Failures: 0, Errors: 0, Time elapsed: 0.003 sec
    [junit] Running org.apache.qpid.disttest.results.formatting.CSVFormatterTest
    [junit] Tests run: 1, Failures: 0, Errors: 0, Time elapsed: 0.002 sec
    [junit] Running org.apache.qpid.disttest.results.formatting.CSVOrderParticipantResultComparatorTest
    [junit] Tests run: 6, Failures: 0, Errors: 0, Time elapsed: 0.008 sec
    [junit] Running org.apache.qpid.systest.disttest.QpidQueueCreatorTest
    [junit] Tests run: 3, Failures: 0, Errors: 0, Time elapsed: 1.321 sec
    [junit] Running org.apache.qpid.systest.disttest.clientonly.BasicDistributedClientTest
    [junit] Tests run: 5, Failures: 0, Errors: 0, Time elapsed: 0.605 sec
    [junit] Running org.apache.qpid.systest.disttest.clientonly.ConsumerParticipantTest
    [junit] Tests run: 3, Failures: 0, Errors: 0, Time elapsed: 6.372 sec
    [junit] Running org.apache.qpid.systest.disttest.clientonly.DistributedClientTest
    [junit] Tests run: 9, Failures: 0, Errors: 0, Time elapsed: 0.963 sec
    [junit] Running org.apache.qpid.systest.disttest.clientonly.MessageProviderTest
    [junit] Tests run: 2, Failures: 0, Errors: 0, Time elapsed: 0.143 sec
    [junit] Running org.apache.qpid.systest.disttest.clientonly.ProducerParticipantTest
    [junit] Tests run: 1, Failures: 0, Errors: 0, Time elapsed: 0.581 sec
    [junit] Running org.apache.qpid.systest.disttest.controllerandclient.ControllerAndClientTest
    [junit] Tests run: 5, Failures: 0, Errors: 0, Time elapsed: 2.039 sec
    [junit] Running org.apache.qpid.systest.disttest.controlleronly.DistributedControllerTest
    [junit] Tests run: 1, Failures: 0, Errors: 0, Time elapsed: 1.082 sec
    [junit] Running org.apache.qpid.systest.disttest.endtoend.EndToEndTest
    [junit] Tests run: 1, Failures: 0, Errors: 0, Time elapsed: 1.141 sec
     [echo] Running ant for module : perftests

touch-failed:

BUILD FAILED
<https://builds.apache.org/job/Qpid-Java-Java-Test-JDK1.7/ws/trunk/qpid/java/build.xml>:107:
TEST SUITE FAILED

Total time: 19 minutes 52 seconds
Build step 'Invoke Ant' marked build as failure
[locks-and-latches] Releasing all the locks
[locks-and-latches] All the locks released
Recording test results

Mime
View raw message