qpid-notifications mailing list archives

Site index · List index
Message view « Date » · « Thread »
Top « Date » · « Thread »
From Apache Jenkins Server <jenk...@builds.apache.org>
Subject Build failed in Jenkins: Qpid-proton-j #495
Date Wed, 04 Dec 2013 02:45:48 GMT
See <https://builds.apache.org/job/Qpid-proton-j/495/changes>

Changes:

[mcpierce] PROTON-445: PHP install now honors the install prefix.

If the install prefix is not "/usr" then the INI directory is placed
below it. This is to accomodate a system install as opposed to a
developer install.

[mcpierce] NO-JIRA: Fixed Ruby check error to return anything > 0.

[mcpierce] PROTON-464: Install Ruby bindings to install prefix if specified.

If the user provides a CMAKE_INSTALL_PREFIX on the command line, then
that directory is used to install the Ruby language bindings. If no
install prefix is specified then the Ruby bindings honor the directory
specified by the Ruby VM itself.

[mcpierce] PROTON-445: Perl install now honors CMAKE_INSTALL_PREFIX

The language bindings will now honor this prefix, both the default
value and a user-specified value.

Developers can override it, though, by specifying PERL_INSTALL_PREFIX
at the command line as well. This will allow for installing the Perl
bindings to a different directory if so desired.

Also updated the installation pieces in CMake to simplify it.

[mcpierce] PROTON-445: Python install now honors CMAKE_INSTALL_PREFIX

The language bindings will now honor this prefix, both the default value
and a user-specified value.

Developers can override it, though, by specifying PYTHON_INSTALL_PREFIX
at the command line as well. This will allow for installing the Python
bindings to a different directory if so desired.

[kgiusti] PROTON-200: Java implementation of credit scheduler

------------------------------------------
[...truncated 988 lines...]
A         tests/python/proton_tests/ssl_db/bad-server.pkcs12
A         tests/python/proton_tests/ssl_db/client-private-key.pem
AU        tests/python/interop-generate
A         tests/ruby
AU        tests/ruby/proton-test
A         tests/ruby/proton_tests
A         tests/ruby/proton_tests/smoke.rb
AU        tests/ruby/proton_tests/interop.rb
A         version.txt
A         .gitignore
A         TODO
 U        .
At revision 1547693
Parsing POMs
Modules changed, recalculating dependency graph
maven3-agent.jar already up to date
maven3-interceptor.jar already up to date
maven3-interceptor-commons.jar already up to date
[trunk] $ /home/hudson/tools/java/latest1.6/bin/java -cp /home/jenkins/jenkins-slave/maven3-agent.jar:/home/hudson/tools/maven/apache-maven-3.0.2/boot/plexus-classworlds-2.4.jar
org.jvnet.hudson.maven3.agent.Maven3Main /home/hudson/tools/maven/apache-maven-3.0.2 /x1/jenkins/jenkins-slave/slave.jar
/home/jenkins/jenkins-slave/maven3-interceptor.jar /home/jenkins/jenkins-slave/maven3-interceptor-commons.jar
58398
<===[JENKINS REMOTING CAPACITY]===>   channel started
log4j:WARN No appenders could be found for logger (org.apache.commons.beanutils.converters.BooleanConverter).
log4j:WARN Please initialize the log4j system properly.
Executing Maven:  -B -f <https://builds.apache.org/job/Qpid-proton-j/ws/trunk/pom.xml>
-Dmaven.repo.local=/home/jenkins/jenkins-slave/maven-repositories/1 -fae -B -e clean install
[INFO] Error stacktraces are turned on.
[INFO] Scanning for projects...
[INFO] ------------------------------------------------------------------------
[INFO] Reactor Build Order:
[INFO] 
[INFO] proton-project
[INFO] proton-j
[INFO] proton-api
[INFO] proton-j-impl
[INFO] proton-jms
[INFO] proton-hawtdispatch
[INFO] proton-tests
[INFO] proton-j-messenger-example
[INFO]                                                                         
[INFO] ------------------------------------------------------------------------
[INFO] Building proton-project 1.0-SNAPSHOT
[INFO] ------------------------------------------------------------------------
[INFO] 
[INFO] --- maven-clean-plugin:2.5:clean (default-clean) @ proton-project ---
[INFO] 
[INFO] --- maven-remote-resources-plugin:1.4:process (default) @ proton-project ---
[INFO] 
[INFO] --- maven-site-plugin:3.2:attach-descriptor (attach-descriptor) @ proton-project ---
[INFO] 
[INFO] --- maven-install-plugin:2.3.1:install (default-install) @ proton-project ---
[INFO] Installing <https://builds.apache.org/job/Qpid-proton-j/ws/trunk/pom.xml> to
/home/jenkins/jenkins-slave/maven-repositories/1/org/apache/qpid/proton-project/1.0-SNAPSHOT/proton-project-1.0-SNAPSHOT.pom
[INFO]                                                                         
[INFO] ------------------------------------------------------------------------
[INFO] Building proton-j 1.0-SNAPSHOT
[INFO] ------------------------------------------------------------------------
[INFO] 
[INFO] --- maven-clean-plugin:2.5:clean (default-clean) @ proton-j ---
[INFO] 
[INFO] --- maven-remote-resources-plugin:1.4:process (default) @ proton-j ---
[INFO] 
[INFO] --- maven-site-plugin:3.2:attach-descriptor (attach-descriptor) @ proton-j ---
[INFO] 
[INFO] --- maven-install-plugin:2.3.1:install (default-install) @ proton-j ---
[INFO] Installing <https://builds.apache.org/job/Qpid-proton-j/ws/trunk/proton-j/pom.xml>
to /home/jenkins/jenkins-slave/maven-repositories/1/org/apache/qpid/proton-j/1.0-SNAPSHOT/proton-j-1.0-SNAPSHOT.pom
[INFO]                                                                         
[INFO] ------------------------------------------------------------------------
[INFO] Building proton-api 1.0-SNAPSHOT
[INFO] ------------------------------------------------------------------------
[INFO] 
[INFO] --- maven-clean-plugin:2.5:clean (default-clean) @ proton-api ---
[INFO] 
[INFO] --- maven-remote-resources-plugin:1.4:process (default) @ proton-api ---
[INFO] 
[INFO] --- maven-resources-plugin:2.6:resources (default-resources) @ proton-api ---
[INFO] Using 'UTF-8' encoding to copy filtered resources.
[INFO] Copying 1 resource
[INFO] Copying 3 resources
[INFO] 
[INFO] --- maven-compiler-plugin:2.5.1:compile (default-compile) @ proton-api ---
[INFO] Compiling 113 source files to <https://builds.apache.org/job/Qpid-proton-j/ws/trunk/proton-j/proton-api/target/classes>
[INFO] 
[INFO] --- maven-resources-plugin:2.6:testResources (default-testResources) @ proton-api ---
[INFO] Using 'UTF-8' encoding to copy filtered resources.
[INFO] Copying 1 resource
[INFO] Copying 3 resources
[INFO] 
[INFO] --- maven-compiler-plugin:2.5.1:testCompile (default-testCompile) @ proton-api ---
[INFO] Compiling 6 source files to <https://builds.apache.org/job/Qpid-proton-j/ws/trunk/proton-j/proton-api/target/test-classes>
[INFO] 
[INFO] --- maven-surefire-plugin:2.12.4:test (default-test) @ proton-api ---
[INFO] Surefire report directory: <https://builds.apache.org/job/Qpid-proton-j/ws/trunk/proton-j/proton-api/target/surefire-reports>

-------------------------------------------------------
 T E S T S
-------------------------------------------------------
Running org.apache.qpid.proton.ProtonFactoryLoaderTest
Tests run: 6, Failures: 0, Errors: 0, Skipped: 0, Time elapsed: 0.034 sec
Running org.apache.qpid.proton.amqp.transport.ErrorConditionTest
Tests run: 5, Failures: 0, Errors: 0, Skipped: 0, Time elapsed: 0.001 sec

Results :

Tests run: 11, Failures: 0, Errors: 0, Skipped: 0

[JENKINS] Recording test results
[INFO] 
[INFO] --- maven-jar-plugin:2.4:jar (default-jar) @ proton-api ---
[INFO] Building jar: <https://builds.apache.org/job/Qpid-proton-j/ws/trunk/proton-j/proton-api/target/proton-api-1.0-SNAPSHOT.jar>
[INFO] 
[INFO] --- maven-site-plugin:3.2:attach-descriptor (attach-descriptor) @ proton-api ---
[INFO] 
[INFO] --- maven-install-plugin:2.3.1:install (default-install) @ proton-api ---
[INFO] Installing <https://builds.apache.org/job/Qpid-proton-j/ws/trunk/proton-j/proton-api/target/proton-api-1.0-SNAPSHOT.jar>
to /home/jenkins/jenkins-slave/maven-repositories/1/org/apache/qpid/proton-api/1.0-SNAPSHOT/proton-api-1.0-SNAPSHOT.jar
[INFO] Installing <https://builds.apache.org/job/Qpid-proton-j/ws/trunk/proton-j/proton-api/pom.xml>
to /home/jenkins/jenkins-slave/maven-repositories/1/org/apache/qpid/proton-api/1.0-SNAPSHOT/proton-api-1.0-SNAPSHOT.pom
[INFO]                                                                         
[INFO] ------------------------------------------------------------------------
[INFO] Building proton-j-impl 1.0-SNAPSHOT
[INFO] ------------------------------------------------------------------------
[INFO] 
[INFO] --- maven-clean-plugin:2.5:clean (default-clean) @ proton-j-impl ---
[INFO] 
[INFO] --- maven-remote-resources-plugin:1.4:process (default) @ proton-j-impl ---
[INFO] 
[INFO] --- maven-resources-plugin:2.6:resources (default-resources) @ proton-j-impl ---
[INFO] Using 'UTF-8' encoding to copy filtered resources.
[INFO] Copying 5 resources
[INFO] Copying 3 resources
[INFO] 
[INFO] --- maven-compiler-plugin:2.5.1:compile (default-compile) @ proton-j-impl ---
[INFO] Compiling 194 source files to <https://builds.apache.org/job/Qpid-proton-j/ws/trunk/proton-j/proton/target/classes>
[INFO] -------------------------------------------------------------
[ERROR] COMPILATION ERROR : 
[INFO] -------------------------------------------------------------
[ERROR] <https://builds.apache.org/job/Qpid-proton-j/ws/trunk/proton-j/proton/src/main/java/org/apache/qpid/proton/driver/impl/DriverImpl.java>:[26,15]
cannot find symbol
symbol  : class StandardSocketOptions
location: package java.net
[ERROR] <https://builds.apache.org/job/Qpid-proton-j/ws/trunk/proton-j/proton/src/main/java/org/apache/qpid/proton/engine/impl/LinkImpl.java>:[322,16]
[deprecation] setRemoteSenderSettleMode(org.apache.qpid.proton.amqp.transport.SenderSettleMode)
in org.apache.qpid.proton.engine.Link has been deprecated
[ERROR] <https://builds.apache.org/job/Qpid-proton-j/ws/trunk/proton-j/proton/src/main/java/org/apache/qpid/proton/engine/impl/TransportImpl.java>:[227,15]
[deprecation] output(byte[],int,int) in org.apache.qpid.proton.engine.Transport has been deprecated
[ERROR] <https://builds.apache.org/job/Qpid-proton-j/ws/trunk/proton-j/proton/src/main/java/org/apache/qpid/proton/engine/impl/TransportImpl.java>:[196,15]
[deprecation] input(byte[],int,int) in org.apache.qpid.proton.engine.Transport has been deprecated
[ERROR] <https://builds.apache.org/job/Qpid-proton-j/ws/trunk/proton-j/proton/src/main/java/org/apache/qpid/proton/driver/impl/DriverImpl.java>:[197,30]
cannot find symbol
symbol  : variable StandardSocketOptions
location: class org.apache.qpid.proton.driver.impl.DriverImpl
[INFO] 5 errors 
[INFO] -------------------------------------------------------------
[INFO]                                                                         
[INFO] ------------------------------------------------------------------------
[INFO] Skipping proton-jms
[INFO] This project has been banned from the build due to previous failures.
[INFO] ------------------------------------------------------------------------
[INFO]                                                                         
[INFO] ------------------------------------------------------------------------
[INFO] Skipping proton-hawtdispatch
[INFO] This project has been banned from the build due to previous failures.
[INFO] ------------------------------------------------------------------------
[INFO]                                                                         
[INFO] ------------------------------------------------------------------------
[INFO] Skipping proton-tests
[INFO] This project has been banned from the build due to previous failures.
[INFO] ------------------------------------------------------------------------
[INFO]                                                                         
[INFO] ------------------------------------------------------------------------
[INFO] Skipping proton-j-messenger-example
[INFO] This project has been banned from the build due to previous failures.
[INFO] ------------------------------------------------------------------------
[INFO] ------------------------------------------------------------------------
[INFO] Reactor Summary:
[INFO] 
[INFO] proton-project .................................... SUCCESS [24.629s]
[INFO] proton-j .......................................... SUCCESS [9.362s]
[INFO] proton-api ........................................ SUCCESS [23.684s]
[INFO] proton-j-impl ..................................... FAILURE [15.534s]
[INFO] proton-jms ........................................ SKIPPED
[INFO] proton-hawtdispatch ............................... SKIPPED
[INFO] proton-tests ...................................... SKIPPED
[INFO] proton-j-messenger-example ........................ SKIPPED
[INFO] ------------------------------------------------------------------------
[INFO] BUILD FAILURE
[INFO] ------------------------------------------------------------------------
[INFO] Total time: 1:56.727s
[INFO] Finished at: Wed Dec 04 02:44:18 UTC 2013
[INFO] Final Memory: 17M/101M
[INFO] ------------------------------------------------------------------------
[JENKINS] Archiving disabled
[JENKINS] Archiving disabled
[JENKINS] Archiving disabled
[JENKINS] Archiving disabled
[JENKINS] Archiving disabled
[JENKINS] Archiving disabled
[JENKINS] Archiving disabled
[JENKINS] Archiving disabled
Waiting for Jenkins to finish collecting data
[ERROR] Failed to execute goal org.apache.maven.plugins:maven-compiler-plugin:2.5.1:compile
(default-compile) on project proton-j-impl: Compilation failure: Compilation failure:
[ERROR] <https://builds.apache.org/job/Qpid-proton-j/ws/trunk/proton-j/proton/src/main/java/org/apache/qpid/proton/driver/impl/DriverImpl.java>:[26,15]
cannot find symbol
[ERROR] symbol  : class StandardSocketOptions
[ERROR] location: package java.net
[ERROR] <https://builds.apache.org/job/Qpid-proton-j/ws/trunk/proton-j/proton/src/main/java/org/apache/qpid/proton/engine/impl/LinkImpl.java>:[322,16]
[deprecation] setRemoteSenderSettleMode(org.apache.qpid.proton.amqp.transport.SenderSettleMode)
in org.apache.qpid.proton.engine.Link has been deprecated
[ERROR] <https://builds.apache.org/job/Qpid-proton-j/ws/trunk/proton-j/proton/src/main/java/org/apache/qpid/proton/engine/impl/TransportImpl.java>:[227,15]
[deprecation] output(byte[],int,int) in org.apache.qpid.proton.engine.Transport has been deprecated
[ERROR] <https://builds.apache.org/job/Qpid-proton-j/ws/trunk/proton-j/proton/src/main/java/org/apache/qpid/proton/engine/impl/TransportImpl.java>:[196,15]
[deprecation] input(byte[],int,int) in org.apache.qpid.proton.engine.Transport has been deprecated
[ERROR] <https://builds.apache.org/job/Qpid-proton-j/ws/trunk/proton-j/proton/src/main/java/org/apache/qpid/proton/driver/impl/DriverImpl.java>:[197,30]
cannot find symbol
[ERROR] symbol  : variable StandardSocketOptions
[ERROR] location: class org.apache.qpid.proton.driver.impl.DriverImpl
[ERROR] -> [Help 1]
org.apache.maven.lifecycle.LifecycleExecutionException: Failed to execute goal org.apache.maven.plugins:maven-compiler-plugin:2.5.1:compile
(default-compile) on project proton-j-impl: Compilation failure
	at org.apache.maven.lifecycle.internal.MojoExecutor.execute(MojoExecutor.java:213)
	at org.apache.maven.lifecycle.internal.MojoExecutor.execute(MojoExecutor.java:153)
	at org.apache.maven.lifecycle.internal.MojoExecutor.execute(MojoExecutor.java:145)
	at org.apache.maven.lifecycle.internal.LifecycleModuleBuilder.buildProject(LifecycleModuleBuilder.java:84)
	at org.apache.maven.lifecycle.internal.LifecycleModuleBuilder.buildProject(LifecycleModuleBuilder.java:59)
	at org.apache.maven.lifecycle.internal.LifecycleStarter.singleThreadedBuild(LifecycleStarter.java:183)
	at org.apache.maven.lifecycle.internal.LifecycleStarter.execute(LifecycleStarter.java:161)
	at org.apache.maven.DefaultMaven.doExecute(DefaultMaven.java:319)
	at org.apache.maven.DefaultMaven.execute(DefaultMaven.java:156)
	at org.jvnet.hudson.maven3.launcher.Maven3Launcher.main(Maven3Launcher.java:117)
	at sun.reflect.NativeMethodAccessorImpl.invoke0(Native Method)
	at sun.reflect.NativeMethodAccessorImpl.invoke(NativeMethodAccessorImpl.java:39)
	at sun.reflect.DelegatingMethodAccessorImpl.invoke(DelegatingMethodAccessorImpl.java:25)
	at java.lang.reflect.Method.invoke(Method.java:597)
	at org.codehaus.plexus.classworlds.launcher.Launcher.launchStandard(Launcher.java:329)
	at org.codehaus.plexus.classworlds.launcher.Launcher.launch(Launcher.java:239)
	at org.jvnet.hudson.maven3.agent.Maven3Main.launch(Maven3Main.java:178)
	at sun.reflect.NativeMethodAccessorImpl.invoke0(Native Method)
	at sun.reflect.NativeMethodAccessorImpl.invoke(NativeMethodAccessorImpl.java:39)
	at sun.reflect.DelegatingMethodAccessorImpl.invoke(DelegatingMethodAccessorImpl.java:25)
	at java.lang.reflect.Method.invoke(Method.java:597)
	at hudson.maven.Maven3Builder.call(Maven3Builder.java:134)
	at hudson.maven.Maven3Builder.call(Maven3Builder.java:69)
	at hudson.remoting.UserRequest.perform(UserRequest.java:118)
	at hudson.remoting.UserRequest.perform(UserRequest.java:48)
	at hudson.remoting.Request$2.run(Request.java:328)
	at hudson.remoting.InterceptingExecutorService$1.call(InterceptingExecutorService.java:72)
	at java.util.concurrent.FutureTask$Sync.innerRun(FutureTask.java:303)
	at java.util.concurrent.FutureTask.run(FutureTask.java:138)
	at java.util.concurrent.ThreadPoolExecutor$Worker.runTask(ThreadPoolExecutor.java:895)
	at java.util.concurrent.ThreadPoolExecutor$Worker.run(ThreadPoolExecutor.java:918)
	at java.lang.Thread.run(Thread.java:662)
Caused by: org.apache.maven.plugin.CompilationFailureException: Compilation failure
	at org.apache.maven.plugin.AbstractCompilerMojo.execute(AbstractCompilerMojo.java:729)
	at org.apache.maven.plugin.CompilerMojo.execute(CompilerMojo.java:128)
	at org.apache.maven.plugin.DefaultBuildPluginManager.executeMojo(DefaultBuildPluginManager.java:107)
	at org.apache.maven.lifecycle.internal.MojoExecutor.execute(MojoExecutor.java:209)
	... 31 more
[ERROR] 
[ERROR] Re-run Maven using the -X switch to enable full debug logging.
[ERROR] 
[ERROR] For more information about the errors and possible solutions, please read the following
articles:
[ERROR] [Help 1] http://cwiki.apache.org/confluence/display/MAVEN/MojoFailureException
[ERROR] 
[ERROR] After correcting the problems, you can resume the build with the command
[ERROR]   mvn <goals> -rf :proton-j-impl
Sending e-mails to: notifications@qpid.apache.org null@apache.org
channel stopped

Mime
View raw message