qpid-notifications mailing list archives

Site index · List index
Message view « Date » · « Thread »
Top « Date » · « Thread »
From Apache Jenkins Server <jenk...@builds.apache.org>
Subject Build failed in Jenkins: Qpid-Java-Cpp-Test #1554
Date Wed, 30 Oct 2013 00:01:01 GMT
See <https://builds.apache.org/job/Qpid-Java-Cpp-Test/1554/changes>

Changes:

[kwall] QPID-4463: [Java Broker] SimpleLDAPAuthManager - address review comments from Robbie
Gemmell

* Ensure that trust stores used by auth managers cannot be deleted.
* Stop unnecessary dependency on jakarta-regexp when built by Ant.
* Make check for ldaps:/ check trim / case insensitive

------------------------------------------
[...truncated 5081 lines...]
/home/hudson/jenkins-slave/workspace/Qpid-Java-Cpp-Test/cpp-build/bindings/qmf2/ruby/rubyRUBY_wrap.cxx:
In function 'VALUE _wrap_Query_getPredicate(int, VALUE*, VALUE)':
/home/hudson/jenkins-slave/workspace/Qpid-Java-Cpp-Test/cpp-build/bindings/qmf2/ruby/rubyRUBY_wrap.cxx:10697:36:
warning: format not a string literal and no format arguments [-Wformat-security]
/home/hudson/jenkins-slave/workspace/Qpid-Java-Cpp-Test/cpp-build/bindings/qmf2/ruby/rubyRUBY_wrap.cxx:
In function 'VALUE _wrap_Query_matchesPredicate(int, VALUE*, VALUE)':
/home/hudson/jenkins-slave/workspace/Qpid-Java-Cpp-Test/cpp-build/bindings/qmf2/ruby/rubyRUBY_wrap.cxx:10736:36:
warning: format not a string literal and no format arguments [-Wformat-security]
/home/hudson/jenkins-slave/workspace/Qpid-Java-Cpp-Test/cpp-build/bindings/qmf2/ruby/rubyRUBY_wrap.cxx:
In function 'VALUE _wrap_new_Schema__SWIG_0(int, VALUE*, VALUE)':
/home/hudson/jenkins-slave/workspace/Qpid-Java-Cpp-Test/cpp-build/bindings/qmf2/ruby/rubyRUBY_wrap.cxx:10776:36:
warning: format not a string literal and no format arguments [-Wformat-security]
/home/hudson/jenkins-slave/workspace/Qpid-Java-Cpp-Test/cpp-build/bindings/qmf2/ruby/rubyRUBY_wrap.cxx:
In function 'VALUE _wrap_new_Schema__SWIG_1(int, VALUE*, VALUE)':
/home/hudson/jenkins-slave/workspace/Qpid-Java-Cpp-Test/cpp-build/bindings/qmf2/ruby/rubyRUBY_wrap.cxx:10799:36:
warning: format not a string literal and no format arguments [-Wformat-security]
/home/hudson/jenkins-slave/workspace/Qpid-Java-Cpp-Test/cpp-build/bindings/qmf2/ruby/rubyRUBY_wrap.cxx:
In function 'VALUE _wrap_new_Schema__SWIG_2(int, VALUE*, VALUE)':
/home/hudson/jenkins-slave/workspace/Qpid-Java-Cpp-Test/cpp-build/bindings/qmf2/ruby/rubyRUBY_wrap.cxx:10833:36:
warning: format not a string literal and no format arguments [-Wformat-security]
/home/hudson/jenkins-slave/workspace/Qpid-Java-Cpp-Test/cpp-build/bindings/qmf2/ruby/rubyRUBY_wrap.cxx:
In function 'VALUE _wrap_new_Schema__SWIG_3(int, VALUE*, VALUE)':
/home/hudson/jenkins-slave/workspace/Qpid-Java-Cpp-Test/cpp-build/bindings/qmf2/ruby/rubyRUBY_wrap.cxx:10912:36:
warning: format not a string literal and no format arguments [-Wformat-security]
/home/hudson/jenkins-slave/workspace/Qpid-Java-Cpp-Test/cpp-build/bindings/qmf2/ruby/rubyRUBY_wrap.cxx:
In function 'VALUE _wrap_Schema_getSchemaId(int, VALUE*, VALUE)':
/home/hudson/jenkins-slave/workspace/Qpid-Java-Cpp-Test/cpp-build/bindings/qmf2/ruby/rubyRUBY_wrap.cxx:11008:36:
warning: format not a string literal and no format arguments [-Wformat-security]
/home/hudson/jenkins-slave/workspace/Qpid-Java-Cpp-Test/cpp-build/bindings/qmf2/ruby/rubyRUBY_wrap.cxx:
In function 'VALUE _wrap_Schema_finalize(int, VALUE*, VALUE)':
/home/hudson/jenkins-slave/workspace/Qpid-Java-Cpp-Test/cpp-build/bindings/qmf2/ruby/rubyRUBY_wrap.cxx:11038:36:
warning: format not a string literal and no format arguments [-Wformat-security]
/home/hudson/jenkins-slave/workspace/Qpid-Java-Cpp-Test/cpp-build/bindings/qmf2/ruby/rubyRUBY_wrap.cxx:
In function 'VALUE _wrap_Schema_isFinalized(int, VALUE*, VALUE)':
/home/hudson/jenkins-slave/workspace/Qpid-Java-Cpp-Test/cpp-build/bindings/qmf2/ruby/rubyRUBY_wrap.cxx:11069:36:
warning: format not a string literal and no format arguments [-Wformat-security]
/home/hudson/jenkins-slave/workspace/Qpid-Java-Cpp-Test/cpp-build/bindings/qmf2/ruby/rubyRUBY_wrap.cxx:
In function 'VALUE _wrap_Schema_addProperty(int, VALUE*, VALUE)':
/home/hudson/jenkins-slave/workspace/Qpid-Java-Cpp-Test/cpp-build/bindings/qmf2/ruby/rubyRUBY_wrap.cxx:11110:36:
warning: format not a string literal and no format arguments [-Wformat-security]
/home/hudson/jenkins-slave/workspace/Qpid-Java-Cpp-Test/cpp-build/bindings/qmf2/ruby/rubyRUBY_wrap.cxx:
In function 'VALUE _wrap_Schema_addMethod(int, VALUE*, VALUE)':
/home/hudson/jenkins-slave/workspace/Qpid-Java-Cpp-Test/cpp-build/bindings/qmf2/ruby/rubyRUBY_wrap.cxx:11150:36:
warning: format not a string literal and no format arguments [-Wformat-security]
/home/hudson/jenkins-slave/workspace/Qpid-Java-Cpp-Test/cpp-build/bindings/qmf2/ruby/rubyRUBY_wrap.cxx:
In function 'VALUE _wrap_Schema_setDesc(int, VALUE*, VALUE)':
/home/hudson/jenkins-slave/workspace/Qpid-Java-Cpp-Test/cpp-build/bindings/qmf2/ruby/rubyRUBY_wrap.cxx:11192:36:
warning: format not a string literal and no format arguments [-Wformat-security]
/home/hudson/jenkins-slave/workspace/Qpid-Java-Cpp-Test/cpp-build/bindings/qmf2/ruby/rubyRUBY_wrap.cxx:
In function 'VALUE _wrap_Schema_getDesc(int, VALUE*, VALUE)':
/home/hudson/jenkins-slave/workspace/Qpid-Java-Cpp-Test/cpp-build/bindings/qmf2/ruby/rubyRUBY_wrap.cxx:11225:36:
warning: format not a string literal and no format arguments [-Wformat-security]
/home/hudson/jenkins-slave/workspace/Qpid-Java-Cpp-Test/cpp-build/bindings/qmf2/ruby/rubyRUBY_wrap.cxx:
In function 'VALUE _wrap_Schema_setDefaultSeverity(int, VALUE*, VALUE)':
/home/hudson/jenkins-slave/workspace/Qpid-Java-Cpp-Test/cpp-build/bindings/qmf2/ruby/rubyRUBY_wrap.cxx:11263:36:
warning: format not a string literal and no format arguments [-Wformat-security]
/home/hudson/jenkins-slave/workspace/Qpid-Java-Cpp-Test/cpp-build/bindings/qmf2/ruby/rubyRUBY_wrap.cxx:
In function 'VALUE _wrap_Schema_getDefaultSeverity(int, VALUE*, VALUE)':
/home/hudson/jenkins-slave/workspace/Qpid-Java-Cpp-Test/cpp-build/bindings/qmf2/ruby/rubyRUBY_wrap.cxx:11294:36:
warning: format not a string literal and no format arguments [-Wformat-security]
/home/hudson/jenkins-slave/workspace/Qpid-Java-Cpp-Test/cpp-build/bindings/qmf2/ruby/rubyRUBY_wrap.cxx:
In function 'VALUE _wrap_Schema_getPropertyCount(int, VALUE*, VALUE)':
/home/hudson/jenkins-slave/workspace/Qpid-Java-Cpp-Test/cpp-build/bindings/qmf2/ruby/rubyRUBY_wrap.cxx:11326:36:
warning: format not a string literal and no format arguments [-Wformat-security]
/home/hudson/jenkins-slave/workspace/Qpid-Java-Cpp-Test/cpp-build/bindings/qmf2/ruby/rubyRUBY_wrap.cxx:
In function 'VALUE _wrap_Schema_getProperty(int, VALUE*, VALUE)':
/home/hudson/jenkins-slave/workspace/Qpid-Java-Cpp-Test/cpp-build/bindings/qmf2/ruby/rubyRUBY_wrap.cxx:11367:36:
warning: format not a string literal and no format arguments [-Wformat-security]
/home/hudson/jenkins-slave/workspace/Qpid-Java-Cpp-Test/cpp-build/bindings/qmf2/ruby/rubyRUBY_wrap.cxx:
In function 'VALUE _wrap_Schema_getMethodCount(int, VALUE*, VALUE)':
/home/hudson/jenkins-slave/workspace/Qpid-Java-Cpp-Test/cpp-build/bindings/qmf2/ruby/rubyRUBY_wrap.cxx:11399:36:
warning: format not a string literal and no format arguments [-Wformat-security]
/home/hudson/jenkins-slave/workspace/Qpid-Java-Cpp-Test/cpp-build/bindings/qmf2/ruby/rubyRUBY_wrap.cxx:
In function 'VALUE _wrap_Schema_getMethod(int, VALUE*, VALUE)':
/home/hudson/jenkins-slave/workspace/Qpid-Java-Cpp-Test/cpp-build/bindings/qmf2/ruby/rubyRUBY_wrap.cxx:11440:36:
warning: format not a string literal and no format arguments [-Wformat-security]
/home/hudson/jenkins-slave/workspace/Qpid-Java-Cpp-Test/cpp-build/bindings/qmf2/ruby/rubyRUBY_wrap.cxx:
In function 'VALUE _wrap_new_SchemaId__SWIG_0(int, VALUE*, VALUE)':
/home/hudson/jenkins-slave/workspace/Qpid-Java-Cpp-Test/cpp-build/bindings/qmf2/ruby/rubyRUBY_wrap.cxx:11474:36:
warning: format not a string literal and no format arguments [-Wformat-security]
/home/hudson/jenkins-slave/workspace/Qpid-Java-Cpp-Test/cpp-build/bindings/qmf2/ruby/rubyRUBY_wrap.cxx:
In function 'VALUE _wrap_new_SchemaId__SWIG_1(int, VALUE*, VALUE)':
/home/hudson/jenkins-slave/workspace/Qpid-Java-Cpp-Test/cpp-build/bindings/qmf2/ruby/rubyRUBY_wrap.cxx:11497:36:
warning: format not a string literal and no format arguments [-Wformat-security]
/home/hudson/jenkins-slave/workspace/Qpid-Java-Cpp-Test/cpp-build/bindings/qmf2/ruby/rubyRUBY_wrap.cxx:
In function 'VALUE _wrap_new_SchemaId__SWIG_2(int, VALUE*, VALUE)':
/home/hudson/jenkins-slave/workspace/Qpid-Java-Cpp-Test/cpp-build/bindings/qmf2/ruby/rubyRUBY_wrap.cxx:11531:36:
warning: format not a string literal and no format arguments [-Wformat-security]
/home/hudson/jenkins-slave/workspace/Qpid-Java-Cpp-Test/cpp-build/bindings/qmf2/ruby/rubyRUBY_wrap.cxx:
In function 'VALUE _wrap_new_SchemaId__SWIG_3(int, VALUE*, VALUE)':
/home/hudson/jenkins-slave/workspace/Qpid-Java-Cpp-Test/cpp-build/bindings/qmf2/ruby/rubyRUBY_wrap.cxx:11610:36:
warning: format not a string literal and no format arguments [-Wformat-security]
/home/hudson/jenkins-slave/workspace/Qpid-Java-Cpp-Test/cpp-build/bindings/qmf2/ruby/rubyRUBY_wrap.cxx:
In function 'VALUE _wrap_SchemaId_setHash(int, VALUE*, VALUE)':
/home/hudson/jenkins-slave/workspace/Qpid-Java-Cpp-Test/cpp-build/bindings/qmf2/ruby/rubyRUBY_wrap.cxx:11715:36:
warning: format not a string literal and no format arguments [-Wformat-security]
/home/hudson/jenkins-slave/workspace/Qpid-Java-Cpp-Test/cpp-build/bindings/qmf2/ruby/rubyRUBY_wrap.cxx:
In function 'VALUE _wrap_SchemaId_getType(int, VALUE*, VALUE)':
/home/hudson/jenkins-slave/workspace/Qpid-Java-Cpp-Test/cpp-build/bindings/qmf2/ruby/rubyRUBY_wrap.cxx:11746:36:
warning: format not a string literal and no format arguments [-Wformat-security]
/home/hudson/jenkins-slave/workspace/Qpid-Java-Cpp-Test/cpp-build/bindings/qmf2/ruby/rubyRUBY_wrap.cxx:
In function 'VALUE _wrap_SchemaId_getPackageName(int, VALUE*, VALUE)':
/home/hudson/jenkins-slave/workspace/Qpid-Java-Cpp-Test/cpp-build/bindings/qmf2/ruby/rubyRUBY_wrap.cxx:11778:36:
warning: format not a string literal and no format arguments [-Wformat-security]
/home/hudson/jenkins-slave/workspace/Qpid-Java-Cpp-Test/cpp-build/bindings/qmf2/ruby/rubyRUBY_wrap.cxx:
In function 'VALUE _wrap_SchemaId_getName(int, VALUE*, VALUE)':
/home/hudson/jenkins-slave/workspace/Qpid-Java-Cpp-Test/cpp-build/bindings/qmf2/ruby/rubyRUBY_wrap.cxx:11810:36:
warning: format not a string literal and no format arguments [-Wformat-security]
/home/hudson/jenkins-slave/workspace/Qpid-Java-Cpp-Test/cpp-build/bindings/qmf2/ruby/rubyRUBY_wrap.cxx:
In function 'VALUE _wrap_SchemaId_getHash(int, VALUE*, VALUE)':
/home/hudson/jenkins-slave/workspace/Qpid-Java-Cpp-Test/cpp-build/bindings/qmf2/ruby/rubyRUBY_wrap.cxx:11842:36:
warning: format not a string literal and no format arguments [-Wformat-security]
/home/hudson/jenkins-slave/workspace/Qpid-Java-Cpp-Test/cpp-build/bindings/qmf2/ruby/rubyRUBY_wrap.cxx:
In function 'VALUE _wrap_new_SchemaMethod__SWIG_0(int, VALUE*, VALUE)':
/home/hudson/jenkins-slave/workspace/Qpid-Java-Cpp-Test/cpp-build/bindings/qmf2/ruby/rubyRUBY_wrap.cxx:11876:36:
warning: format not a string literal and no format arguments [-Wformat-security]
/home/hudson/jenkins-slave/workspace/Qpid-Java-Cpp-Test/cpp-build/bindings/qmf2/ruby/rubyRUBY_wrap.cxx:
In function 'VALUE _wrap_new_SchemaMethod__SWIG_1(int, VALUE*, VALUE)':
/home/hudson/jenkins-slave/workspace/Qpid-Java-Cpp-Test/cpp-build/bindings/qmf2/ruby/rubyRUBY_wrap.cxx:11899:36:
warning: format not a string literal and no format arguments [-Wformat-security]
/home/hudson/jenkins-slave/workspace/Qpid-Java-Cpp-Test/cpp-build/bindings/qmf2/ruby/rubyRUBY_wrap.cxx:
In function 'VALUE _wrap_new_SchemaMethod__SWIG_2(int, VALUE*, VALUE)':
/home/hudson/jenkins-slave/workspace/Qpid-Java-Cpp-Test/cpp-build/bindings/qmf2/ruby/rubyRUBY_wrap.cxx:11933:36:
warning: format not a string literal and no format arguments [-Wformat-security]
/home/hudson/jenkins-slave/workspace/Qpid-Java-Cpp-Test/cpp-build/bindings/qmf2/ruby/rubyRUBY_wrap.cxx:
In function 'VALUE _wrap_new_SchemaMethod__SWIG_3(int, VALUE*, VALUE)':
/home/hudson/jenkins-slave/workspace/Qpid-Java-Cpp-Test/cpp-build/bindings/qmf2/ruby/rubyRUBY_wrap.cxx:11987:36:
warning: format not a string literal and no format arguments [-Wformat-security]
/home/hudson/jenkins-slave/workspace/Qpid-Java-Cpp-Test/cpp-build/bindings/qmf2/ruby/rubyRUBY_wrap.cxx:
In function 'VALUE _wrap_new_SchemaMethod__SWIG_4(int, VALUE*, VALUE)':
/home/hudson/jenkins-slave/workspace/Qpid-Java-Cpp-Test/cpp-build/bindings/qmf2/ruby/rubyRUBY_wrap.cxx:12044:36:
warning: format not a string literal and no format arguments [-Wformat-security]
/home/hudson/jenkins-slave/workspace/Qpid-Java-Cpp-Test/cpp-build/bindings/qmf2/ruby/rubyRUBY_wrap.cxx:
In function 'VALUE _wrap_SchemaMethod_setDesc(int, VALUE*, VALUE)':
/home/hudson/jenkins-slave/workspace/Qpid-Java-Cpp-Test/cpp-build/bindings/qmf2/ruby/rubyRUBY_wrap.cxx:12152:36:
warning: format not a string literal and no format arguments [-Wformat-security]
/home/hudson/jenkins-slave/workspace/Qpid-Java-Cpp-Test/cpp-build/bindings/qmf2/ruby/rubyRUBY_wrap.cxx:
In function 'VALUE _wrap_SchemaMethod_addArgument(int, VALUE*, VALUE)':
/home/hudson/jenkins-slave/workspace/Qpid-Java-Cpp-Test/cpp-build/bindings/qmf2/ruby/rubyRUBY_wrap.cxx:12194:36:
warning: format not a string literal and no format arguments [-Wformat-security]
/home/hudson/jenkins-slave/workspace/Qpid-Java-Cpp-Test/cpp-build/bindings/qmf2/ruby/rubyRUBY_wrap.cxx:
In function 'VALUE _wrap_SchemaMethod_getName(int, VALUE*, VALUE)':
/home/hudson/jenkins-slave/workspace/Qpid-Java-Cpp-Test/cpp-build/bindings/qmf2/ruby/rubyRUBY_wrap.cxx:12225:36:
warning: format not a string literal and no format arguments [-Wformat-security]
/home/hudson/jenkins-slave/workspace/Qpid-Java-Cpp-Test/cpp-build/bindings/qmf2/ruby/rubyRUBY_wrap.cxx:
In function 'VALUE _wrap_SchemaMethod_getDesc(int, VALUE*, VALUE)':
/home/hudson/jenkins-slave/workspace/Qpid-Java-Cpp-Test/cpp-build/bindings/qmf2/ruby/rubyRUBY_wrap.cxx:12257:36:
warning: format not a string literal and no format arguments [-Wformat-security]
/home/hudson/jenkins-slave/workspace/Qpid-Java-Cpp-Test/cpp-build/bindings/qmf2/ruby/rubyRUBY_wrap.cxx:
In function 'VALUE _wrap_SchemaMethod_getArgumentCount(int, VALUE*, VALUE)':
/home/hudson/jenkins-slave/workspace/Qpid-Java-Cpp-Test/cpp-build/bindings/qmf2/ruby/rubyRUBY_wrap.cxx:12289:36:
warning: format not a string literal and no format arguments [-Wformat-security]
/home/hudson/jenkins-slave/workspace/Qpid-Java-Cpp-Test/cpp-build/bindings/qmf2/ruby/rubyRUBY_wrap.cxx:
In function 'VALUE _wrap_SchemaMethod_getArgument(int, VALUE*, VALUE)':
/home/hudson/jenkins-slave/workspace/Qpid-Java-Cpp-Test/cpp-build/bindings/qmf2/ruby/rubyRUBY_wrap.cxx:12330:36:
warning: format not a string literal and no format arguments [-Wformat-security]
/home/hudson/jenkins-slave/workspace/Qpid-Java-Cpp-Test/cpp-build/bindings/qmf2/ruby/rubyRUBY_wrap.cxx:
In function 'VALUE _wrap_new_SchemaProperty__SWIG_0(int, VALUE*, VALUE)':
/home/hudson/jenkins-slave/workspace/Qpid-Java-Cpp-Test/cpp-build/bindings/qmf2/ruby/rubyRUBY_wrap.cxx:12364:36:
warning: format not a string literal and no format arguments [-Wformat-security]
/home/hudson/jenkins-slave/workspace/Qpid-Java-Cpp-Test/cpp-build/bindings/qmf2/ruby/rubyRUBY_wrap.cxx:
In function 'VALUE _wrap_new_SchemaProperty__SWIG_1(int, VALUE*, VALUE)':
/home/hudson/jenkins-slave/workspace/Qpid-Java-Cpp-Test/cpp-build/bindings/qmf2/ruby/rubyRUBY_wrap.cxx:12387:36:
warning: format not a string literal and no format arguments [-Wformat-security]
/home/hudson/jenkins-slave/workspace/Qpid-Java-Cpp-Test/cpp-build/bindings/qmf2/ruby/rubyRUBY_wrap.cxx:
In function 'VALUE _wrap_new_SchemaProperty__SWIG_2(int, VALUE*, VALUE)':
/home/hudson/jenkins-slave/workspace/Qpid-Java-Cpp-Test/cpp-build/bindings/qmf2/ruby/rubyRUBY_wrap.cxx:12421:36:
warning: format not a string literal and no format arguments [-Wformat-security]
/home/hudson/jenkins-slave/workspace/Qpid-Java-Cpp-Test/cpp-build/bindings/qmf2/ruby/rubyRUBY_wrap.cxx:
In function 'VALUE _wrap_new_SchemaProperty__SWIG_3(int, VALUE*, VALUE)':
/home/hudson/jenkins-slave/workspace/Qpid-Java-Cpp-Test/cpp-build/bindings/qmf2/ruby/rubyRUBY_wrap.cxx:12483:36:
warning: format not a string literal and no format arguments [-Wformat-security]
/home/hudson/jenkins-slave/workspace/Qpid-Java-Cpp-Test/cpp-build/bindings/qmf2/ruby/rubyRUBY_wrap.cxx:
In function 'VALUE _wrap_new_SchemaProperty__SWIG_4(int, VALUE*, VALUE)':
/home/hudson/jenkins-slave/workspace/Qpid-Java-Cpp-Test/cpp-build/bindings/qmf2/ruby/rubyRUBY_wrap.cxx:12548:36:
warning: format not a string literal and no format arguments [-Wformat-security]
/home/hudson/jenkins-slave/workspace/Qpid-Java-Cpp-Test/cpp-build/bindings/qmf2/ruby/rubyRUBY_wrap.cxx:
In function 'VALUE _wrap_SchemaProperty_setAccess(int, VALUE*, VALUE)':
/home/hudson/jenkins-slave/workspace/Qpid-Java-Cpp-Test/cpp-build/bindings/qmf2/ruby/rubyRUBY_wrap.cxx:12663:36:
warning: format not a string literal and no format arguments [-Wformat-security]
/home/hudson/jenkins-slave/workspace/Qpid-Java-Cpp-Test/cpp-build/bindings/qmf2/ruby/rubyRUBY_wrap.cxx:
In function 'VALUE _wrap_SchemaProperty_setIndex(int, VALUE*, VALUE)':
/home/hudson/jenkins-slave/workspace/Qpid-Java-Cpp-Test/cpp-build/bindings/qmf2/ruby/rubyRUBY_wrap.cxx:12700:36:
warning: format not a string literal and no format arguments [-Wformat-security]
/home/hudson/jenkins-slave/workspace/Qpid-Java-Cpp-Test/cpp-build/bindings/qmf2/ruby/rubyRUBY_wrap.cxx:
In function 'VALUE _wrap_SchemaProperty_setOptional(int, VALUE*, VALUE)':
/home/hudson/jenkins-slave/workspace/Qpid-Java-Cpp-Test/cpp-build/bindings/qmf2/ruby/rubyRUBY_wrap.cxx:12737:36:
warning: format not a string literal and no format arguments [-Wformat-security]
/home/hudson/jenkins-slave/workspace/Qpid-Java-Cpp-Test/cpp-build/bindings/qmf2/ruby/rubyRUBY_wrap.cxx:
In function 'VALUE _wrap_SchemaProperty_setUnit(int, VALUE*, VALUE)':
/home/hudson/jenkins-slave/workspace/Qpid-Java-Cpp-Test/cpp-build/bindings/qmf2/ruby/rubyRUBY_wrap.cxx:12779:36:
warning: format not a string literal and no format arguments [-Wformat-security]
/home/hudson/jenkins-slave/workspace/Qpid-Java-Cpp-Test/cpp-build/bindings/qmf2/ruby/rubyRUBY_wrap.cxx:
In function 'VALUE _wrap_SchemaProperty_setDesc(int, VALUE*, VALUE)':
/home/hudson/jenkins-slave/workspace/Qpid-Java-Cpp-Test/cpp-build/bindings/qmf2/ruby/rubyRUBY_wrap.cxx:12823:36:
warning: format not a string literal and no format arguments [-Wformat-security]
/home/hudson/jenkins-slave/workspace/Qpid-Java-Cpp-Test/cpp-build/bindings/qmf2/ruby/rubyRUBY_wrap.cxx:
In function 'VALUE _wrap_SchemaProperty_setSubtype(int, VALUE*, VALUE)':
/home/hudson/jenkins-slave/workspace/Qpid-Java-Cpp-Test/cpp-build/bindings/qmf2/ruby/rubyRUBY_wrap.cxx:12867:36:
warning: format not a string literal and no format arguments [-Wformat-security]
/home/hudson/jenkins-slave/workspace/Qpid-Java-Cpp-Test/cpp-build/bindings/qmf2/ruby/rubyRUBY_wrap.cxx:
In function 'VALUE _wrap_SchemaProperty_setDirection(int, VALUE*, VALUE)':
/home/hudson/jenkins-slave/workspace/Qpid-Java-Cpp-Test/cpp-build/bindings/qmf2/ruby/rubyRUBY_wrap.cxx:12906:36:
warning: format not a string literal and no format arguments [-Wformat-security]
/home/hudson/jenkins-slave/workspace/Qpid-Java-Cpp-Test/cpp-build/bindings/qmf2/ruby/rubyRUBY_wrap.cxx:
In function 'VALUE _wrap_SchemaProperty_getName(int, VALUE*, VALUE)':
/home/hudson/jenkins-slave/workspace/Qpid-Java-Cpp-Test/cpp-build/bindings/qmf2/ruby/rubyRUBY_wrap.cxx:12937:36:
warning: format not a string literal and no format arguments [-Wformat-security]
/home/hudson/jenkins-slave/workspace/Qpid-Java-Cpp-Test/cpp-build/bindings/qmf2/ruby/rubyRUBY_wrap.cxx:
In function 'VALUE _wrap_SchemaProperty_getType(int, VALUE*, VALUE)':
/home/hudson/jenkins-slave/workspace/Qpid-Java-Cpp-Test/cpp-build/bindings/qmf2/ruby/rubyRUBY_wrap.cxx:12969:36:
warning: format not a string literal and no format arguments [-Wformat-security]
/home/hudson/jenkins-slave/workspace/Qpid-Java-Cpp-Test/cpp-build/bindings/qmf2/ruby/rubyRUBY_wrap.cxx:
In function 'VALUE _wrap_SchemaProperty_getAccess(int, VALUE*, VALUE)':
/home/hudson/jenkins-slave/workspace/Qpid-Java-Cpp-Test/cpp-build/bindings/qmf2/ruby/rubyRUBY_wrap.cxx:13001:36:
warning: format not a string literal and no format arguments [-Wformat-security]
/home/hudson/jenkins-slave/workspace/Qpid-Java-Cpp-Test/cpp-build/bindings/qmf2/ruby/rubyRUBY_wrap.cxx:
In function 'VALUE _wrap_SchemaProperty_isIndex(int, VALUE*, VALUE)':
/home/hudson/jenkins-slave/workspace/Qpid-Java-Cpp-Test/cpp-build/bindings/qmf2/ruby/rubyRUBY_wrap.cxx:13033:36:
warning: format not a string literal and no format arguments [-Wformat-security]
/home/hudson/jenkins-slave/workspace/Qpid-Java-Cpp-Test/cpp-build/bindings/qmf2/ruby/rubyRUBY_wrap.cxx:
In function 'VALUE _wrap_SchemaProperty_isOptional(int, VALUE*, VALUE)':
/home/hudson/jenkins-slave/workspace/Qpid-Java-Cpp-Test/cpp-build/bindings/qmf2/ruby/rubyRUBY_wrap.cxx:13065:36:
warning: format not a string literal and no format arguments [-Wformat-security]
/home/hudson/jenkins-slave/workspace/Qpid-Java-Cpp-Test/cpp-build/bindings/qmf2/ruby/rubyRUBY_wrap.cxx:
In function 'VALUE _wrap_SchemaProperty_getUnit(int, VALUE*, VALUE)':
/home/hudson/jenkins-slave/workspace/Qpid-Java-Cpp-Test/cpp-build/bindings/qmf2/ruby/rubyRUBY_wrap.cxx:13097:36:
warning: format not a string literal and no format arguments [-Wformat-security]
/home/hudson/jenkins-slave/workspace/Qpid-Java-Cpp-Test/cpp-build/bindings/qmf2/ruby/rubyRUBY_wrap.cxx:
In function 'VALUE _wrap_SchemaProperty_getDesc(int, VALUE*, VALUE)':
/home/hudson/jenkins-slave/workspace/Qpid-Java-Cpp-Test/cpp-build/bindings/qmf2/ruby/rubyRUBY_wrap.cxx:13129:36:
warning: format not a string literal and no format arguments [-Wformat-security]
/home/hudson/jenkins-slave/workspace/Qpid-Java-Cpp-Test/cpp-build/bindings/qmf2/ruby/rubyRUBY_wrap.cxx:
In function 'VALUE _wrap_SchemaProperty_getSubtype(int, VALUE*, VALUE)':
/home/hudson/jenkins-slave/workspace/Qpid-Java-Cpp-Test/cpp-build/bindings/qmf2/ruby/rubyRUBY_wrap.cxx:13161:36:
warning: format not a string literal and no format arguments [-Wformat-security]
/home/hudson/jenkins-slave/workspace/Qpid-Java-Cpp-Test/cpp-build/bindings/qmf2/ruby/rubyRUBY_wrap.cxx:
In function 'VALUE _wrap_SchemaProperty_getDirection(int, VALUE*, VALUE)':
/home/hudson/jenkins-slave/workspace/Qpid-Java-Cpp-Test/cpp-build/bindings/qmf2/ruby/rubyRUBY_wrap.cxx:13193:36:
warning: format not a string literal and no format arguments [-Wformat-security]
/home/hudson/jenkins-slave/workspace/Qpid-Java-Cpp-Test/cpp-build/bindings/qmf2/ruby/rubyRUBY_wrap.cxx:
In function 'VALUE _wrap_new_Subscription__SWIG_0(int, VALUE*, VALUE)':
/home/hudson/jenkins-slave/workspace/Qpid-Java-Cpp-Test/cpp-build/bindings/qmf2/ruby/rubyRUBY_wrap.cxx:13443:36:
warning: format not a string literal and no format arguments [-Wformat-security]
/home/hudson/jenkins-slave/workspace/Qpid-Java-Cpp-Test/cpp-build/bindings/qmf2/ruby/rubyRUBY_wrap.cxx:
In function 'VALUE _wrap_new_Subscription__SWIG_1(int, VALUE*, VALUE)':
/home/hudson/jenkins-slave/workspace/Qpid-Java-Cpp-Test/cpp-build/bindings/qmf2/ruby/rubyRUBY_wrap.cxx:13466:36:
warning: format not a string literal and no format arguments [-Wformat-security]
/home/hudson/jenkins-slave/workspace/Qpid-Java-Cpp-Test/cpp-build/bindings/qmf2/ruby/rubyRUBY_wrap.cxx:
In function 'VALUE _wrap_new_Subscription__SWIG_2(int, VALUE*, VALUE)':
/home/hudson/jenkins-slave/workspace/Qpid-Java-Cpp-Test/cpp-build/bindings/qmf2/ruby/rubyRUBY_wrap.cxx:13517:36:
warning: format not a string literal and no format arguments [-Wformat-security]
/home/hudson/jenkins-slave/workspace/Qpid-Java-Cpp-Test/cpp-build/bindings/qmf2/ruby/rubyRUBY_wrap.cxx:
In function 'VALUE _wrap_Subscription_cancel(int, VALUE*, VALUE)':
/home/hudson/jenkins-slave/workspace/Qpid-Java-Cpp-Test/cpp-build/bindings/qmf2/ruby/rubyRUBY_wrap.cxx:13593:36:
warning: format not a string literal and no format arguments [-Wformat-security]
/home/hudson/jenkins-slave/workspace/Qpid-Java-Cpp-Test/cpp-build/bindings/qmf2/ruby/rubyRUBY_wrap.cxx:
In function 'VALUE _wrap_Subscription_isActive(int, VALUE*, VALUE)':
/home/hudson/jenkins-slave/workspace/Qpid-Java-Cpp-Test/cpp-build/bindings/qmf2/ruby/rubyRUBY_wrap.cxx:13624:36:
warning: format not a string literal and no format arguments [-Wformat-security]
/home/hudson/jenkins-slave/workspace/Qpid-Java-Cpp-Test/cpp-build/bindings/qmf2/ruby/rubyRUBY_wrap.cxx:
In function 'VALUE _wrap_Subscription_lock(int, VALUE*, VALUE)':
/home/hudson/jenkins-slave/workspace/Qpid-Java-Cpp-Test/cpp-build/bindings/qmf2/ruby/rubyRUBY_wrap.cxx:13654:36:
warning: format not a string literal and no format arguments [-Wformat-security]
/home/hudson/jenkins-slave/workspace/Qpid-Java-Cpp-Test/cpp-build/bindings/qmf2/ruby/rubyRUBY_wrap.cxx:
In function 'VALUE _wrap_Subscription_unlock(int, VALUE*, VALUE)':
/home/hudson/jenkins-slave/workspace/Qpid-Java-Cpp-Test/cpp-build/bindings/qmf2/ruby/rubyRUBY_wrap.cxx:13683:36:
warning: format not a string literal and no format arguments [-Wformat-security]
/home/hudson/jenkins-slave/workspace/Qpid-Java-Cpp-Test/cpp-build/bindings/qmf2/ruby/rubyRUBY_wrap.cxx:
In function 'VALUE _wrap_Subscription_getDataCount(int, VALUE*, VALUE)':
/home/hudson/jenkins-slave/workspace/Qpid-Java-Cpp-Test/cpp-build/bindings/qmf2/ruby/rubyRUBY_wrap.cxx:13714:36:
warning: format not a string literal and no format arguments [-Wformat-security]
/home/hudson/jenkins-slave/workspace/Qpid-Java-Cpp-Test/cpp-build/bindings/qmf2/ruby/rubyRUBY_wrap.cxx:
In function 'VALUE _wrap_Subscription_getData(int, VALUE*, VALUE)':
/home/hudson/jenkins-slave/workspace/Qpid-Java-Cpp-Test/cpp-build/bindings/qmf2/ruby/rubyRUBY_wrap.cxx:13755:36:
warning: format not a string literal and no format arguments [-Wformat-security]
Scanning dependencies of target qmf2_agent
[ 74%] Building CXX object bindings/qmf2/examples/cpp/CMakeFiles/qmf2_agent.dir/agent.o
Linking CXX executable agent
[ 74%] Built target qmf2_agent
Scanning dependencies of target qmf2_event_driven_list_agents
[ 74%] Building CXX object bindings/qmf2/examples/cpp/CMakeFiles/qmf2_event_driven_list_agents.dir/event_driven_list_agents.o
Linking CXX executable event_driven_list_agents
[ 74%] Built target qmf2_event_driven_list_agents
Scanning dependencies of target qmf2_list_agents
[ 74%] Building CXX object bindings/qmf2/examples/cpp/CMakeFiles/qmf2_list_agents.dir/list_agents.o
Linking CXX executable list_agents
[ 74%] Built target qmf2_list_agents
Scanning dependencies of target qmf2_print_events
[ 74%] Building CXX object bindings/qmf2/examples/cpp/CMakeFiles/qmf2_print_events.dir/print_events.o
Linking CXX shared module libcqmf2_ruby.so
/usr/bin/ld: /usr/local/lib/libruby-static.a(array.o): relocation R_X86_64_32 against `.rodata.str1.1'
can not be used when making a shared object; recompile with -fPIC
/usr/local/lib/libruby-static.a: could not read symbols: Bad value
collect2: ld returned 1 exit status
make[2]: *** [bindings/qmf2/ruby/libcqmf2_ruby.so] Error 1
make[1]: *** [bindings/qmf2/ruby/CMakeFiles/cqmf2_ruby.dir/all] Error 2
make[1]: *** Waiting for unfinished jobs....
[ 74%] [ 75%] Building CXX object src/CMakeFiles/qpidbroker.dir/qpid/broker/Fairshare.cpp.o
Building CXX object src/CMakeFiles/qpidbroker.dir/qpid/broker/MessageDeque.cpp.o
Linking CXX executable print_events
[ 75%] Built target qmf2_print_events
[ 75%] Building CXX object src/CMakeFiles/qpidbroker.dir/qpid/broker/MessageMap.cpp.o
Linking CXX shared module libcqpid_ruby.so
/usr/bin/ld: /usr/local/lib/libruby-static.a(array.o): relocation R_X86_64_32 against `.rodata.str1.1'
can not be used when making a shared object; recompile with -fPIC
/usr/local/lib/libruby-static.a: could not read symbols: Bad value
collect2: ld returned 1 exit status
make[2]: *** [bindings/qpid/ruby/libcqpid_ruby.so] Error 1
make[1]: *** [bindings/qpid/ruby/CMakeFiles/cqpid_ruby.dir/all] Error 2
[ 75%] Building CXX object src/CMakeFiles/qpidbroker.dir/qpid/broker/ObjectFactory.cpp.o
[ 75%] Building CXX object src/CMakeFiles/qpidbroker.dir/qpid/broker/PriorityQueue.cpp.o
[ 75%] Building CXX object src/CMakeFiles/qpidbroker.dir/qpid/broker/Protocol.cpp.o
[ 75%] Building CXX object src/CMakeFiles/qpidbroker.dir/qpid/broker/Queue.cpp.o
[ 76%] Building CXX object src/CMakeFiles/qpidbroker.dir/qpid/broker/QueueCleaner.cpp.o
[ 76%] Building CXX object src/CMakeFiles/qpidbroker.dir/qpid/broker/QueueListeners.cpp.o
[ 76%] Building CXX object src/CMakeFiles/qpidbroker.dir/qpid/broker/FifoDistributor.cpp.o
[ 76%] Building CXX object src/CMakeFiles/qpidbroker.dir/qpid/broker/MessageGroupManager.cpp.o
[ 76%] Building CXX object src/CMakeFiles/qpidbroker.dir/qpid/broker/PersistableMessage.cpp.o
[ 76%] Building CXX object src/CMakeFiles/qpidbroker.dir/qpid/broker/PersistableObject.cpp.o
[ 77%] Building CXX object src/CMakeFiles/qpidbroker.dir/qpid/broker/Bridge.cpp.o
[ 77%] Building CXX object src/CMakeFiles/qpidbroker.dir/qpid/broker/amqp_0_10/Connection.cpp.o
[ 77%] Building CXX object src/CMakeFiles/qpidbroker.dir/qpid/broker/ConnectionHandler.cpp.o
[ 77%] Building CXX object src/CMakeFiles/qpidbroker.dir/qpid/broker/DeliverableMessage.cpp.o
[ 77%] Building CXX object src/CMakeFiles/qpidbroker.dir/qpid/broker/DeliveryRecord.cpp.o
[ 78%] Building CXX object src/CMakeFiles/qpidbroker.dir/qpid/broker/DirectExchange.cpp.o
[ 78%] Building CXX object src/CMakeFiles/qpidbroker.dir/qpid/broker/DtxAck.cpp.o
[ 78%] Building CXX object src/CMakeFiles/qpidbroker.dir/qpid/broker/DtxBuffer.cpp.o
[ 78%] Building CXX object src/CMakeFiles/qpidbroker.dir/qpid/broker/DtxManager.cpp.o
[ 78%] Building CXX object src/CMakeFiles/qpidbroker.dir/qpid/broker/DtxTimeout.cpp.o
[ 78%] Building CXX object src/CMakeFiles/qpidbroker.dir/qpid/broker/DtxWorkRecord.cpp.o
[ 79%] Building CXX object src/CMakeFiles/qpidbroker.dir/qpid/broker/ExchangeRegistry.cpp.o
[ 79%] Building CXX object src/CMakeFiles/qpidbroker.dir/qpid/broker/FanOutExchange.cpp.o
[ 79%] Building CXX object src/CMakeFiles/qpidbroker.dir/qpid/broker/HeadersExchange.cpp.o
[ 79%] Building CXX object src/CMakeFiles/qpidbroker.dir/qpid/broker/IngressCompletion.cpp.o
[ 79%] Building CXX object src/CMakeFiles/qpidbroker.dir/qpid/broker/Link.cpp.o
[ 79%] Building CXX object src/CMakeFiles/qpidbroker.dir/qpid/broker/LinkRegistry.cpp.o
[ 80%] Building CXX object src/CMakeFiles/qpidbroker.dir/qpid/broker/LossyQueue.cpp.o
[ 80%] Building CXX object src/CMakeFiles/qpidbroker.dir/qpid/broker/Lvq.cpp.o
[ 80%] Building CXX object src/CMakeFiles/qpidbroker.dir/qpid/broker/Message.cpp.o
[ 80%] Building CXX object src/CMakeFiles/qpidbroker.dir/qpid/broker/MessageAdapter.cpp.o
[ 80%] Building CXX object src/CMakeFiles/qpidbroker.dir/qpid/broker/MessageBuilder.cpp.o
[ 80%] Building CXX object src/CMakeFiles/qpidbroker.dir/qpid/broker/MessageStoreModule.cpp.o
[ 81%] Building CXX object src/CMakeFiles/qpidbroker.dir/qpid/broker/NameGenerator.cpp.o
[ 81%] Building CXX object src/CMakeFiles/qpidbroker.dir/qpid/broker/NullMessageStore.cpp.o
[ 81%] Building CXX object src/CMakeFiles/qpidbroker.dir/qpid/broker/PagedQueue.cpp.o
[ 81%] Building CXX object src/CMakeFiles/qpidbroker.dir/qpid/broker/QueueBindings.cpp.o
[ 81%] Building CXX object src/CMakeFiles/qpidbroker.dir/qpid/broker/QueuedMessage.cpp.o
[ 82%] Building CXX object src/CMakeFiles/qpidbroker.dir/qpid/broker/QueueCursor.cpp.o
[ 82%] Building CXX object src/CMakeFiles/qpidbroker.dir/qpid/broker/QueueDepth.cpp.o
[ 82%] Building CXX object src/CMakeFiles/qpidbroker.dir/qpid/broker/QueueFactory.cpp.o
[ 82%] Building CXX object src/CMakeFiles/qpidbroker.dir/qpid/broker/QueueRegistry.cpp.o
[ 82%] Building CXX object src/CMakeFiles/qpidbroker.dir/qpid/broker/QueueSettings.cpp.o
[ 82%] Building CXX object src/CMakeFiles/qpidbroker.dir/qpid/broker/QueueFlowLimit.cpp.o
[ 83%] Building CXX object src/CMakeFiles/qpidbroker.dir/qpid/broker/RecoveryManagerImpl.cpp.o
[ 83%] Building CXX object src/CMakeFiles/qpidbroker.dir/qpid/broker/RecoveredEnqueue.cpp.o
[ 83%] Building CXX object src/CMakeFiles/qpidbroker.dir/qpid/broker/RecoveredDequeue.cpp.o
[ 83%] Building CXX object src/CMakeFiles/qpidbroker.dir/qpid/broker/RetryList.cpp.o
[ 83%] Building CXX object src/CMakeFiles/qpidbroker.dir/qpid/broker/SecureConnection.cpp.o
[ 83%] Building CXX object src/CMakeFiles/qpidbroker.dir/qpid/broker/SecureConnectionFactory.cpp.o
[ 84%] Building CXX object src/CMakeFiles/qpidbroker.dir/qpid/broker/Selector.cpp.o
[ 84%] Building CXX object src/CMakeFiles/qpidbroker.dir/qpid/broker/SelectorExpression.cpp.o
[ 84%] Building CXX object src/CMakeFiles/qpidbroker.dir/qpid/broker/SelectorToken.cpp.o
[ 84%] Building CXX object src/CMakeFiles/qpidbroker.dir/qpid/broker/SelectorValue.cpp.o
[ 84%] Building CXX object src/CMakeFiles/qpidbroker.dir/qpid/broker/SelfDestructQueue.cpp.o
[ 84%] Building CXX object src/CMakeFiles/qpidbroker.dir/qpid/broker/SemanticState.cpp.o
[ 85%] Building CXX object src/CMakeFiles/qpidbroker.dir/qpid/broker/SessionAdapter.cpp.o
[ 85%] Building CXX object src/CMakeFiles/qpidbroker.dir/qpid/broker/SessionState.cpp.o
[ 85%] Building CXX object src/CMakeFiles/qpidbroker.dir/qpid/broker/SessionManager.cpp.o
[ 85%] Building CXX object src/CMakeFiles/qpidbroker.dir/qpid/broker/SessionHandler.cpp.o
[ 85%] [ 86%] Building CXX object src/CMakeFiles/qpidbroker.dir/qpid/broker/System.cpp.o
Building CXX object src/CMakeFiles/qpidbroker.dir/qpid/broker/ThresholdAlerts.cpp.o
[ 86%] Building CXX object src/CMakeFiles/qpidbroker.dir/qpid/broker/TopicExchange.cpp.o
[ 86%] Building CXX object src/CMakeFiles/qpidbroker.dir/qpid/broker/TxAccept.cpp.o
[ 86%] Building CXX object src/CMakeFiles/qpidbroker.dir/qpid/broker/TxBuffer.cpp.o
[ 86%] Building CXX object src/CMakeFiles/qpidbroker.dir/qpid/broker/Vhost.cpp.o
[ 86%] Building CXX object src/CMakeFiles/qpidbroker.dir/qpid/broker/amqp_0_10/MessageTransfer.cpp.o
[ 87%] Building CXX object src/CMakeFiles/qpidbroker.dir/qpid/management/ManagementAgent.cpp.o
[ 87%] Building CXX object src/CMakeFiles/qpidbroker.dir/qpid/management/ManagementDirectExchange.cpp.o
[ 87%] Building CXX object src/CMakeFiles/qpidbroker.dir/qpid/management/ManagementTopicExchange.cpp.o
[ 87%] Building CXX object src/CMakeFiles/qpidbroker.dir/qpid/sys/SocketTransport.cpp.o
[ 87%] Building CXX object src/CMakeFiles/qpidbroker.dir/qpid/sys/TCPIOPlugin.cpp.o
Linking CXX shared library libqpidbroker.so
[ 87%] Built target qpidbroker
make: *** [all] Error 2
Build step 'Execute shell' marked build as failure
[locks-and-latches] Releasing all the locks
[locks-and-latches] All the locks released
Recording test results

Mime
View raw message