qpid-notifications mailing list archives

Site index · List index
Message view « Date » · « Thread »
Top « Date » · « Thread »
From Apache Jenkins Server <jenk...@builds.apache.org>
Subject Build failed in Jenkins: Qpid-Java-Java-Test-JDK1.7 #596
Date Wed, 16 Oct 2013 04:16:33 GMT
See <https://builds.apache.org/job/Qpid-Java-Java-Test-JDK1.7/596/changes>

Changes:

[jross] QPID-5035: Revert change 1510657, which incorrectly altered the config precedence

[tross] QPID-5238 - Changed the container agent's address to "$management" to match the specification.

[tross] QPID-5216
  - Removed unneeded python router code
  - Added propagation of subscribed global addresses
  - Broke out address statistics to include to/from-container counts
  - Trace no longer optional, broke down and added loop prevention
  - Don't allow endpoint subscriptions to subscribe to local-class addresses

[tross] QPID-5216 - Fixed a bug in the composition of nested composite fields.

[gsim] QPID-5236: correct symbolic descriptor for amqp value section

[gsim] QPID-4582, QPID-5215: fix linking errors for clock_gettime

[mcpierce] QPID-5231: Fix QMF code to use qpid_messaging rather than cqpid.

[mcpierce] Revert "QPID-5213: Fix QMF code to use qpid_messaging rather than cqpid."

This reverts commit 067e9aa1656b9f92e5910bbb6d530f9df6d0dad3.

It had the wrong JIRA number in the commit.

[gsim] QPID-5235: populate store settings for dynamically created queues

[gsim] QPID-5229: tests for reject and release over 1.0

[gsim] QPID-5227: QPID-5230: added tests for redelivered flag on browse and release

[gsim] QPID-5233: match default sender capacity to that for 0-10 codepath

[gsim] QPID-5232: make subscriptions unreliable and autodeleted by default

[gsim] QPID-5229: implement release and reject

[gsim] QPID-5228: allow alternate exchange to be set on 1.0 subscription queues

[gsim] QPID-5230: request that explicitly released messages be marked as redelivered on subsequent
delivery attempts

[gsim] QPID-5227: correct setting of redelivered flag

[orudyy] QPID-5138: Provide time zone name for dalight saving time only when daylight saving
time is in effect

------------------------------------------
[...truncated 5040 lines...]
    [junit] Running org.apache.qpid.test.unit.client.MaxDeliveryCountTest
    [junit] Tests run: 7, Failures: 0, Errors: 0, Time elapsed: 3.932 sec
    [junit] Running org.apache.qpid.test.unit.client.QueueSessionFactoryTest
    [junit] Tests run: 5, Failures: 0, Errors: 0, Time elapsed: 0.138 sec
    [junit] Running org.apache.qpid.test.unit.client.TopicSessionFactoryTest
    [junit] Tests run: 4, Failures: 0, Errors: 0, Time elapsed: 0.095 sec
    [junit] Running org.apache.qpid.test.unit.client.channelclose.CloseWithBlockingReceiveTest
    [junit] Tests run: 1, Failures: 0, Errors: 0, Time elapsed: 1.159 sec
    [junit] Running org.apache.qpid.test.unit.client.connection.BrokerClosesClientConnectionTest
    [junit] Tests run: 3, Failures: 0, Errors: 0, Time elapsed: 12.163 sec
    [junit] Running org.apache.qpid.test.unit.client.connection.ConnectionFactoryTest
    [junit] Tests run: 2, Failures: 0, Errors: 0, Time elapsed: 0.06 sec
    [junit] Running org.apache.qpid.test.unit.client.connection.ConnectionStartTest
    [junit] Tests run: 2, Failures: 0, Errors: 0, Time elapsed: 0.08 sec
    [junit] Running org.apache.qpid.test.unit.client.connection.ConnectionTest
    [junit] Tests run: 12, Failures: 0, Errors: 0, Time elapsed: 0.834 sec
    [junit] Running org.apache.qpid.test.unit.client.connection.ExceptionListenerTest
    [junit] Tests run: 3, Failures: 0, Errors: 0, Time elapsed: 0.088 sec
    [junit] Running org.apache.qpid.test.unit.client.message.ObjectMessageTest
    [junit] Tests run: 10, Failures: 0, Errors: 0, Time elapsed: 1.22 sec
    [junit] Running org.apache.qpid.test.unit.client.protocol.AMQProtocolSessionTest
    [junit] Tests run: 5, Failures: 0, Errors: 0, Time elapsed: 0.127 sec
    [junit] Running org.apache.qpid.test.unit.client.temporaryqueue.TemporaryQueueTest
    [junit] Tests run: 4, Failures: 0, Errors: 0, Time elapsed: 0.114 sec
    [junit] Running org.apache.qpid.test.unit.close.JavaServerCloseRaceConditionTest
    [junit] Tests run: 0, Failures: 0, Errors: 0, Time elapsed: 0.001 sec
    [junit] Running org.apache.qpid.test.unit.close.MessageConsumerCloseTest
    [junit] Tests run: 1, Failures: 0, Errors: 0, Time elapsed: 0.058 sec
    [junit] Running org.apache.qpid.test.unit.close.MessageRequeueTest
    [junit] Tests run: 3, Failures: 0, Errors: 0, Time elapsed: 16.488 sec
    [junit] Running org.apache.qpid.test.unit.close.TopicPublisherCloseTest
    [junit] Tests run: 1, Failures: 0, Errors: 0, Time elapsed: 3.027 sec
    [junit] Running org.apache.qpid.test.unit.ct.DurableSubscriberTest
    [junit] Tests run: 0, Failures: 0, Errors: 0, Time elapsed: 0.001 sec
    [junit] Running org.apache.qpid.test.unit.message.JMSPropertiesTest
    [junit] Tests run: 2, Failures: 0, Errors: 0, Time elapsed: 0.066 sec
    [junit] Running org.apache.qpid.test.unit.message.StreamMessageTest
    [junit] Tests run: 2, Failures: 0, Errors: 0, Time elapsed: 0.074 sec
    [junit] Running org.apache.qpid.test.unit.message.UTF8Test
    [junit] Tests run: 2, Failures: 0, Errors: 0, Time elapsed: 0.059 sec
    [junit] Running org.apache.qpid.test.unit.topic.DurableSubscriptionTest
    [junit] Tests run: 17, Failures: 0, Errors: 0, Time elapsed: 29.765 sec
    [junit] Running org.apache.qpid.test.unit.topic.TemporaryTopicTest
    [junit] Tests run: 5, Failures: 0, Errors: 0, Time elapsed: 0.129 sec
    [junit] Running org.apache.qpid.test.unit.topic.TopicPublisherTest
    [junit] Tests run: 1, Failures: 0, Errors: 0, Time elapsed: 0.026 sec
    [junit] Running org.apache.qpid.test.unit.topic.TopicSessionTest
    [junit] Tests run: 9, Failures: 0, Errors: 0, Time elapsed: 10.09 sec
    [junit] Running org.apache.qpid.test.unit.transacted.CommitRollbackTest
    [junit] Tests run: 12, Failures: 0, Errors: 0, Time elapsed: 18.102 sec
    [junit] Running org.apache.qpid.test.unit.transacted.TransactedTest
    [junit] Tests run: 7, Failures: 0, Errors: 0, Time elapsed: 8.296 sec
    [junit] Running org.apache.qpid.test.unit.transacted.TransactionTimeoutDisabledTest
    [junit] Tests run: 2, Failures: 0, Errors: 0, Time elapsed: 3.755 sec
    [junit] Running org.apache.qpid.test.unit.transacted.TransactionTimeoutTest
    [junit] Tests run: 15, Failures: 1, Errors: 0, Time elapsed: 44.319 sec
    [junit] TEST org.apache.qpid.test.unit.transacted.TransactionTimeoutTest FAILED
    [junit] Running org.apache.qpid.test.unit.xa.FaultTest
    [junit] Tests run: 10, Failures: 0, Errors: 0, Time elapsed: 12.235 sec
    [junit] Running org.apache.qpid.test.unit.xa.QueueTest
    [junit] Tests run: 1, Failures: 0, Errors: 0, Time elapsed: 1.043 sec
    [junit] Running org.apache.qpid.test.unit.xa.TopicTest
    [junit] Tests run: 4, Failures: 0, Errors: 0, Time elapsed: 4.161 sec
    [junit] Running org.apache.qpid.test.utils.BrokerCommandHelperTest
    [junit] Tests run: 2, Failures: 0, Errors: 0, Time elapsed: 0.003 sec
    [junit] Running org.apache.qpid.util.LogMonitorTest
    [junit] Tests run: 9, Failures: 0, Errors: 0, Time elapsed: 2.008 sec
    [junit] Tests FAILED
     [echo] Running ant for module : systests

touch-failed:
    [touch] Creating <https://builds.apache.org/job/Qpid-Java-Java-Test-JDK1.7/ws/trunk/qpid/java/build/results/systests/FAILED>
    [touch] Creating <https://builds.apache.org/job/Qpid-Java-Java-Test-JDK1.7/ws/trunk/qpid/java/build/results/FAILED>
     [echo] Running ant for module : perftests

prepare:

precompile:

compile:
     [echo] Targeting : 1.6

copy-extra-resources:

copy-resources:
     [echo] Copying resources from <https://builds.apache.org/job/Qpid-Java-Java-Test-JDK1.7/ws/trunk/qpid/java/perftests/src/main/resources>
to <https://builds.apache.org/job/Qpid-Java-Java-Test-JDK1.7/ws/trunk/qpid/java/build/scratch/perftests/classes...>

copy-project-resources-metainf:

copy-module-resources-metainf:

copy-module-src-resources-metainf:

copy-files-to-module-metainf:

jar.manifest:

jar.nomanifest:

jar:

precompile-tests:

compile-tests:

copy-test-resources:

jar-tests:

jar-sources:

libs:

copy-bin:

copy-etc:

postbuild:

copy-broker-plugin-jars-deps:

copy-broker-plugin-jars:

build:

test:
     [echo] Using profile:java-mms.0-10
    [junit] Running org.apache.qpid.disttest.ArgumentParserTest
    [junit] Tests run: 3, Failures: 0, Errors: 0, Time elapsed: 0.024 sec
    [junit] Running org.apache.qpid.disttest.ConfigFileHelperTest
    [junit] Tests run: 1, Failures: 0, Errors: 0, Time elapsed: 0.014 sec
    [junit] Running org.apache.qpid.disttest.ResultsFileWriterTest
    [junit] Tests run: 2, Failures: 0, Errors: 0, Time elapsed: 0.035 sec
    [junit] Running org.apache.qpid.disttest.VisitorTest
    [junit] Tests run: 3, Failures: 0, Errors: 0, Time elapsed: 0.011 sec
    [junit] Running org.apache.qpid.disttest.client.ClientCommandVisitorTest
    [junit] Tests run: 8, Failures: 0, Errors: 0, Time elapsed: 0.07 sec
    [junit] Running org.apache.qpid.disttest.client.ClientTest
    [junit] Tests run: 8, Failures: 0, Errors: 0, Time elapsed: 0.567 sec
    [junit] Running org.apache.qpid.disttest.client.ConsumerParticipantTest
    [junit] Tests run: 7, Failures: 0, Errors: 0, Time elapsed: 0.177 sec
    [junit] Running org.apache.qpid.disttest.client.MessageProviderTest
    [junit] Tests run: 3, Failures: 0, Errors: 0, Time elapsed: 0.11 sec
    [junit] Running org.apache.qpid.disttest.client.ParticipantExecutorTest
    [junit] Tests run: 4, Failures: 0, Errors: 0, Time elapsed: 0.032 sec
    [junit] Running org.apache.qpid.disttest.client.ParticipantRegistryTest
    [junit] Tests run: 2, Failures: 0, Errors: 0, Time elapsed: 0.007 sec
    [junit] Running org.apache.qpid.disttest.client.ParticipantResultFactoryTest
    [junit] Tests run: 3, Failures: 0, Errors: 0, Time elapsed: 0.006 sec
    [junit] Running org.apache.qpid.disttest.client.ProducerParticipantTest
    [junit] Tests run: 9, Failures: 0, Errors: 0, Time elapsed: 1.582 sec
    [junit] Running org.apache.qpid.disttest.client.property.ListPropertyValueTest
    [junit] Tests run: 3, Failures: 0, Errors: 0, Time elapsed: 0.006 sec
    [junit] Running org.apache.qpid.disttest.client.property.PropertyValueFactoryTest
    [junit] Tests run: 5, Failures: 0, Errors: 0, Time elapsed: 0.008 sec
    [junit] Running org.apache.qpid.disttest.client.property.RandomPropertyValueTest
    [junit] Tests run: 5, Failures: 0, Errors: 0, Time elapsed: 0.006 sec
    [junit] Running org.apache.qpid.disttest.client.property.RangePropertyValueTest
    [junit] Tests run: 8, Failures: 0, Errors: 0, Time elapsed: 0.008 sec
    [junit] Running org.apache.qpid.disttest.client.property.SimplePropertyValueTest
    [junit] Tests run: 1, Failures: 0, Errors: 0, Time elapsed: 0.005 sec
    [junit] Running org.apache.qpid.disttest.client.utils.ExecutorWithNoLimitsTest
    [junit] Tests run: 2, Failures: 0, Errors: 0, Time elapsed: 0.005 sec
    [junit] Running org.apache.qpid.disttest.client.utils.ExecutorWithTimeLimitTest
    [junit] Tests run: 4, Failures: 0, Errors: 0, Time elapsed: 0.508 sec
    [junit] Running org.apache.qpid.disttest.controller.ClientRegistryTest
    [junit] Tests run: 8, Failures: 0, Errors: 0, Time elapsed: 2.555 sec
    [junit] Running org.apache.qpid.disttest.controller.ControllerTest
    [junit] Tests run: 6, Failures: 0, Errors: 0, Time elapsed: 0.049 sec
    [junit] Running org.apache.qpid.disttest.controller.ParticipatingClientsTest
    [junit] Tests run: 5, Failures: 0, Errors: 0, Time elapsed: 0.015 sec
    [junit] Running org.apache.qpid.disttest.controller.TestRunnerTest
    [junit] Tests run: 6, Failures: 0, Errors: 0, Time elapsed: 1.144 sec
    [junit] Running org.apache.qpid.disttest.controller.config.ClientConfigTest
    [junit] Tests run: 4, Failures: 0, Errors: 0, Time elapsed: 0.015 sec
    [junit] Running org.apache.qpid.disttest.controller.config.ConfigReaderTest
    [junit] Tests run: 5, Failures: 0, Errors: 0, Time elapsed: 0.341 sec
    [junit] Running org.apache.qpid.disttest.controller.config.ConfigTest
    [junit] Tests run: 1, Failures: 0, Errors: 0, Time elapsed: 0.008 sec
    [junit] Running org.apache.qpid.disttest.controller.config.ConnectionConfigTest
    [junit] Tests run: 3, Failures: 0, Errors: 0, Time elapsed: 0.013 sec
    [junit] Running org.apache.qpid.disttest.controller.config.ConsumerConfigTest
    [junit] Tests run: 2, Failures: 0, Errors: 0, Time elapsed: 0.004 sec
    [junit] Running org.apache.qpid.disttest.controller.config.IterationValueTest
    [junit] Tests run: 3, Failures: 0, Errors: 0, Time elapsed: 0.039 sec
    [junit] Running org.apache.qpid.disttest.controller.config.JavaScriptConfigEvaluatorTest
    [junit] Tests run: 1, Failures: 0, Errors: 0, Time elapsed: 0.045 sec
    [junit] Running org.apache.qpid.disttest.controller.config.MessageProviderConfigTest
    [junit] Tests run: 2, Failures: 0, Errors: 0, Time elapsed: 0.002 sec
    [junit] Running org.apache.qpid.disttest.controller.config.ParticipantConfigTest
    [junit] Tests run: 1, Failures: 0, Errors: 0, Time elapsed: 0.008 sec
    [junit] Running org.apache.qpid.disttest.controller.config.ProducerConfigTest
    [junit] Tests run: 3, Failures: 0, Errors: 0, Time elapsed: 0.001 sec
    [junit] Running org.apache.qpid.disttest.controller.config.SessionConfigTest
    [junit] Tests run: 3, Failures: 0, Errors: 0, Time elapsed: 0.019 sec
    [junit] Running org.apache.qpid.disttest.controller.config.TestConfigTest
    [junit] Tests run: 5, Failures: 0, Errors: 0, Time elapsed: 0.007 sec
    [junit] Running org.apache.qpid.disttest.controller.config.TestInstanceTest
    [junit] Tests run: 3, Failures: 0, Errors: 0, Time elapsed: 0.006 sec
    [junit] Running org.apache.qpid.disttest.db.ResultsDbWriterTest
    [junit] Tests run: 2, Failures: 0, Errors: 0, Time elapsed: 29.231 sec
    [junit] Running org.apache.qpid.disttest.jms.JmsMessageAdaptorTest
    [junit] Tests run: 1, Failures: 0, Errors: 0, Time elapsed: 0.003 sec
    [junit] Running org.apache.qpid.disttest.message.JsonHandlerTest
    [junit] Tests run: 2, Failures: 0, Errors: 0, Time elapsed: 0.02 sec
    [junit] Running org.apache.qpid.disttest.message.ParticipantResultTest
    [junit] Tests run: 3, Failures: 0, Errors: 0, Time elapsed: 0.046 sec
    [junit] Running org.apache.qpid.disttest.results.aggregation.AggregatorTest
    [junit] Tests run: 1, Failures: 0, Errors: 0, Time elapsed: 0.01 sec
    [junit] Running org.apache.qpid.disttest.results.aggregation.ParticipantResultAggregatorTest
    [junit] Tests run: 14, Failures: 0, Errors: 0, Time elapsed: 0.004 sec
    [junit] Running org.apache.qpid.disttest.results.aggregation.SeriesStatisticsTest
    [junit] Tests run: 1, Failures: 0, Errors: 0, Time elapsed: 0.001 sec
    [junit] Running org.apache.qpid.disttest.results.aggregation.TestResultAggregatorTest
    [junit] Tests run: 4, Failures: 0, Errors: 0, Time elapsed: 0.003 sec
    [junit] Running org.apache.qpid.disttest.results.formatting.CSVFormatterTest
    [junit] Tests run: 1, Failures: 0, Errors: 0, Time elapsed: 0.002 sec
    [junit] Running org.apache.qpid.disttest.results.formatting.CSVOrderParticipantResultComparatorTest
    [junit] Tests run: 6, Failures: 0, Errors: 0, Time elapsed: 0.008 sec
    [junit] Running org.apache.qpid.systest.disttest.QpidQueueCreatorTest
    [junit] Tests run: 3, Failures: 0, Errors: 0, Time elapsed: 1.498 sec
    [junit] Running org.apache.qpid.systest.disttest.clientonly.BasicDistributedClientTest
    [junit] Tests run: 5, Failures: 0, Errors: 0, Time elapsed: 0.568 sec
    [junit] Running org.apache.qpid.systest.disttest.clientonly.ConsumerParticipantTest
    [junit] Tests run: 3, Failures: 0, Errors: 0, Time elapsed: 6.639 sec
    [junit] Running org.apache.qpid.systest.disttest.clientonly.DistributedClientTest
    [junit] Tests run: 9, Failures: 0, Errors: 0, Time elapsed: 2.012 sec
    [junit] Running org.apache.qpid.systest.disttest.clientonly.MessageProviderTest
    [junit] Tests run: 2, Failures: 0, Errors: 0, Time elapsed: 0.218 sec
    [junit] Running org.apache.qpid.systest.disttest.clientonly.ProducerParticipantTest
    [junit] Tests run: 1, Failures: 0, Errors: 0, Time elapsed: 0.586 sec
    [junit] Running org.apache.qpid.systest.disttest.controllerandclient.ControllerAndClientTest
    [junit] Tests run: 5, Failures: 0, Errors: 0, Time elapsed: 2.375 sec
    [junit] Running org.apache.qpid.systest.disttest.controlleronly.DistributedControllerTest
    [junit] Tests run: 1, Failures: 0, Errors: 0, Time elapsed: 1.084 sec
    [junit] Running org.apache.qpid.systest.disttest.endtoend.EndToEndTest
    [junit] Tests run: 1, Failures: 0, Errors: 0, Time elapsed: 4.55 sec
     [echo] Running ant for module : perftests

touch-failed:

BUILD FAILED
<https://builds.apache.org/job/Qpid-Java-Java-Test-JDK1.7/ws/trunk/qpid/java/build.xml>:107:
TEST SUITE FAILED

Total time: 21 minutes 34 seconds
Build step 'Invoke Ant' marked build as failure
[locks-and-latches] Releasing all the locks
[locks-and-latches] All the locks released
Recording test results

Mime
View raw message