qpid-notifications mailing list archives

Site index · List index
Message view « Date » · « Thread »
Top « Date » · « Thread »
From Apache Jenkins Server <jenk...@builds.apache.org>
Subject Build failed in Jenkins: Qpid-Java-Java-Test-IBMJDK1.6 #590
Date Sat, 19 Oct 2013 09:58:56 GMT
See <https://builds.apache.org/job/Qpid-Java-Java-Test-IBMJDK1.6/590/changes>

Changes:

[tross] QPID-5216 - Fixed a possible mutex problem where a value might be used after it was
freed.

[tross] QPID-5216
  - Fixed propagation of the deletion of locally-attached mobile addresses
  - Changed 'global' address class to 'mobile' to be consistent

------------------------------------------
[...truncated 4813 lines...]
    [junit] Running org.apache.qpid.test.unit.client.QueueSessionFactoryTest
    [junit] Tests run: 5, Failures: 0, Errors: 0, Time elapsed: 0.163 sec
    [junit] Running org.apache.qpid.test.unit.client.TopicSessionFactoryTest
    [junit] Tests run: 4, Failures: 0, Errors: 0, Time elapsed: 0.603 sec
    [junit] Running org.apache.qpid.test.unit.client.channelclose.CloseWithBlockingReceiveTest
    [junit] Tests run: 1, Failures: 0, Errors: 0, Time elapsed: 1.032 sec
    [junit] Running org.apache.qpid.test.unit.client.connection.BrokerClosesClientConnectionTest
    [junit] Tests run: 3, Failures: 0, Errors: 0, Time elapsed: 12.141 sec
    [junit] Running org.apache.qpid.test.unit.client.connection.ConnectionFactoryTest
    [junit] Tests run: 2, Failures: 0, Errors: 0, Time elapsed: 0.072 sec
    [junit] Running org.apache.qpid.test.unit.client.connection.ConnectionStartTest
    [junit] Tests run: 2, Failures: 0, Errors: 0, Time elapsed: 0.081 sec
    [junit] Running org.apache.qpid.test.unit.client.connection.ConnectionTest
    [junit] Tests run: 12, Failures: 0, Errors: 0, Time elapsed: 0.401 sec
    [junit] Running org.apache.qpid.test.unit.client.connection.ExceptionListenerTest
    [junit] Tests run: 3, Failures: 0, Errors: 0, Time elapsed: 0.098 sec
    [junit] Running org.apache.qpid.test.unit.client.message.ObjectMessageTest
    [junit] Tests run: 10, Failures: 0, Errors: 0, Time elapsed: 0.356 sec
    [junit] Running org.apache.qpid.test.unit.client.protocol.AMQProtocolSessionTest
    [junit] Tests run: 5, Failures: 0, Errors: 0, Time elapsed: 0.165 sec
    [junit] Running org.apache.qpid.test.unit.client.temporaryqueue.TemporaryQueueTest
    [junit] Tests run: 4, Failures: 0, Errors: 0, Time elapsed: 0.134 sec
    [junit] Running org.apache.qpid.test.unit.close.JavaServerCloseRaceConditionTest
    [junit] Tests run: 0, Failures: 0, Errors: 0, Time elapsed: 0.001 sec
    [junit] Running org.apache.qpid.test.unit.close.MessageConsumerCloseTest
    [junit] Tests run: 1, Failures: 0, Errors: 0, Time elapsed: 0.044 sec
    [junit] Running org.apache.qpid.test.unit.close.MessageRequeueTest
    [junit] Tests run: 3, Failures: 0, Errors: 0, Time elapsed: 16.436 sec
    [junit] Running org.apache.qpid.test.unit.close.TopicPublisherCloseTest
    [junit] Tests run: 1, Failures: 0, Errors: 0, Time elapsed: 3.029 sec
    [junit] Running org.apache.qpid.test.unit.ct.DurableSubscriberTest
    [junit] Tests run: 0, Failures: 0, Errors: 0, Time elapsed: 0.002 sec
    [junit] Running org.apache.qpid.test.unit.message.JMSPropertiesTest
    [junit] Tests run: 2, Failures: 0, Errors: 0, Time elapsed: 0.077 sec
    [junit] Running org.apache.qpid.test.unit.message.StreamMessageTest
    [junit] Tests run: 2, Failures: 0, Errors: 0, Time elapsed: 0.078 sec
    [junit] Running org.apache.qpid.test.unit.message.UTF8Test
    [junit] Tests run: 2, Failures: 0, Errors: 0, Time elapsed: 0.077 sec
    [junit] Running org.apache.qpid.test.unit.topic.DurableSubscriptionTest
    [junit] Tests run: 17, Failures: 0, Errors: 0, Time elapsed: 28.868 sec
    [junit] Running org.apache.qpid.test.unit.topic.TemporaryTopicTest
    [junit] Tests run: 5, Failures: 0, Errors: 0, Time elapsed: 0.175 sec
    [junit] Running org.apache.qpid.test.unit.topic.TopicPublisherTest
    [junit] Tests run: 1, Failures: 0, Errors: 0, Time elapsed: 0.042 sec
    [junit] Running org.apache.qpid.test.unit.topic.TopicSessionTest
    [junit] Tests run: 9, Failures: 0, Errors: 0, Time elapsed: 9.951 sec
    [junit] Running org.apache.qpid.test.unit.transacted.CommitRollbackTest
    [junit] Tests run: 12, Failures: 0, Errors: 0, Time elapsed: 15.83 sec
    [junit] Running org.apache.qpid.test.unit.transacted.TransactedTest
    [junit] Tests run: 7, Failures: 0, Errors: 0, Time elapsed: 7.913 sec
    [junit] Running org.apache.qpid.test.unit.transacted.TransactionTimeoutDisabledTest
    [junit] Tests run: 2, Failures: 0, Errors: 0, Time elapsed: 3.579 sec
    [junit] Running org.apache.qpid.test.unit.transacted.TransactionTimeoutTest
    [junit] Tests run: 15, Failures: 2, Errors: 0, Time elapsed: 69.651 sec
    [junit] TEST org.apache.qpid.test.unit.transacted.TransactionTimeoutTest FAILED
    [junit] Running org.apache.qpid.test.unit.xa.FaultTest
    [junit] Tests run: 10, Failures: 0, Errors: 0, Time elapsed: 50.22 sec
    [junit] Running org.apache.qpid.test.unit.xa.QueueTest
    [junit] Tests run: 1, Failures: 0, Errors: 0, Time elapsed: 1.058 sec
    [junit] Running org.apache.qpid.test.unit.xa.TopicTest
    [junit] Tests run: 4, Failures: 0, Errors: 0, Time elapsed: 4.352 sec
    [junit] Running org.apache.qpid.test.utils.BrokerCommandHelperTest
    [junit] Tests run: 2, Failures: 0, Errors: 0, Time elapsed: 0.014 sec
    [junit] Running org.apache.qpid.util.LogMonitorTest
    [junit] Tests run: 9, Failures: 0, Errors: 0, Time elapsed: 2.008 sec
    [junit] Tests FAILED
     [echo] Running ant for module : systests

touch-failed:
    [touch] Creating <https://builds.apache.org/job/Qpid-Java-Java-Test-IBMJDK1.6/ws/trunk/qpid/java/build/results/systests/FAILED>
    [touch] Creating <https://builds.apache.org/job/Qpid-Java-Java-Test-IBMJDK1.6/ws/trunk/qpid/java/build/results/FAILED>
     [echo] Running ant for module : perftests

prepare:

precompile:

compile:
     [echo] Targeting : 1.6

copy-extra-resources:

copy-resources:
     [echo] Copying resources from <https://builds.apache.org/job/Qpid-Java-Java-Test-IBMJDK1.6/ws/trunk/qpid/java/perftests/src/main/resources>
to <https://builds.apache.org/job/Qpid-Java-Java-Test-IBMJDK1.6/ws/trunk/qpid/java/build/scratch/perftests/classes...>

copy-project-resources-metainf:

copy-module-resources-metainf:

copy-module-src-resources-metainf:

copy-files-to-module-metainf:

jar.manifest:

jar.nomanifest:

jar:

precompile-tests:

compile-tests:

copy-test-resources:

jar-tests:

jar-sources:

libs:

copy-bin:

copy-etc:

postbuild:

copy-broker-plugin-jars-deps:

copy-broker-plugin-jars:

build:

test:
     [echo] Using profile:java-mms.0-10
    [junit] Running org.apache.qpid.disttest.ArgumentParserTest
    [junit] Tests run: 3, Failures: 0, Errors: 0, Time elapsed: 0.04 sec
    [junit] Running org.apache.qpid.disttest.ConfigFileHelperTest
    [junit] Tests run: 1, Failures: 0, Errors: 0, Time elapsed: 0.015 sec
    [junit] Running org.apache.qpid.disttest.ResultsFileWriterTest
    [junit] Tests run: 2, Failures: 0, Errors: 0, Time elapsed: 0.042 sec
    [junit] Running org.apache.qpid.disttest.VisitorTest
    [junit] Tests run: 3, Failures: 0, Errors: 0, Time elapsed: 0.012 sec
    [junit] Running org.apache.qpid.disttest.client.ClientCommandVisitorTest
    [junit] Tests run: 8, Failures: 0, Errors: 0, Time elapsed: 0.085 sec
    [junit] Running org.apache.qpid.disttest.client.ClientTest
    [junit] Tests run: 8, Failures: 0, Errors: 0, Time elapsed: 0.58 sec
    [junit] Running org.apache.qpid.disttest.client.ConsumerParticipantTest
    [junit] Tests run: 7, Failures: 0, Errors: 0, Time elapsed: 0.16 sec
    [junit] Running org.apache.qpid.disttest.client.MessageProviderTest
    [junit] Tests run: 3, Failures: 0, Errors: 0, Time elapsed: 0.106 sec
    [junit] Running org.apache.qpid.disttest.client.ParticipantExecutorTest
    [junit] Tests run: 4, Failures: 0, Errors: 0, Time elapsed: 0.025 sec
    [junit] Running org.apache.qpid.disttest.client.ParticipantRegistryTest
    [junit] Tests run: 2, Failures: 0, Errors: 0, Time elapsed: 0.003 sec
    [junit] Running org.apache.qpid.disttest.client.ParticipantResultFactoryTest
    [junit] Tests run: 3, Failures: 0, Errors: 0, Time elapsed: 0.003 sec
    [junit] Running org.apache.qpid.disttest.client.ProducerParticipantTest
    [junit] Tests run: 9, Failures: 0, Errors: 0, Time elapsed: 4.569 sec
    [junit] Running org.apache.qpid.disttest.client.property.ListPropertyValueTest
    [junit] Tests run: 3, Failures: 0, Errors: 0, Time elapsed: 0.003 sec
    [junit] Running org.apache.qpid.disttest.client.property.PropertyValueFactoryTest
    [junit] Tests run: 5, Failures: 0, Errors: 0, Time elapsed: 0.005 sec
    [junit] Running org.apache.qpid.disttest.client.property.RandomPropertyValueTest
    [junit] Tests run: 5, Failures: 0, Errors: 0, Time elapsed: 0.004 sec
    [junit] Running org.apache.qpid.disttest.client.property.RangePropertyValueTest
    [junit] Tests run: 8, Failures: 0, Errors: 0, Time elapsed: 0.005 sec
    [junit] Running org.apache.qpid.disttest.client.property.SimplePropertyValueTest
    [junit] Tests run: 1, Failures: 0, Errors: 0, Time elapsed: 0.002 sec
    [junit] Running org.apache.qpid.disttest.client.utils.ExecutorWithNoLimitsTest
    [junit] Tests run: 2, Failures: 0, Errors: 0, Time elapsed: 0.003 sec
    [junit] Running org.apache.qpid.disttest.client.utils.ExecutorWithTimeLimitTest
    [junit] Tests run: 4, Failures: 0, Errors: 0, Time elapsed: 0.506 sec
    [junit] Running org.apache.qpid.disttest.controller.ClientRegistryTest
    [junit] Tests run: 8, Failures: 0, Errors: 0, Time elapsed: 3.778 sec
    [junit] Thread-12 2013-10-19 09:57:52,406 INFO [qpid.disttest.controller.ClientRegistry]
Client registered: CLIENT2_REGISTERED_NAME
    [junit] Thread-13 2013-10-19 09:57:52,407 INFO [qpid.disttest.controller.ClientRegistry]
Client registered: CLIENT3_REGISTERED_NAME
    [junit] Running org.apache.qpid.disttest.controller.ControllerTest
    [junit] Tests run: 6, Failures: 0, Errors: 0, Time elapsed: 0.048 sec
    [junit] Running org.apache.qpid.disttest.controller.ParticipatingClientsTest
    [junit] Tests run: 5, Failures: 0, Errors: 0, Time elapsed: 0.005 sec
    [junit] Running org.apache.qpid.disttest.controller.TestRunnerTest
    [junit] Tests run: 6, Failures: 0, Errors: 0, Time elapsed: 1.123 sec
    [junit] Running org.apache.qpid.disttest.controller.config.ClientConfigTest
    [junit] Tests run: 4, Failures: 0, Errors: 0, Time elapsed: 0.009 sec
    [junit] Running org.apache.qpid.disttest.controller.config.ConfigReaderTest
    [junit] Tests run: 5, Failures: 0, Errors: 0, Time elapsed: 0.653 sec
    [junit] Running org.apache.qpid.disttest.controller.config.ConfigTest
    [junit] Tests run: 1, Failures: 0, Errors: 0, Time elapsed: 6.329 sec
    [junit] Running org.apache.qpid.disttest.controller.config.ConnectionConfigTest
    [junit] Tests run: 3, Failures: 0, Errors: 0, Time elapsed: 0.009 sec
    [junit] Running org.apache.qpid.disttest.controller.config.ConsumerConfigTest
    [junit] Tests run: 2, Failures: 0, Errors: 0, Time elapsed: 0.004 sec
    [junit] Running org.apache.qpid.disttest.controller.config.IterationValueTest
    [junit] Tests run: 3, Failures: 0, Errors: 0, Time elapsed: 0.026 sec
    [junit] Running org.apache.qpid.disttest.controller.config.JavaScriptConfigEvaluatorTest
    [junit] Tests run: 1, Failures: 0, Errors: 0, Time elapsed: 0.032 sec
    [junit] Running org.apache.qpid.disttest.controller.config.MessageProviderConfigTest
    [junit] Tests run: 2, Failures: 0, Errors: 0, Time elapsed: 0.003 sec
    [junit] Running org.apache.qpid.disttest.controller.config.ParticipantConfigTest
    [junit] Tests run: 1, Failures: 0, Errors: 0, Time elapsed: 0.006 sec
    [junit] Running org.apache.qpid.disttest.controller.config.ProducerConfigTest
    [junit] Tests run: 3, Failures: 0, Errors: 0, Time elapsed: 0.002 sec
    [junit] Running org.apache.qpid.disttest.controller.config.SessionConfigTest
    [junit] Tests run: 3, Failures: 0, Errors: 0, Time elapsed: 0.014 sec
    [junit] Running org.apache.qpid.disttest.controller.config.TestConfigTest
    [junit] Tests run: 5, Failures: 0, Errors: 0, Time elapsed: 0.007 sec
    [junit] Running org.apache.qpid.disttest.controller.config.TestInstanceTest
    [junit] Tests run: 3, Failures: 0, Errors: 0, Time elapsed: 0.006 sec
    [junit] Running org.apache.qpid.disttest.db.ResultsDbWriterTest
    [junit] Tests run: 2, Failures: 0, Errors: 0, Time elapsed: 18.149 sec
    [junit] Running org.apache.qpid.disttest.jms.JmsMessageAdaptorTest
    [junit] Tests run: 1, Failures: 0, Errors: 0, Time elapsed: 0.003 sec
    [junit] Running org.apache.qpid.disttest.message.JsonHandlerTest
    [junit] Tests run: 2, Failures: 0, Errors: 0, Time elapsed: 0.016 sec
    [junit] Running org.apache.qpid.disttest.message.ParticipantResultTest
    [junit] Tests run: 3, Failures: 0, Errors: 0, Time elapsed: 0.062 sec
    [junit] Running org.apache.qpid.disttest.results.aggregation.AggregatorTest
    [junit] Tests run: 1, Failures: 0, Errors: 0, Time elapsed: 0.008 sec
    [junit] Running org.apache.qpid.disttest.results.aggregation.ParticipantResultAggregatorTest
    [junit] Tests run: 14, Failures: 0, Errors: 0, Time elapsed: 0.005 sec
    [junit] Running org.apache.qpid.disttest.results.aggregation.SeriesStatisticsTest
    [junit] Tests run: 1, Failures: 0, Errors: 0, Time elapsed: 0.002 sec
    [junit] Running org.apache.qpid.disttest.results.aggregation.TestResultAggregatorTest
    [junit] Tests run: 4, Failures: 0, Errors: 0, Time elapsed: 0.004 sec
    [junit] Running org.apache.qpid.disttest.results.formatting.CSVFormatterTest
    [junit] Tests run: 1, Failures: 0, Errors: 0, Time elapsed: 0.004 sec
    [junit] Running org.apache.qpid.disttest.results.formatting.CSVOrderParticipantResultComparatorTest
    [junit] Tests run: 6, Failures: 0, Errors: 0, Time elapsed: 0.011 sec
    [junit] Running org.apache.qpid.systest.disttest.QpidQueueCreatorTest
    [junit] Tests run: 3, Failures: 0, Errors: 0, Time elapsed: 1.086 sec
    [junit] Running org.apache.qpid.systest.disttest.clientonly.BasicDistributedClientTest
    [junit] Tests run: 5, Failures: 0, Errors: 0, Time elapsed: 0.523 sec
    [junit] Running org.apache.qpid.systest.disttest.clientonly.ConsumerParticipantTest
    [junit] Tests run: 3, Failures: 0, Errors: 0, Time elapsed: 6.418 sec
    [junit] Running org.apache.qpid.systest.disttest.clientonly.DistributedClientTest
    [junit] Tests run: 9, Failures: 0, Errors: 0, Time elapsed: 0.832 sec
    [junit] Running org.apache.qpid.systest.disttest.clientonly.MessageProviderTest
    [junit] Tests run: 2, Failures: 0, Errors: 0, Time elapsed: 0.127 sec
    [junit] Running org.apache.qpid.systest.disttest.clientonly.ProducerParticipantTest
    [junit] Tests run: 1, Failures: 0, Errors: 0, Time elapsed: 0.571 sec
    [junit] Running org.apache.qpid.systest.disttest.controllerandclient.ControllerAndClientTest
    [junit] Tests run: 5, Failures: 0, Errors: 0, Time elapsed: 2.171 sec
    [junit] Running org.apache.qpid.systest.disttest.controlleronly.DistributedControllerTest
    [junit] Tests run: 1, Failures: 0, Errors: 0, Time elapsed: 1.073 sec
    [junit] Running org.apache.qpid.systest.disttest.endtoend.EndToEndTest
    [junit] Tests run: 1, Failures: 0, Errors: 0, Time elapsed: 0.765 sec
     [echo] Running ant for module : perftests

touch-failed:

BUILD FAILED
<https://builds.apache.org/job/Qpid-Java-Java-Test-IBMJDK1.6/ws/trunk/qpid/java/build.xml>:107:
TEST SUITE FAILED

Total time: 19 minutes 57 seconds
Build step 'Invoke Ant' marked build as failure
[locks-and-latches] Releasing all the locks
[locks-and-latches] All the locks released
Recording test results

Mime
View raw message