qpid-notifications mailing list archives

Site index · List index
Message view « Date » · « Thread »
Top « Date » · « Thread »
From Apache Jenkins Server <jenk...@builds.apache.org>
Subject Build failed in Jenkins: Qpid-proton-j #470
Date Tue, 15 Oct 2013 17:50:20 GMT
See <https://builds.apache.org/job/Qpid-proton-j/470/changes>

Changes:

[rhs] PROTON-440: removed accidental println

[rhs] PROTON-200: modified messenger's credit distribution algorithm to cope with credit scarce
scenarios

------------------------------------------
[...truncated 1481 lines...]
proton_tests.codec.DataTest.testDecimal32 ............................... pass
proton_tests.codec.DataTest.testDecimal64 ............................... pass
proton_tests.codec.DataTest.testDescribedEmptyArray ..................... pass
proton_tests.codec.DataTest.testDescribedStringArray .................... pass
proton_tests.codec.DataTest.testDouble .................................. pass
proton_tests.codec.DataTest.testEmptyArray .............................. pass
proton_tests.codec.DataTest.testEnterExit ............................... pass
proton_tests.codec.DataTest.testFloat ................................... pass
proton_tests.codec.DataTest.testInt ..................................... pass
proton_tests.codec.DataTest.testIntArray ................................ pass
proton_tests.codec.DataTest.testLookup .................................. skip
  ProtonUnsupportedOperationException: org.apache.qpid.proton.ProtonUnsupportedOperationException
proton_tests.codec.DataTest.testNestedNext .............................. pass
proton_tests.codec.DataTest.testRoundTrip ............................... pass
proton_tests.codec.DataTest.testString .................................. pass
proton_tests.codec.DataTest.testStringArray ............................. pass
proton_tests.codec.DataTest.testSymbol .................................. pass
proton_tests.codec.DataTest.testTimestamp ............................... pass
proton_tests.codec.DataTest.testTopLevelNext ............................ pass
proton_tests.codec.DataTest.testUUID .................................... pass
proton_tests.codec.DataTest.testUUIDArray ............................... pass
proton_tests.engine.ConnectionTest.test_capabilities .................... pass
proton_tests.engine.ConnectionTest.test_condition ....................... pass
proton_tests.engine.ConnectionTest.test_open_close ...................... pass
proton_tests.engine.ConnectionTest.test_properties ...................... pass
proton_tests.engine.ConnectionTest.test_simultaneous_open_close ......... pass
proton_tests.engine.CreditTest.testBufferingOnCloseConnectionConnection . pass
proton_tests.engine.CreditTest.testBufferingOnCloseConnectionLink ....... pass
proton_tests.engine.CreditTest.testBufferingOnCloseConnectionSession .... pass
proton_tests.engine.CreditTest.testBufferingOnCloseLinkConnection ....... pass
proton_tests.engine.CreditTest.testBufferingOnCloseLinkLink ............. pass
proton_tests.engine.CreditTest.testBufferingOnCloseLinkSession .......... pass
proton_tests.engine.CreditTest.testBufferingOnCloseSessionConnection .... pass
proton_tests.engine.CreditTest.testBufferingOnCloseSessionLink .......... pass
proton_tests.engine.CreditTest.testBufferingOnCloseSessionSession ....... pass
proton_tests.engine.CreditTest.testCreditReceiver ....................... pass
proton_tests.engine.CreditTest.testCreditSender ......................... pass
proton_tests.engine.CreditTest.testDrainFlow ............................ pass
proton_tests.engine.CreditTest.testDrainOrder ........................... pass
proton_tests.engine.CreditTest.testDrainZero ............................ pass
proton_tests.engine.CreditTest.testFullDrain ............................ pass
proton_tests.engine.CreditTest.testHeadOfLineBlocking ................... pass
proton_tests.engine.CreditTest.testNegative ............................. pass
proton_tests.engine.CreditTest.testPartialDrain ......................... pass
proton_tests.engine.CreditTest.testPushback ............................. pass
proton_tests.engine.DeliveryTest.testCustom ............................. skip
  Skipped
proton_tests.engine.DeliveryTest.testDisposition ........................ pass
proton_tests.engine.DeliveryTest.testModified ........................... pass
proton_tests.engine.DeliveryTest.testReceived ........................... pass
proton_tests.engine.DeliveryTest.testRejected ........................... pass
proton_tests.engine.DeliveryTest.testReleased ........................... pass
proton_tests.engine.IdleTimeoutTest.testGetSet .......................... skip
  ProtonUnsupportedOperationException: org.apache.qpid.proton.ProtonUnsupportedOperationException:
Transport.idle_timeout
proton_tests.engine.IdleTimeoutTest.testTimeout ......................... skip
  ProtonUnsupportedOperationException: org.apache.qpid.proton.ProtonUnsupportedOperationException:
Transport.idle_timeout
proton_tests.engine.LinkTest.test_closing_connection .................... pass
proton_tests.engine.LinkTest.test_closing_session ....................... pass
proton_tests.engine.LinkTest.test_condition ............................. pass
proton_tests.engine.LinkTest.test_distribution_mode ..................... pass
proton_tests.engine.LinkTest.test_dynamic_link .......................... pass
proton_tests.engine.LinkTest.test_multiple .............................. pass
proton_tests.engine.LinkTest.test_open_close ............................ pass
proton_tests.engine.LinkTest.test_settle_mode ........................... pass
proton_tests.engine.LinkTest.test_simultaneous_open_close ............... pass
proton_tests.engine.LinkTest.test_source ................................ pass
proton_tests.engine.LinkTest.test_source_target ......................... pass
proton_tests.engine.LinkTest.test_source_target_full .................... skip
  ProtonUnsupportedOperationException: org.apache.qpid.proton.ProtonUnsupportedOperationException:
Data.put_array
proton_tests.engine.LinkTest.test_target ................................ pass
proton_tests.engine.MaxFrameTransferTest.testBigMessage ................. pass
proton_tests.engine.MaxFrameTransferTest.testMinFrame ................... pass
proton_tests.engine.MaxFrameTransferTest.testOddFrame ................... pass
proton_tests.engine.PipelineTest.test ................................... pass
proton_tests.engine.ServerTest.testIdleTimeout .......................... skip
  ProtonUnsupportedOperationException: org.apache.qpid.proton.ProtonUnsupportedOperationException:
Driver
proton_tests.engine.ServerTest.testKeepalive ............................ skip
  ProtonUnsupportedOperationException: org.apache.qpid.proton.ProtonUnsupportedOperationException:
Driver
proton_tests.engine.SessionCreditTest.testBuffering ..................... pass
proton_tests.engine.SessionCreditTest.testBufferingSize1023 ............. pass
proton_tests.engine.SessionCreditTest.testBufferingSize1025 ............. pass
proton_tests.engine.SessionCreditTest.testBufferingSize1059 ............. pass
proton_tests.engine.SessionCreditTest.testBufferingSize16 ............... pass
proton_tests.engine.SessionCreditTest.testBufferingSize2048 ............. pass
proton_tests.engine.SessionCreditTest.testBufferingSize256 .............. pass
proton_tests.engine.SessionCreditTest.testBufferingSize512 .............. pass
proton_tests.engine.SessionCreditTest.testBufferingSize989 .............. pass
proton_tests.engine.SessionCreditTest.testCreditWithBuffering ........... pass
proton_tests.engine.SessionTest.test_closing_connection ................. pass
proton_tests.engine.SessionTest.test_condition .......................... pass
proton_tests.engine.SessionTest.test_open_close ......................... pass
proton_tests.engine.SessionTest.test_simultaneous_close ................. pass
proton_tests.engine.SettlementTest.testMultipleUnsettled ................ pass
proton_tests.engine.SettlementTest.testMultipleUnsettled1K2K ............ pass
proton_tests.engine.SettlementTest.testMultipleUnsettled2K1K ............ pass
proton_tests.engine.SettlementTest.testMultipleUnsettled2K2K ............ pass
proton_tests.engine.SettlementTest.testMultipleUnsettled4K1K ............ pass
proton_tests.engine.SettlementTest.testMultipleUnsettled4K2K ............ pass
proton_tests.engine.SettlementTest.testSettleCurrent .................... pass
proton_tests.engine.SettlementTest.testUnsettled ........................ pass
proton_tests.engine.TransferTest.test_delivery_id_ordering .............. pass
proton_tests.engine.TransferTest.test_disposition ....................... pass
proton_tests.engine.TransferTest.test_multiframe ........................ pass
proton_tests.engine.TransferTest.test_work_queue ........................ pass
proton_tests.interop.InteropTest.test_arrays ............................ pass
proton_tests.interop.InteropTest.test_described ......................... pass
proton_tests.interop.InteropTest.test_described_array ................... pass
proton_tests.interop.InteropTest.test_lists ............................. pass
proton_tests.interop.InteropTest.test_maps .............................. pass
proton_tests.interop.InteropTest.test_message ........................... pass
proton_tests.interop.InteropTest.test_primitives ........................ pass
proton_tests.interop.InteropTest.test_strings ........................... pass
proton_tests.message.AccessorsTest.testAddress .......................... pass
proton_tests.message.AccessorsTest.testContentEncoding .................. pass
proton_tests.message.AccessorsTest.testContentType ...................... pass
proton_tests.message.AccessorsTest.testCorrelationId .................... pass
proton_tests.message.AccessorsTest.testCreationTime ..................... pass
proton_tests.message.AccessorsTest.testDeliveryCount .................... pass
proton_tests.message.AccessorsTest.testDurable .......................... pass
proton_tests.message.AccessorsTest.testExpiryTime ....................... pass
proton_tests.message.AccessorsTest.testFirstAquirer ..................... pass
proton_tests.message.AccessorsTest.testGroupId .......................... pass
proton_tests.message.AccessorsTest.testGroupSequence .................... pass
proton_tests.message.AccessorsTest.testId ............................... pass
proton_tests.message.AccessorsTest.testPriority ......................... pass
proton_tests.message.AccessorsTest.testReplyTo .......................... pass
proton_tests.message.AccessorsTest.testReplyToGroupId ................... pass
proton_tests.message.AccessorsTest.testSubject .......................... pass
proton_tests.message.AccessorsTest.testTtl .............................. pass
proton_tests.message.AccessorsTest.testUserId ........................... pass
proton_tests.message.CodecTest.testRoundTrip ............................ pass
proton_tests.message.LoadSaveTest.testBinary ............................ pass
proton_tests.message.LoadSaveTest.testData .............................. pass
proton_tests.message.LoadSaveTest.testDescriptor ........................ pass
proton_tests.message.LoadSaveTest.testFloating .......................... pass
proton_tests.message.LoadSaveTest.testIntegral .......................... pass
proton_tests.message.LoadSaveTest.testList .............................. pass
proton_tests.message.LoadSaveTest.testMap ............................... pass
proton_tests.message.LoadSaveTest.testString ............................ pass
proton_tests.message.LoadSaveTest.testSymbol ............................ pass
proton_tests.message.LoadSaveTest.testText .............................. pass
proton_tests.message.LoadSaveTest.testTextLoadNone ...................... pass
proton_tests.messenger.MessengerTest.testCreditBlockingRebalance ........ skip
  Skipped: Skipping testCreditBlockingRebalance - credit scheduler TBD for Java Messenger
proton_tests.messenger.MessengerTest.testDefaultRewriteH ................ pass
proton_tests.messenger.MessengerTest.testDefaultRewriteHN ............... pass
proton_tests.messenger.MessengerTest.testDefaultRewriteHP ............... pass
proton_tests.messenger.MessengerTest.testDefaultRewriteHPN .............. pass
proton_tests.messenger.MessengerTest.testDefaultRewriteSH ............... pass
proton_tests.messenger.MessengerTest.testDefaultRewriteSHN .............. pass
proton_tests.messenger.MessengerTest.testDefaultRewriteSHP .............. pass
proton_tests.messenger.MessengerTest.testDefaultRewriteSHPN ............. pass
proton_tests.messenger.MessengerTest.testDefaultRewriteSUH .............. pass
proton_tests.messenger.MessengerTest.testDefaultRewriteSUHN ............. pass
proton_tests.messenger.MessengerTest.testDefaultRewriteSUHP ............. pass
proton_tests.messenger.MessengerTest.testDefaultRewriteSUHPN ............ pass
proton_tests.messenger.MessengerTest.testDefaultRewriteSUPH ............. pass
proton_tests.messenger.MessengerTest.testDefaultRewriteSUPHN ............ pass
proton_tests.messenger.MessengerTest.testDefaultRewriteSUPHP ............ pass
proton_tests.messenger.MessengerTest.testDefaultRewriteSUPHPN ........... pass
proton_tests.messenger.MessengerTest.testDefaultRewriteUH ............... pass
proton_tests.messenger.MessengerTest.testDefaultRewriteUHN .............. pass
proton_tests.messenger.MessengerTest.testDefaultRewriteUHP .............. pass
proton_tests.messenger.MessengerTest.testDefaultRewriteUHPN ............. pass
proton_tests.messenger.MessengerTest.testDefaultRewriteUPH .............. pass
proton_tests.messenger.MessengerTest.testDefaultRewriteUPHN ............. pass
proton_tests.messenger.MessengerTest.testDefaultRewriteUPHP ............. pass
proton_tests.messenger.MessengerTest.testDefaultRewriteUPHPN ............ pass
proton_tests.messenger.MessengerTest.testDefaultRoute ................... pass
proton_tests.messenger.MessengerTest.testDefaultRouteSubstitution ....... pass
proton_tests.messenger.MessengerTest. \
    testIncomingQueueBiggerThanSessionWindow ............................ pass
proton_tests.messenger.MessengerTest.testIncomingQueueBiggerThanWindow .. pass
proton_tests.messenger.MessengerTest.testIncomingRoute .................. pass
proton_tests.messenger.MessengerTest.testIncomingWindow ................. pass
proton_tests.messenger.MessengerTest.testOutgoingWindow ................. pass
proton_tests.messenger.MessengerTest.testReject ......................... pass
proton_tests.messenger.MessengerTest.testRejectIndividual ............... pass
proton_tests.messenger.MessengerTest.testRewrite ........................ pass
proton_tests.messenger.MessengerTest.testRewriteOverrideDefault ......... pass
proton_tests.messenger.MessengerTest.testRewritePattern ................. pass
proton_tests.messenger.MessengerTest.testRewriteSupress ................. pass
proton_tests.messenger.MessengerTest.testRewriteToAt .................... pass
proton_tests.messenger.MessengerTest.testRoute .......................... pass
proton_tests.messenger.MessengerTest.testSendReceive .................... pass
proton_tests.messenger.MessengerTest.testSendReceive100K ................ pass
proton_tests.messenger.MessengerTest.testSendReceive10K ................. pass
proton_tests.messenger.MessengerTest.testSendReceive1K .................. pass
proton_tests.messenger.MessengerTest.testSendReceive1M .................. pass
proton_tests.messenger.MessengerTest.testSendReceive2K .................. pass
proton_tests.messenger.MessengerTest.testSendReceive4K .................. pass
proton_tests.messenger.MessengerTest.testUnlimitedCredit ................ pass
proton_tests.messenger.MessengerTest.test_proton222 ..................... pass
proton_tests.messenger.NBMessengerTest.testCreditAutoBackpressure ....... pass
proton_tests.messenger.NBMessengerTest.testCreditReclaim ................ skip
  Skipped: Skipping testCreditReclaim - credit scheduler TBD for Java Messenger
proton_tests.messenger.NBMessengerTest.testCreditRedistribution ......... skip
  Skipped: Skipping testCreditRedistribution - credit scheduler TBD for Java Messenger
proton_tests.messenger.NBMessengerTest.testCreditReplenish .............. skip
  Skipped: Skipping testCreditReplenish - credit scheduler TBD for Java Messenger
proton_tests.messenger.NBMessengerTest.testPushback ..................... pass
proton_tests.messenger.NBMessengerTest.testRecvBeforeSubscribe .......... pass
proton_tests.messenger.NBMessengerTest.testSmoke ........................ pass
proton_tests.messenger.NBMessengerTest.testSmoke1024 .................... pass
proton_tests.messenger.NBMessengerTest.testSmoke4096 .................... pass
proton_tests.sasl.SaslTest.testChallengeResponse ........................ pass
proton_tests.sasl.SaslTest.testFracturedSASL ............................ pass
proton_tests.sasl.SaslTest.testInitialResponse .......................... pass
proton_tests.sasl.SaslTest.testPipelined ................................ pass
proton_tests.sasl.SaslTest.testPipelined2 ............................... pass
proton_tests.sasl.SaslTest.testSaslAndAmqpInSingleChunk ................. pass
proton_tests.ssl.SslTest. \
    test_allow_unsecured_client_which_connects_secured .................. pass
proton_tests.ssl.SslTest. \
    test_allow_unsecured_client_which_connects_unsecured ................ pass
proton_tests.ssl.SslTest.test_bad_server_certificate .................... pass
proton_tests.ssl.SslTest.test_client_authentication ..................... pass
proton_tests.ssl.SslTest.test_client_authentication_fail_bad_cert ....... pass
proton_tests.ssl.SslTest.test_client_authentication_fail_no_cert ........ pass
proton_tests.ssl.SslTest.test_client_server_authentication .............. pass
proton_tests.ssl.SslTest.test_defaults .................................. pass
proton_tests.ssl.SslTest.test_disallow_unsecured_client ................. pass
proton_tests.ssl.SslTest.test_multiple_sessions ......................... pass
proton_tests.ssl.SslTest.test_server_authentication ..................... pass
proton_tests.ssl.SslTest.test_server_certificate ........................ pass
proton_tests.ssl.SslTest.test_server_hostname_authentication ............ skip
  ProtonUnsupportedOperationException: org.apache.qpid.proton.ProtonUnsupportedOperationException
proton_tests.ssl.SslTest.test_server_only_authentication ................ pass
proton_tests.ssl.SslTest.test_session_resume ............................ pass
proton_tests.ssl.SslTest.test_ssl_with_small_buffer ..................... pass
proton_tests.transport.TransportTest.testBigGarbage ..................... pass
proton_tests.transport.TransportTest.testBindAfterOpen .................. pass
proton_tests.transport.TransportTest.testEOS ............................ pass
proton_tests.transport.TransportTest.testGarbage ........................ pass
proton_tests.transport.TransportTest.testHeader ......................... pass
proton_tests.transport.TransportTest.testOutput ......................... pass
proton_tests.transport.TransportTest.testPartial ........................ pass
proton_tests.transport.TransportTest.testSmallGarbage ................... pass
Totals: 254 tests, 214 passed, 15 skipped, 25 ignored, 0 failed
Tests run: 1, Failures: 0, Errors: 0, Skipped: 0, Time elapsed: 33.363 sec
Running org.apache.qpid.proton.InteropTest
Tests run: 8, Failures: 0, Errors: 0, Skipped: 0, Time elapsed: 0.008 sec

Results :

Tests run: 33, Failures: 0, Errors: 0, Skipped: 2

ERROR: Maven JVM terminated unexpectedly with exit code 143


Mime
View raw message