qpid-notifications mailing list archives

Site index · List index
Message view « Date » · « Thread »
Top « Date » · « Thread »
From Apache Jenkins Server <jenk...@builds.apache.org>
Subject Build failed in Jenkins: Qpid-Java-Java-BDB-TestMatrix » JDK 1.6 (latest),Ubuntu,java-bdb.0-9-1 #1017
Date Mon, 12 Aug 2013 10:02:10 GMT
See <https://builds.apache.org/job/Qpid-Java-Java-BDB-TestMatrix/jdk=JDK%201.6%20(latest),label=Ubuntu,profile=java-bdb.0-9-1/1017/>

------------------------------------------
[...truncated 5280 lines...]
    [junit]     <property name="jetty-continuation" value="lib/required/jetty-continuation-7.6.10.v20130312.jar"
/>
    [junit]     <property name="sun.io.unicode.encoding" value="UnicodeLittle" />
    [junit]     <property name="broker.libs" value="lib/required/commons-cli-1.2.jar lib/required/commons-logging-1.1.1.jar
lib/required/log4j-1.2.16.jar lib/required/slf4j-log4j12-1.6.4.jar lib/required/xalan-2.7.0.jar
lib/required/derby-10.8.2.2.jar lib/required/commons-beanutils-core-1.8.3.jar lib/required/commons-digester-1.8.1.jar
lib/required/commons-codec-1.6.jar lib/required/commons-lang-2.6.jar lib/required/commons-collections-3.2.1.jar
lib/required/commons-configuration-1.8.jar lib/required/jackson-core-asl-1.9.0.jar lib/required/jackson-mapper-asl-1.9.0.jar
lib/required/jetty-server-7.6.10.v20130312.jar lib/required/jetty-continuation-7.6.10.v20130312.jar
lib/required/jetty-security-7.6.10.v20130312.jar lib/required/jetty-http-7.6.10.v20130312.jar
lib/required/jetty-io-7.6.10.v20130312.jar lib/required/jetty-servlet-7.6.10.v20130312.jar
lib/required/jetty-util-7.6.10.v20130312.jar lib/required/geronimo-servlet_2.5_spec-1.2.jar
lib/required/jetty-websocket-7.6.10.v20130312.jar" />
    [junit]     <property name="preload.broker.command" value="build/bin/qpid-server -sp
@STORE_PATH -st @STORE_TYPE -l @LOG_CONFIG_FILE" />
    [junit]     <property name="broker.existing.qpid.work" value="" />
    [junit]     <property name="user.language" value="en" />
    [junit]     <property name="module.libs" value="lib/required/slf4j-log4j12-1.6.4.jar
lib/required/log4j-1.2.16.jar lib/required/junit-3.8.1.jar lib/required/slf4j-api-1.6.4.jar
lib/required/mockito-all-1.9.0.jar" />
    [junit]     <property name="jackson-core" value="lib/required/jackson-core-asl-1.9.0.jar"
/>
    [junit]     <property name="build.findbugs" value="<https://builds.apache.org/job/Qpid-Java-Java-BDB-TestMatrix/jdk=JDK%201.6%20(latest),label=Ubuntu,profile=java-bdb.0-9-1/ws/trunk/qpid/java/build/findbugs">
/>
    [junit]     <property name="preload.include" value="" />
    [junit]     <property name="module.test.depends" value="" />
    [junit]     <property name="preload.broker.virtualhosts-config" value="${QPID_HOME}/etc/virtualhosts-systests-bdb.xml"
/>
    [junit]     <property name="ant.project.invoked-targets" value="test" />
    [junit]     <property name="velocity.jar" value="lib/required/velocity-1.4.jar" />
    [junit]     <property name="java.class.version" value="50.0" />
    [junit]     <property name="ant.file.type.AMQ Java" value="file" />
    [junit]     <property name="profile.clustered" value="false" />
    [junit]     <property name="broker.persistent" value="true" />
    [junit]     <property name="ant.file.AMQ Java" value="<https://builds.apache.org/job/Qpid-Java-Java-BDB-TestMatrix/jdk=JDK%201.6%20(latest),label=Ubuntu,profile=java-bdb.0-9-1/ws/trunk/qpid/java/build.xml">
/>
    [junit]     <property name="broker.log.prefix" value="BROKER: " />
    [junit]     <property name="module.test.libs.includes" value="${systests.test.libs}"
/>
    [junit]     <property name="maven.snapshot" value="true" />
    [junit]     <property name="jython" value="lib/required/jython-standalone-2.5.2.jar"
/>
    [junit]     <property name="commons-codec" value="lib/required/commons-codec-1.6.jar"
/>
    [junit]     <property name="project.version" value="0.25" />
    [junit]     <property name="jetty-io" value="lib/required/jetty-io-7.6.10.v20130312.jar"
/>
    [junit]     <property name="file.encoding.pkg" value="sun.io" />
    [junit]     <property name="sun.cpu.endian" value="little" />
    [junit]     <property name="dojo" value="lib/required/dojo-war-1.8.3.war" />
    [junit]     <property name="csvjdbc.jar" value="lib/csvjdbc/csvjdbc-1.0.8.jar" />
    [junit]     <property name="module.test.src.exists" value="true" />
    [junit]     <property name="broker-plugins-memory-store.test.libs" value="lib/required/slf4j-log4j12-1.6.4.jar
lib/required/log4j-1.2.16.jar lib/required/junit-3.8.1.jar lib/required/slf4j-api-1.6.4.jar
lib/required/mockito-all-1.9.0.jar" />
    [junit]     <property name="commons-lang" value="lib/required/commons-lang-2.6.jar"
/>
    [junit]     <property name="tasks.classes" value="<https://builds.apache.org/job/Qpid-Java-Java-BDB-TestMatrix/jdk=JDK%201.6%20(latest),label=Ubuntu,profile=java-bdb.0-9-1/ws/trunk/qpid/java/tasks/classes">
/>
    [junit]     <property name="java.home" value="/home/jenkins/tools/java/jdk1.6.0_45-32/jre"
/>
    [junit]     <property name="broker-plugins-amqp-0-8-protocol.test.libs" value="lib/required/slf4j-log4j12-1.6.4.jar
lib/required/log4j-1.2.16.jar lib/required/junit-3.8.1.jar lib/required/slf4j-api-1.6.4.jar
lib/required/mockito-all-1.9.0.jar" />
    [junit]     <property name="module.coverage" value="<https://builds.apache.org/job/Qpid-Java-Java-BDB-TestMatrix/jdk=JDK%201.6%20(latest),label=Ubuntu,profile=java-bdb.0-9-1/ws/trunk/qpid/java/build/scratch/systests/coverage">
/>
    [junit]     <property name="module.test.api" value="<https://builds.apache.org/job/Qpid-Java-Java-BDB-TestMatrix/jdk=JDK%201.6%20(latest),label=Ubuntu,profile=java-bdb.0-9-1/ws/trunk/qpid/java/build/test-api/systests">
/>
    [junit]     <property name="module.release.zip" value="<https://builds.apache.org/job/Qpid-Java-Java-BDB-TestMatrix/jdk=JDK%201.6%20(latest),label=Ubuntu,profile=java-bdb.0-9-1/ws/trunk/qpid/java/systests/release/qpid-systests-0.25.zip">
/>
    [junit]     <property name="ant.project.default-target" value="build" />
    [junit]     <property name="build.test.api" value="<https://builds.apache.org/job/Qpid-Java-Java-BDB-TestMatrix/jdk=JDK%201.6%20(latest),label=Ubuntu,profile=java-bdb.0-9-1/ws/trunk/qpid/java/build/test-api">
/>
    [junit]     <property name="amqj.server.logging.level" value="debug" />
    [junit]     <property name="build.api" value="<https://builds.apache.org/job/Qpid-Java-Java-BDB-TestMatrix/jdk=JDK%201.6%20(latest),label=Ubuntu,profile=java-bdb.0-9-1/ws/trunk/qpid/java/build/api">
/>
    [junit]     <property name="geronimo-jms" value="lib/required/geronimo-jms_1.1_spec-1.0.jar"
/>
    [junit]     <property name="build.results" value="<https://builds.apache.org/job/Qpid-Java-Java-BDB-TestMatrix/jdk=JDK%201.6%20(latest),label=Ubuntu,profile=java-bdb.0-9-1/ws/trunk/qpid/java/build/results">
/>
    [junit]     <property name="eclipse.updatealways" value="false" />
    [junit]     <property name="jca.libs" value="lib/required/geronimo-j2ee-connector_1.5_spec-2.0.0.jar
lib/required/geronimo-jta_1.1_spec-1.1.1.jar lib/required/geronimo-jms_1.1_spec-1.0.jar lib/required/geronimo-ejb_3.0_spec-1.0.1.jar
lib/required/geronimo-servlet_2.5_spec-1.2.jar lib/required/geronimo-kernel-2.2.1.jar" />
    [junit]     <property name="build.bin" value="<https://builds.apache.org/job/Qpid-Java-Java-BDB-TestMatrix/jdk=JDK%201.6%20(latest),label=Ubuntu,profile=java-bdb.0-9-1/ws/trunk/qpid/java/build/bin">
/>
    [junit]     <property name="perftests-visualisation-jfc.libs" value="lib/jfree/jfreechart-1.0.13.jar
lib/jfree/jcommon-1.0.16.jar lib/csvjdbc/csvjdbc-1.0.8.jar lib/required/derby-10.8.2.2.jar"
/>
    [junit]     <property name="module.etc" value="<https://builds.apache.org/job/Qpid-Java-Java-BDB-TestMatrix/jdk=JDK%201.6%20(latest),label=Ubuntu,profile=java-bdb.0-9-1/ws/trunk/qpid/java/systests/etc">
/>
    [junit]     <property name="ant.file.type.System Tests" value="file" />
    [junit]     <property name="test.excludefiles" value="<https://builds.apache.org/job/Qpid-Java-Java-BDB-TestMatrix/jdk=JDK%201.6%20(latest),label=Ubuntu,profile=java-bdb.0-9-1/ws/trunk/qpid/java/test-profiles/Excludes;>
<https://builds.apache.org/job/Qpid-Java-Java-BDB-TestMatrix/jdk=JDK%201.6%20(latest),label=Ubuntu,profile=java-bdb.0-9-1/ws/trunk/qpid/java/test-profiles/JavaExcludes;>
<https://builds.apache.org/job/Qpid-Java-Java-BDB-TestMatrix/jdk=JDK%201.6%20(latest),label=Ubuntu,profile=java-bdb.0-9-1/ws/trunk/qpid/java/test-profiles/java-bdb.0-9-1.excludes;>
<https://builds.apache.org/job/Qpid-Java-Java-BDB-TestMatrix/jdk=JDK%201.6%20(latest),label=Ubuntu,profile=java-bdb.0-9-1/ws/trunk/qpid/java/test-profiles/JavaExcludes;>
<https://builds.apache.org/job/Qpid-Java-Java-BDB-TestMatrix/jdk=JDK%201.6%20(latest),label=Ubuntu,profile=java-bdb.0-9-1/ws/trunk/qpid/java/test-profiles/JavaPersistentExcludes;>
<https://builds.apache.org/job/Qpid-Java-Java-BDB-TestMatrix/jdk=JDK%201.6%20(latest),label=Ubuntu,profile=java-bdb.0-9-1/ws/trunk/qpid/java/test-profiles/XAExcludes;>
<https://builds.apache.org/job/Qpid-Java-Java-BDB-TestMatrix/jdk=JDK%201.6%20(latest),label=Ubuntu,profile=java-bdb.0-9-1/ws/trunk/qpid/java/test-profiles/JavaPre010Excludes;>
<https://builds.apache.org/job/Qpid-Java-Java-BDB-TestMatrix/jdk=JDK%201.6%20(latest),label=Ubuntu,profile=java-bdb.0-9-1/ws/trunk/qpid/java/test-profiles/JavaBDBExcludes;">
/>
    [junit]     <property name="amqj.logging.level" value="debug" />
    [junit]     <property name="module.depends.libs" value="lib/required/geronimo-jms_1.1_spec-1.0.jar
 lib/required/commons-cli-1.2.jar lib/required/commons-logging-1.1.1.jar lib/required/log4j-1.2.16.jar
lib/required/slf4j-log4j12-1.6.4.jar lib/required/xalan-2.7.0.jar lib/required/derby-10.8.2.2.jar
lib/required/commons-beanutils-core-1.8.3.jar lib/required/commons-digester-1.8.1.jar lib/required/commons-codec-1.6.jar
lib/required/commons-lang-2.6.jar lib/required/commons-collections-3.2.1.jar lib/required/commons-configuration-1.8.jar
lib/required/jackson-core-asl-1.9.0.jar lib/required/jackson-mapper-asl-1.9.0.jar lib/required/jetty-server-7.6.10.v20130312.jar
lib/required/jetty-continuation-7.6.10.v20130312.jar lib/required/jetty-security-7.6.10.v20130312.jar
lib/required/jetty-http-7.6.10.v20130312.jar lib/required/jetty-io-7.6.10.v20130312.jar lib/required/jetty-servlet-7.6.10.v20130312.jar
lib/required/jetty-util-7.6.10.v20130312.jar lib/required/geronimo-servlet_2.5_spec-1.2.jar
lib/required/jetty-websocket-7.6.10.v20130312.jar null lib/required/slf4j-api-1.6.4.jar  null
lib/required/geronimo-j2ee-connector_1.5_spec-2.0.0.jar lib/required/geronimo-jta_1.1_spec-1.1.1.jar
lib/required/geronimo-jms_1.1_spec-1.0.jar lib/required/geronimo-ejb_3.0_spec-1.0.1.jar lib/required/geronimo-servlet_2.5_spec-1.2.jar
lib/required/geronimo-kernel-2.2.1.jar null null lib/required/jetty-server-7.6.10.v20130312.jar
lib/required/jetty-continuation-7.6.10.v20130312.jar lib/required/jetty-security-7.6.10.v20130312.jar
lib/required/jetty-http-7.6.10.v20130312.jar lib/required/jetty-io-7.6.10.v20130312.jar lib/required/jetty-servlet-7.6.10.v20130312.jar
lib/required/jetty-util-7.6.10.v20130312.jar lib/required/geronimo-servlet_2.5_spec-1.2.jar
 lib/required/jackson-core-asl-1.9.0.jar lib/required/jackson-mapper-asl-1.9.0.jar null null
null null null null null null null lib/bdbstore/je-5.0.84.jar" />
    [junit]     <property name="dontruntest" value="runtest" />
    [junit]     <property name="log4j.debug" value="false" />
    [junit]     <property name="resources" value="<https://builds.apache.org/job/Qpid-Java-Java-BDB-TestMatrix/jdk=JDK%201.6%20(latest),label=Ubuntu,profile=java-bdb.0-9-1/ws/trunk/qpid/java/resources">
/>
    [junit]     <property name="bonecp" value="lib/bonecp/bonecp-0.7.1.RELEASE.jar" />
    [junit]     <property name="preload.messagestore.class.name" value="org.apache.qpid.server.store.berkeleydb.BDBMessageStore"
/>
    [junit]     <property name="module.src.resources.exists" value="true" />
    [junit]     <property name="sun.management.compiler" value="HotSpot Tiered Compilers"
/>
    [junit]     <property name="max_prefetch" value="1000" />
    [junit]     <property name="javac.deprecation" value="off" />
    [junit]     <property name="jetty-util" value="lib/required/jetty-util-7.6.10.v20130312.jar"
/>
    [junit]     <property name="broker.command" value="build/bin/qpid-server -sp @STORE_PATH
-st @STORE_TYPE -l @LOG_CONFIG_FILE" />
    [junit]     <property name="amqp-1-0-client-example.libs" value="lib/required/commons-cli-1.2.jar"
/>
    [junit]     <property name="management-common.libs" value="" />
    [junit]     <property name="test.failures.ignore" value="true" />
    [junit]     <property name="ant.file" value="<https://builds.apache.org/job/Qpid-Java-Java-BDB-TestMatrix/jdk=JDK%201.6%20(latest),label=Ubuntu,profile=java-bdb.0-9-1/ws/trunk/qpid/java/systests/build.xml">
/>
    [junit]     <property name="retrieve.dependencies" value="true" />
    [junit]     <property name="perftests-visualisation-jfc.test.libs" value="lib/required/slf4j-log4j12-1.6.4.jar
lib/required/log4j-1.2.16.jar lib/required/junit-3.8.1.jar lib/required/slf4j-api-1.6.4.jar
lib/required/mockito-all-1.9.0.jar" />
    [junit]     <property name="tasks.src" value="<https://builds.apache.org/job/Qpid-Java-Java-BDB-TestMatrix/jdk=JDK%201.6%20(latest),label=Ubuntu,profile=java-bdb.0-9-1/ws/trunk/qpid/java/tasks/src">
/>
    [junit]     <property name="test.output" value="<https://builds.apache.org/job/Qpid-Java-Java-BDB-TestMatrix/jdk=JDK%201.6%20(latest),label=Ubuntu,profile=java-bdb.0-9-1/ws/trunk/qpid/java/build/results/systests">
/>
    [junit]     <property name="qpid.home" value="<https://builds.apache.org/job/Qpid-Java-Java-BDB-TestMatrix/jdk=JDK%201.6%20(latest),label=Ubuntu,profile=java-bdb.0-9-1/ws/trunk/qpid/java/build">
/>
    [junit]     <property name="module.depends.jars" value="qpid-client-0.25.jar,qpid-management-common-0.25.jar,qpid-broker-0.25.jar,qpid-broker-tests-0.25.jar,qpid-common-0.25.jar,qpid-amqp-1-0-common-0.25.jar,qpid-common-tests-0.25.jar,qpid-jca-0.25.jar,qpid-ra-0.25.jar,qpid-broker-plugins-access-control-0.25.jar,qpid-broker-plugins-management-http-0.25.jar,qpid-broker-plugins-management-jmx-0.25.jar,qpid-broker-plugins-memory-store-0.25.jar,qpid-broker-plugins-derby-store-0.25.jar,qpid-broker-plugins-amqp-0-8-protocol-0.25.jar,qpid-broker-plugins-amqp-0-10-protocol-0.25.jar,qpid-broker-plugins-amqp-1-0-protocol-0.25.jar,qpid-broker-plugins-amqp-msg-conv-0-8-to-0-10-0.25.jar,qpid-broker-plugins-amqp-msg-conv-0-8-to-1-0-0.25.jar,qpid-broker-plugins-amqp-msg-conv-0-10-to-1-0-0.25.jar,qpid-bdbstore-0.25.jar"
/>
    [junit]     <property name="jetty" value="lib/required/jetty-server-7.6.10.v20130312.jar"
/>
    [junit]     <property name="java.vm.specification.vendor" value="Sun Microsystems Inc."
/>
    [junit]     <property name="test.mport" value="18999" />
    [junit]     <property name="slf4j-api" value="lib/required/slf4j-api-1.6.4.jar" />
    [junit]     <property name="java.vm.name" value="Java HotSpot(TM) Server VM" />
    [junit]     <property name="build.report" value="<https://builds.apache.org/job/Qpid-Java-Java-BDB-TestMatrix/jdk=JDK%201.6%20(latest),label=Ubuntu,profile=java-bdb.0-9-1/ws/trunk/qpid/java/build/report">
/>
    [junit]     <property name="amqp-1-0-client-jms.libs" value="lib/required/geronimo-jms_1.1_spec-1.0.jar"
/>
    [junit]     <property name="java.io.tmpdir" value="/tmp" />
    [junit]     <property name="java.vendor.url" value="http://java.sun.com/" />
    [junit]     <property name="module.namever.osgi" value="qpid-systests_0.25.0.osgi"
/>
    [junit]     <property name="sun.boot.library.path" value="/home/jenkins/tools/java/jdk1.6.0_45-32/jre/lib/i386"
/>
    [junit]     <property name="_profile_files" value="java-bdb.0-9-1.testprofile" />
    [junit]     <property name="module.test.doc.access" value="public" />
    [junit]     <property name="preload.broker.persistent" value="true" />
    [junit]     <property name="testprofile.file" value="<https://builds.apache.org/job/Qpid-Java-Java-BDB-TestMatrix/jdk=JDK%201.6%20(latest),label=Ubuntu,profile=java-bdb.0-9-1/ws/trunk/qpid/java/test-profiles/java-bdb.0-9-1.testprofile">
/>
    [junit]     <property name="test.mem" value="512M" />
    [junit]     <property name="perftests.libs" value="lib/required/geronimo-jms_1.1_spec-1.0.jar
lib/required/slf4j-api-1.6.4.jar lib/required/log4j-1.2.16.jar lib/required/slf4j-log4j12-1.6.4.jar
lib/required/commons-logging-1.1.1.jar lib/required/commons-collections-3.2.1.jar lib/required/commons-beanutils-core-1.8.3.jar
lib/required/commons-lang-2.6.jar lib/required/gson-2.0.jar lib/required/derby-10.8.2.2.jar"
/>
    [junit]     <property name="java.runtime.name" value="Java(TM) SE Runtime Environment"
/>
    [junit]     <property name="ant.project.name" value="System Tests" />
    [junit]     <property name="module.namever" value="qpid-systests-0.25" />
    [junit]     <property name="sun.cpu.isalist" value="" />
    [junit]     <property name="module.test.depends.jars.path" value="" />
    [junit]     <property name="bnd" value="lib/required/bnd-0.0.384.jar" />
    [junit]     <property name="qpid.dest_syntax" value="BURL" />
    [junit]     <property name="tools.libs" value="lib/required/commons-beanutils-core-1.8.3.jar
lib/required/commons-digester-1.8.1.jar lib/required/commons-codec-1.6.jar lib/required/commons-lang-2.6.jar
lib/required/commons-collections-3.2.1.jar lib/required/commons-configuration-1.8.jar lib/required/log4j-1.2.16.jar"
/>
    [junit]     <property name="user.home" value="/home/jenkins" />
    [junit]     <property name="broker.virtualhosts-config" value="${QPID_HOME}/etc/virtualhosts-systests-bdb.xml"
/>
    [junit]     <property name="commons-logging" value="lib/required/commons-logging-1.1.1.jar"
/>
    [junit]     <property name="module.api" value="<https://builds.apache.org/job/Qpid-Java-Java-BDB-TestMatrix/jdk=JDK%201.6%20(latest),label=Ubuntu,profile=java-bdb.0-9-1/ws/trunk/qpid/java/build/api/systests">
/>
    [junit]     <property name="commons-digester" value="lib/required/commons-digester-1.8.1.jar"
/>
    [junit]     <property name="module.genpom.args" value="" />
    [junit]     <property name="java.specification.name" value="Java Platform API Specification"
/>
    [junit]     <property name="test.port" value="15672" />
    [junit]     <property name="ant.file.type.common" value="file" />
    [junit]     <property name="module.build" value="<https://builds.apache.org/job/Qpid-Java-Java-BDB-TestMatrix/jdk=JDK%201.6%20(latest),label=Ubuntu,profile=java-bdb.0-9-1/ws/trunk/qpid/java/build/scratch/systests">
/>
    [junit]     <property name="java.specification.vendor" value="Sun Microsystems Inc."
/>
    [junit]     <property name="module.bin" value="<https://builds.apache.org/job/Qpid-Java-Java-BDB-TestMatrix/jdk=JDK%201.6%20(latest),label=Ubuntu,profile=java-bdb.0-9-1/ws/trunk/qpid/java/systests/bin">
/>
    [junit]     <property name="broker-plugins-jdbc-provider-bone.libs" value="lib/bonecp/bonecp-0.7.1.RELEASE.jar
lib/bonecp/guava-14.0.1.jar" />
    [junit]     <property name="java.version" value="1.6.0_45" />
    [junit]     <property name="module.test.libs" value="${systests.test.libs}" />
    [junit]     <property name="broker.config" value="build/etc/config-systests.json" />
    [junit]     <property name="test.exclude" value="true" />
    [junit]     <property name="client-example.test.libs" value="lib/required/slf4j-log4j12-1.6.4.jar
lib/required/log4j-1.2.16.jar lib/required/junit-3.8.1.jar lib/required/slf4j-api-1.6.4.jar
lib/required/mockito-all-1.9.0.jar" />
    [junit]     <property name="jackson-mapper" value="lib/required/jackson-mapper-asl-1.9.0.jar"
/>
    [junit]     <property name="amqp-1-0-common.libs" value="" />
    [junit]     <property name="javac.compiler.args" value="" />
    [junit]     <property name="optional" value="true" />
    [junit]     <property name="messagestore.class.name" value="org.apache.qpid.server.store.berkeleydb.BDBMessageStore"
/>
    [junit]     <property name="preload.broker.clean.between.tests" value="true" />
    [junit]     <property name="module.test.classes" value="<https://builds.apache.org/job/Qpid-Java-Java-BDB-TestMatrix/jdk=JDK%201.6%20(latest),label=Ubuntu,profile=java-bdb.0-9-1/ws/trunk/qpid/java/build/scratch/systests/test/classes">
/>
    [junit]     <property name="qpid.work" value="<https://builds.apache.org/job/Qpid-Java-Java-BDB-TestMatrix/jdk=JDK%201.6%20(latest),label=Ubuntu,profile=java-bdb.0-9-1/ws/trunk/qpid/java/build/work">
/>
    [junit]     <property name="preload.profile.excludes" value="JavaExcludes JavaPersistentExcludes
XAExcludes JavaPre010Excludes JavaBDBExcludes" />
    [junit]     <property name="build.failed" value="<https://builds.apache.org/job/Qpid-Java-Java-BDB-TestMatrix/jdk=JDK%201.6%20(latest),label=Ubuntu,profile=java-bdb.0-9-1/ws/trunk/qpid/java/build/results/FAILED">
/>
    [junit]     <property name="maven.version.suffix" value="-SNAPSHOT" />
    [junit]     <property name="broker.protocol.excludes" value="" />
    [junit]     <property name="line.separator" value="&#xa;" />
    [junit]     <property name="java.specification.version" value="1.6" />
    [junit]     <property name="java.vm.info" value="mixed mode" />
    [junit]     <property name="jetty-servlet" value="lib/required/jetty-servlet-7.6.10.v20130312.jar"
/>
    [junit]     <property name="ivy.organisation" value="org/apache" />
    [junit]     <property name="xalan" value="lib/required/xalan-2.7.0.jar" />
    [junit]     <property name="module.depends" value="client management/common broker
broker/tests common amqp-1-0-common common/tests jca ra broker-plugins/access-control broker-plugins/management-http
broker-plugins/management-jmx broker-plugins/memory-store broker-plugins/derby-store broker-plugins/amqp-0-8-protocol
broker-plugins/amqp-0-10-protocol broker-plugins/amqp-1-0-protocol broker-plugins/amqp-msg-conv-0-8-to-0-10
broker-plugins/amqp-msg-conv-0-8-to-1-0 broker-plugins/amqp-msg-conv-0-10-to-1-0 bdbstore"
/>
    [junit]     <property name="log4j.configuration.file" value="<https://builds.apache.org/job/Qpid-Java-Java-BDB-TestMatrix/jdk=JDK%201.6%20(latest),label=Ubuntu,profile=java-bdb.0-9-1/ws/trunk/qpid/java/test-profiles/log4j-test.xml">
/>
    [junit]     <property name="nexus.upload.url" value="https://repository.apache.org/service/local/staging/deploy/maven2"
/>
    [junit]     <property name="module.test.jar" value="<https://builds.apache.org/job/Qpid-Java-Java-BDB-TestMatrix/jdk=JDK%201.6%20(latest),label=Ubuntu,profile=java-bdb.0-9-1/ws/trunk/qpid/java/build/lib/qpid-systests-tests-0.25.jar">
/>
    [junit]     <property name="ivy.jar.dir" value="<https://builds.apache.org/job/Qpid-Java-Java-BDB-TestMatrix/jdk=JDK%201.6%20(latest),label=Ubuntu,profile=java-bdb.0-9-1/ws/trunk/qpid/java/lib/ivy">
/>
    [junit]     <property name="sun.boot.class.path" value="/home/jenkins/tools/java/jdk1.6.0_45-32/jre/lib/resources.jar:/home/jenkins/tools/java/jdk1.6.0_45-32/jre/lib/rt.jar:/home/jenkins/tools/java/jdk1.6.0_45-32/jre/lib/sunrsasign.jar:/home/jenkins/tools/java/jdk1.6.0_45-32/jre/lib/jsse.jar:/home/jenkins/tools/java/jdk1.6.0_45-32/jre/lib/jce.jar:/home/jenkins/tools/java/jdk1.6.0_45-32/jre/lib/charsets.jar:/home/jenkins/tools/java/jdk1.6.0_45-32/jre/lib/modules/jdk.boot.jar:/home/jenkins/tools/java/jdk1.6.0_45-32/jre/classes"
/>
    [junit]     <property name="project.url" value="http://qpid.apache.org" />
    [junit]     <property name="commons-configuration.libs" value="lib/required/commons-beanutils-core-1.8.3.jar
lib/required/commons-digester-1.8.1.jar lib/required/commons-codec-1.6.jar lib/required/commons-lang-2.6.jar
lib/required/commons-collections-3.2.1.jar lib/required/commons-configuration-1.8.jar" />
    [junit]     <property name="gentools.home" value="<https://builds.apache.org/job/Qpid-Java-Java-BDB-TestMatrix/jdk=JDK%201.6%20(latest),label=Ubuntu,profile=java-bdb.0-9-1/ws/trunk/qpid/java/common/gentools">
/>
    [junit]     <property name="build" value="<https://builds.apache.org/job/Qpid-Java-Java-BDB-TestMatrix/jdk=JDK%201.6%20(latest),label=Ubuntu,profile=java-bdb.0-9-1/ws/trunk/qpid/java/build">
/>
    [junit]     <property name="ivy.m2repo.url" value="http://repo1.maven.org/maven2" />
    [junit]     <property name="broker-plugins-amqp-1-0-protocol.test.libs" value="lib/required/slf4j-log4j12-1.6.4.jar
lib/required/log4j-1.2.16.jar lib/required/junit-3.8.1.jar lib/required/slf4j-api-1.6.4.jar
lib/required/mockito-all-1.9.0.jar" />
    [junit]     <property name="servlet-api" value="lib/required/geronimo-servlet_2.5_spec-1.2.jar"
/>
    [junit]     <property name="mockito-all" value="lib/required/mockito-all-1.9.0.jar"
/>
    [junit]     <property name="module.doc.access" value="package" />
    [junit]     <property name="haltonerror" value="no" />
    [junit]     <property name="velocity.compile.dir" value="<https://builds.apache.org/job/Qpid-Java-Java-BDB-TestMatrix/jdk=JDK%201.6%20(latest),label=Ubuntu,profile=java-bdb.0-9-1/ws/trunk/qpid/java/build/scratch/broker/velocity">
/>
    [junit]     <property name="broker-plugins-management-jmx.test.libs" value="lib/required/slf4j-log4j12-1.6.4.jar
lib/required/log4j-1.2.16.jar lib/required/junit-3.8.1.jar lib/required/slf4j-api-1.6.4.jar
lib/required/mockito-all-1.9.0.jar" />
    [junit]     <property name="module.test.depends.libs" value="" />
    [junit]     <property name="java.awt.printerjob" value="sun.print.PSPrinterJob" />
    [junit]     <property name="perftests.test.libs" value="lib/required/slf4j-log4j12-1.6.4.jar
lib/required/log4j-1.2.16.jar lib/required/junit-3.8.1.jar lib/required/slf4j-api-1.6.4.jar
lib/required/mockito-all-1.9.0.jar" />
    [junit]     <property name="module.test.src" value="<https://builds.apache.org/job/Qpid-Java-Java-BDB-TestMatrix/jdk=JDK%201.6%20(latest),label=Ubuntu,profile=java-bdb.0-9-1/ws/trunk/qpid/java/systests/src/main/java">
/>
    [junit]     <property name="common.test.libs" value="lib/required/slf4j-log4j12-1.6.4.jar
lib/required/log4j-1.2.16.jar lib/required/junit-3.8.1.jar lib/required/slf4j-api-1.6.4.jar
lib/required/mockito-all-1.9.0.jar" />
    [junit]     <property name="sun.jnu.encoding" value="ANSI_X3.4-1968" />
    [junit]     <property name="velocity-dep.jar" value="lib/required/velocity-dep-1.4.jar"
/>
    [junit]     <property name="project.groupid" value="org.apache.qpid" />
    [junit]     <property name="java.runtime.version" value="1.6.0_45-b06" />
    [junit]     <property name="broker-plugins-amqp-0-10-protocol.test.libs" value="lib/required/slf4j-log4j12-1.6.4.jar
lib/required/log4j-1.2.16.jar lib/required/junit-3.8.1.jar lib/required/slf4j-api-1.6.4.jar
lib/required/mockito-all-1.9.0.jar" />
    [junit]     <property name="log4j.configuration" value="file:///<https://builds.apache.org/job/Qpid-Java-Java-BDB-TestMatrix/jdk=JDK%201.6%20(latest),label=Ubuntu,profile=java-bdb.0-9-1/ws/trunk/qpid/java/test-profiles/log4j-test.xml">
/>
    [junit]     <property name="bdbstore-jmx.libs" value="lib/bdbstore/je-5.0.84.jar" />
    [junit]     <property name="test.port.alt" value="25672" />
    [junit]     <property name="tasks" value="<https://builds.apache.org/job/Qpid-Java-Java-BDB-TestMatrix/jdk=JDK%201.6%20(latest),label=Ubuntu,profile=java-bdb.0-9-1/ws/trunk/qpid/java/tasks">
/>
    [junit]     <property name="user.timezone" value="Etc/UTC" />
    [junit]     <property name="module.failed" value="<https://builds.apache.org/job/Qpid-Java-Java-BDB-TestMatrix/jdk=JDK%201.6%20(latest),label=Ubuntu,profile=java-bdb.0-9-1/ws/trunk/qpid/java/build/results/systests/FAILED">
/>
    [junit]     <property name="dont.download.ivy" value="true" />
    [junit]     <property name="profiles" value=" java-bdb.0-9-1" />
    [junit]     <property name="tools.test.libs" value="" />
    [junit]     <property name="testprofile.file.present" value="true" />
    [junit]     <property name="module.resources.dir" value="<https://builds.apache.org/job/Qpid-Java-Java-BDB-TestMatrix/jdk=JDK%201.6%20(latest),label=Ubuntu,profile=java-bdb.0-9-1/ws/trunk/qpid/java/systests/resources">
/>
    [junit]     <property name="java.ext.dirs" value="/home/jenkins/tools/java/jdk1.6.0_45-32/jre/lib/ext:/usr/java/packages/lib/ext"
/>
    [junit]     <property name="module.release" value="<https://builds.apache.org/job/Qpid-Java-Java-BDB-TestMatrix/jdk=JDK%201.6%20(latest),label=Ubuntu,profile=java-bdb.0-9-1/ws/trunk/qpid/java/systests/release/qpid-systests-0.25">
/>
    [junit]     <property name="jetty-security" value="lib/required/jetty-security-7.6.10.v20130312.jar"
/>
    [junit]     <property name="commons-beanutils-core" value="lib/required/commons-beanutils-core-1.8.3.jar"
/>
    [junit]     <property name="preload.qpid.broker_default_amqp_protocol_excludes" value="AMQP_1_0,AMQP_0_10"
/>
    [junit]     <property name="java.class.path" value="/home/hudson/tools/ant/latest/lib/ant-launcher.jar:/home/hudson/tools/ant/latest/lib/ant-apache-resolver.jar:/home/hudson/tools/ant/latest/lib/ant-apache-bcel.jar:/home/hudson/tools/ant/latest/lib/ant-netrexx.jar:/home/hudson/tools/ant/latest/lib/ant-commons-net.jar:/home/hudson/tools/ant/latest/lib/ant-javamail.jar:/home/hudson/tools/ant/latest/lib/ant-commons-logging.jar:/home/hudson/tools/ant/latest/lib/ant-junit4.jar:/home/hudson/tools/ant/latest/lib/ant-launcher.jar:/home/hudson/tools/ant/latest/lib/ant-apache-bsf.jar:/home/hudson/tools/ant/latest/lib/ant-testutil.jar:/home/hudson/tools/ant/latest/lib/ant-jdepend.jar:/home/hudson/tools/ant/latest/lib/ant-apache-oro.jar:/home/hudson/tools/ant/latest/lib/ant.jar:/home/hudson/tools/ant/latest/lib/ant-swing.jar:/home/hudson/tools/ant/latest/lib/ant-apache-log4j.jar:/home/hudson/tools/ant/latest/lib/ant-junit.jar:/home/hudson/tools/ant/latest/lib/ant-apache-regexp.jar:/home/hudson/tools/ant/latest/lib/ant-jsch.jar:/home/hudson/tools/ant/latest/lib/ant-jai.jar:/home/hudson/tools/ant/latest/lib/ant-antlr.jar:/home/hudson/tools/ant/latest/lib/ant-jmf.jar:/home/hudson/tools/ant/latest/lib/ant-apache-xalan2.jar:/home/jenkins/tools/java/jdk1.6.0_45-32/lib/tools.jar"
/>
    [junit]     <property name="broker.version" value="v0_9_1" />
    [junit]     <property name="mllib.dir" value="<https://builds.apache.org/job/Qpid-Java-Java-BDB-TestMatrix/jdk=JDK%201.6%20(latest),label=Ubuntu,profile=java-bdb.0-9-1/ws/trunk/qpid/java/../python">
/>
    [junit]     <property name="broker.language" value="java" />
    [junit]     <property name="log4j" value="lib/required/log4j-1.2.16.jar" />
    [junit]     <property name="cobertura.version" value="1.9.4.1" />
    [junit]     <property name="broker.log.interleave" value="true" />
    [junit]     <property name="os.version" value="3.2.0-51-generic" />
    [junit]     <property name="test.hport" value="18080" />
    [junit]     <property name="module.test.depends.libs.includes" value="__EMPTY__" />
    [junit]     <property name="common.libs" value="lib/required/slf4j-api-1.6.4.jar" />
    [junit]     <property name="module.release.bz2" value="<https://builds.apache.org/job/Qpid-Java-Java-BDB-TestMatrix/jdk=JDK%201.6%20(latest),label=Ubuntu,profile=java-bdb.0-9-1/ws/trunk/qpid/java/systests/release/qpid-systests-0.25/qpid-systests-0.25.tar.bz2">
/>
    [junit]     <property name="geronimo-kernel" value="lib/required/geronimo-kernel-2.2.1.jar"
/>
    [junit]     <property name="build.scratch" value="<https://builds.apache.org/job/Qpid-Java-Java-BDB-TestMatrix/jdk=JDK%201.6%20(latest),label=Ubuntu,profile=java-bdb.0-9-1/ws/trunk/qpid/java/build/scratch">
/>
    [junit]     <property name="project.version.maven" value="0.26" />
    [junit]     <property name="module.release.base" value="<https://builds.apache.org/job/Qpid-Java-Java-BDB-TestMatrix/jdk=JDK%201.6%20(latest),label=Ubuntu,profile=java-bdb.0-9-1/ws/trunk/qpid/java/systests/release">
/>
    [junit]     <property name="ant.file.type.module" value="file" />
    [junit]     <property name="module.src.resources" value="<https://builds.apache.org/job/Qpid-Java-Java-BDB-TestMatrix/jdk=JDK%201.6%20(latest),label=Ubuntu,profile=java-bdb.0-9-1/ws/trunk/qpid/java/systests/src/main/resources">
/>
    [junit]     <property name="test.port.alt.ssl" value="25671" />
    [junit]     <property name="maven.settings.xml" value="<https://builds.apache.org/job/Qpid-Java-Java-BDB-TestMatrix/jdk=JDK%201.6%20(latest),label=Ubuntu,profile=java-bdb.0-9-1/ws/trunk/qpid/java/maven-settings.xml">
/>
    [junit]     <property name="client.test.libs" value="lib/required/slf4j-log4j12-1.6.4.jar
lib/required/log4j-1.2.16.jar lib/required/junit-3.8.1.jar lib/required/slf4j-api-1.6.4.jar
lib/required/mockito-all-1.9.0.jar" />
    [junit]     <property name="geronimo-openejb" value="lib/required/geronimo-ejb_3.0_spec-1.0.1.jar"
/>
    [junit]     <property name="java.awt.graphicsenv" value="sun.awt.X11GraphicsEnvironment"
/>
    [junit]     <property name="java.vm.vendor" value="Sun Microsystems Inc." />
    [junit]     <property name="systests.optional.depends" value="bdbstore" />
    [junit]     <property name="amqj.protocol.logging.level" value="debug" />
    [junit]     <property name="slf4j-log4j" value="lib/required/slf4j-log4j12-1.6.4.jar"
/>
    [junit]     <property name="geronimo-j2ee" value="lib/required/geronimo-j2ee-connector_1.5_spec-2.0.0.jar"
/>
    [junit]     <property name="module.test.resources" value="<https://builds.apache.org/job/Qpid-Java-Java-BDB-TestMatrix/jdk=JDK%201.6%20(latest),label=Ubuntu,profile=java-bdb.0-9-1/ws/trunk/qpid/java/systests/src/test/resources">
/>
    [junit]     <property name="ivy.jar.file.exists" value="true" />
    [junit]     <property name="commons-collections" value="lib/required/commons-collections-3.2.1.jar"
/>
    [junit]     <property name="broker-plugins.libs" value="lib/required/log4j-1.2.16.jar
lib/required/commons-beanutils-core-1.8.3.jar lib/required/commons-digester-1.8.1.jar lib/required/commons-codec-1.6.jar
lib/required/commons-lang-2.6.jar lib/required/commons-collections-3.2.1.jar lib/required/commons-configuration-1.8.jar"
/>
    [junit]     <property name="label" value="Ubuntu" />
    [junit]     <property name="ant.file.type" value="file" />
    [junit]     <property name="module" value="systests" />
    [junit]     <property name="build.coverage.report" value="<https://builds.apache.org/job/Qpid-Java-Java-BDB-TestMatrix/jdk=JDK%201.6%20(latest),label=Ubuntu,profile=java-bdb.0-9-1/ws/trunk/qpid/java/build/coverage/report">
/>
    [junit]     <property name="broker.config-store-type" value="json" />
    [junit]     <property name="build.lib" value="<https://builds.apache.org/job/Qpid-Java-Java-BDB-TestMatrix/jdk=JDK%201.6%20(latest),label=Ubuntu,profile=java-bdb.0-9-1/ws/trunk/qpid/java/build/lib">
/>
    [junit]     <property name="maven.local.repo" value="<https://builds.apache.org/job/Qpid-Java-Java-BDB-TestMatrix/jdk=JDK%201.6%20(latest),label=Ubuntu,profile=java-bdb.0-9-1/ws/trunk/qpid/java/build/scratch/maven-local-repo">
/>
    [junit]     <property name="module.jar" value="<https://builds.apache.org/job/Qpid-Java-Java-BDB-TestMatrix/jdk=JDK%201.6%20(latest),label=Ubuntu,profile=java-bdb.0-9-1/ws/trunk/qpid/java/build/lib/qpid-systests-0.25.jar">
/>
    [junit]     <property name="amqp-1-0-client.libs" value="" />
    [junit]     <property name="test.excludelist" value="org.apache.qpid.test.client.message.SelectorTest.testRuntimeSelectorError
 org.apache.qpid.systest.management.jmx.LoggingManagementTest#testViewEffectiveRuntimeLoggerLevels"
/>
    [junit]     <property name="qpid.broker_default_amqp_protocol_excludes" value="AMQP_1_0,AMQP_0_10"
/>
    [junit]     <property name="module.depends.jars.path" value="<https://builds.apache.org/job/Qpid-Java-Java-BDB-TestMatrix/jdk=JDK%201.6%20(latest),label=Ubuntu,profile=java-bdb.0-9-1/ws/trunk/qpid/java/build/lib/qpid-client-0.25.jar>:<https://builds.apache.org/job/Qpid-Java-Java-BDB-TestMatrix/jdk=JDK%201.6%20(latest),label=Ubuntu,profile=java-bdb.0-9-1/ws/trunk/qpid/java/build/lib/qpid-management-common-0.25.jar>:<https://builds.apache.org/job/Qpid-Java-Java-BDB-TestMatrix/jdk=JDK%201.6%20(latest),label=Ubuntu,profile=java-bdb.0-9-1/ws/trunk/qpid/java/build/lib/qpid-broker-0.25.jar>:<https://builds.apache.org/job/Qpid-Java-Java-BDB-TestMatrix/jdk=JDK%201.6%20(latest),label=Ubuntu,profile=java-bdb.0-9-1/ws/trunk/qpid/java/build/lib/qpid-broker-tests-0.25.jar>:<https://builds.apache.org/job/Qpid-Java-Java-BDB-TestMatrix/jdk=JDK%201.6%20(latest),label=Ubuntu,profile=java-bdb.0-9-1/ws/trunk/qpid/java/build/lib/qpid-common-0.25.jar>:<https://builds.apache.org/job/Qpid-Java-Java-BDB-TestMatrix/jdk=JDK%201.6%20(latest),label=Ubuntu,profile=java-bdb.0-9-1/ws/trunk/qpid/java/build/lib/qpid-amqp-1-0-common-0.25.jar>:<https://builds.apache.org/job/Qpid-Java-Java-BDB-TestMatrix/jdk=JDK%201.6%20(latest),label=Ubuntu,profile=java-bdb.0-9-1/ws/trunk/qpid/java/build/lib/qpid-common-tests-0.25.jar>:<https://builds.apache.org/job/Qpid-Java-Java-BDB-TestMatrix/jdk=JDK%201.6%20(latest),label=Ubuntu,profile=java-bdb.0-9-1/ws/trunk/qpid/java/build/lib/qpid-jca-0.25.jar>:<https://builds.apache.org/job/Qpid-Java-Java-BDB-TestMatrix/jdk=JDK%201.6%20(latest),label=Ubuntu,profile=java-bdb.0-9-1/ws/trunk/qpid/java/build/lib/qpid-ra-0.25.jar>:<https://builds.apache.org/job/Qpid-Java-Java-BDB-TestMatrix/jdk=JDK%201.6%20(latest),label=Ubuntu,profile=java-bdb.0-9-1/ws/trunk/qpid/java/build/lib/qpid-broker-plugins-access-control-0.25.jar>:<https://builds.apache.org/job/Qpid-Java-Java-BDB-TestMatrix/jdk=JDK%201.6%20(latest),label=Ubuntu,profile=java-bdb.0-9-1/ws/trunk/qpid/java/build/lib/qpid-broker-plugins-management-http-0.25.jar>:<https://builds.apache.org/job/Qpid-Java-Java-BDB-TestMatrix/jdk=JDK%201.6%20(latest),label=Ubuntu,profile=java-bdb.0-9-1/ws/trunk/qpid/java/build/lib/qpid-broker-plugins-management-jmx-0.25.jar>:<https://builds.apache.org/job/Qpid-Java-Java-BDB-TestMatrix/jdk=JDK%201.6%20(latest),label=Ubuntu,profile=java-bdb.0-9-1/ws/trunk/qpid/java/build/lib/qpid-broker-plugins-memory-store-0.25.jar>:<https://builds.apache.org/job/Qpid-Java-Java-BDB-TestMatrix/jdk=JDK%201.6%20(latest),label=Ubuntu,profile=java-bdb.0-9-1/ws/trunk/qpid/java/build/lib/qpid-broker-plugins-derby-store-0.25.jar>:<https://builds.apache.org/job/Qpid-Java-Java-BDB-TestMatrix/jdk=JDK%201.6%20(latest),label=Ubuntu,profile=java-bdb.0-9-1/ws/trunk/qpid/java/build/lib/qpid-broker-plugins-amqp-0-8-protocol-0.25.jar>:<https://builds.apache.org/job/Qpid-Java-Java-BDB-TestMatrix/jdk=JDK%201.6%20(latest),label=Ubuntu,profile=java-bdb.0-9-1/ws/trunk/qpid/java/build/lib/qpid-broker-plugins-amqp-0-10-protocol-0.25.jar>:<https://builds.apache.org/job/Qpid-Java-Java-BDB-TestMatrix/jdk=JDK%201.6%20(latest),label=Ubuntu,profile=java-bdb.0-9-1/ws/trunk/qpid/java/build/lib/qpid-broker-plugins-amqp-1-0-protocol-0.25.jar>:<https://builds.apache.org/job/Qpid-Java-Java-BDB-TestMatrix/jdk=JDK%201.6%20(latest),label=Ubuntu,profile=java-bdb.0-9-1/ws/trunk/qpid/java/build/lib/qpid-broker-plugins-amqp-msg-conv-0-8-to-0-10-0.25.jar>:<https://builds.apache.org/job/Qpid-Java-Java-BDB-TestMatrix/jdk=JDK%201.6%20(latest),label=Ubuntu,profile=java-bdb.0-9-1/ws/trunk/qpid/java/build/lib/qpid-broker-plugins-amqp-msg-conv-0-8-to-1-0-0.25.jar>:<https://builds.apache.org/job/Qpid-Java-Java-BDB-TestMatrix/jdk=JDK%201.6%20(latest),label=Ubuntu,profile=java-bdb.0-9-1/ws/trunk/qpid/java/build/lib/qpid-broker-plugins-amqp-msg-conv-0-10-to-1-0-0.25.jar>:<https://builds.apache.org/job/Qpid-Java-Java-BDB-TestMatrix/jdk=JDK%201.6%20(latest),label=Ubuntu,profile=java-bdb.0-9-1/ws/trunk/qpid/java/build/lib/qpid-bdbstore-0.25.jar">
/>
    [junit]     <property name="broker-plugins-management-http.test.libs" value="lib/required/slf4j-log4j12-1.6.4.jar
lib/required/log4j-1.2.16.jar lib/required/junit-3.8.1.jar lib/required/slf4j-api-1.6.4.jar
lib/required/mockito-all-1.9.0.jar" />
    [junit]     <property name="ant.version" value="Apache Ant(TM) version 1.8.2 compiled
on December 20 2010" />
    [junit]     <property name="file.encoding" value="ANSI_X3.4-1968" />
    [junit]     <property name="module.instrumented" value="<https://builds.apache.org/job/Qpid-Java-Java-BDB-TestMatrix/jdk=JDK%201.6%20(latest),label=Ubuntu,profile=java-bdb.0-9-1/ws/trunk/qpid/java/build/scratch/systests/classes-instrumented">
/>
    [junit]     <property name="project.root" value="<https://builds.apache.org/job/Qpid-Java-Java-BDB-TestMatrix/jdk=JDK%201.6%20(latest),label=Ubuntu,profile=java-bdb.0-9-1/ws/trunk/qpid/java">
/>
    [junit]     <property name="preload.broker.version" value="v0_9_1" />
    [junit]   </properties>
    [junit]   <testcase classname="org.apache.qpid.util.Batch-With-Multiple-Tests" name="Monitor
file (<https://builds.apache.org/job/Qpid-Java-Java-BDB-TestMatrix/jdk=JDK%201.6%20(latest),label=Ubuntu,profile=java-bdb.0-9-1/ws/trunk/qpid/java/systests/junitvmwatcher3248309767442798416.properties)>
missing, location not writable, testcase not started or mixing ant versions?" time="0.0">
    [junit]     <error message="Forked Java VM exited abnormally. Please note the time
in the report does not reflect the time until the VM exit." type="junit.framework.AssertionFailedError">junit.framework.AssertionFailedError:
Forked Java VM exited abnormally. Please note the time in the report does not reflect the
time until the VM exit.
    [junit] </error>
    [junit]   </testcase>
    [junit] </testsuite>
    [junit] Running org.apache.qpid.util.Batch-With-Multiple-Tests
    [junit] Tests run: 1, Failures: 0, Errors: 1, Time elapsed: 0 sec

BUILD FAILED
<https://builds.apache.org/job/Qpid-Java-Java-BDB-TestMatrix/jdk=JDK%201.6%20(latest),label=Ubuntu,profile=java-bdb.0-9-1/ws/trunk/qpid/java/build.xml>:99:
The following error occurred while executing this line:
<https://builds.apache.org/job/Qpid-Java-Java-BDB-TestMatrix/jdk=JDK%201.6%20(latest),label=Ubuntu,profile=java-bdb.0-9-1/ws/trunk/qpid/java/build.xml>:68:
The following error occurred while executing this line:
<https://builds.apache.org/job/Qpid-Java-Java-BDB-TestMatrix/jdk=JDK%201.6%20(latest),label=Ubuntu,profile=java-bdb.0-9-1/ws/trunk/qpid/java/module.xml>:437:
Could not delete temporary properties file '<https://builds.apache.org/job/Qpid-Java-Java-BDB-TestMatrix/jdk=JDK%201.6%20(latest),label=Ubuntu,profile=java-bdb.0-9-1/ws/trunk/qpid/java/systests/junit2552974870481141491.properties'.>

Total time: 6 minutes 41 seconds
Build step 'Invoke Ant' marked build as failure
[locks-and-latches] Releasing all the locks
[locks-and-latches] All the locks released
Recording test results

Mime
View raw message