qpid-notifications mailing list archives

Site index · List index
Message view « Date » · « Thread »
Top « Date » · « Thread »
From Apache Jenkins Server <jenk...@builds.apache.org>
Subject Build failed in Jenkins: Qpid-proton-jni #171
Date Thu, 08 Aug 2013 19:00:58 GMT
See <https://builds.apache.org/job/Qpid-proton-jni/171/changes>

Changes:

[kgiusti] PROTON-396: set the peer hostname in the SSL context

------------------------------------------
[...truncated 1190 lines...]
proton_tests.messenger.MessengerTest.testRewritePattern ................. start
  Exception in thread server-thread:Traceback (most recent call last):
    File "/home/jenkins/jenkins-slave/maven-repositories/1/org/python/jython-standalone/2.5.3/jython-standalone-2.5.3.jar/Lib/threading.py",
line 179, in _Thread__bootstrap
      self.run()
    File "/home/jenkins/jenkins-slave/maven-repositories/1/org/python/jython-standalone/2.5.3/jython-standalone-2.5.3.jar/Lib/threading.py",
line 170, in run
      self._target(*self._args, **self._kwargs)
    File "<https://builds.apache.org/job/Qpid-proton-jni/ws/proton/tests/python/proton_tests/messenger.py",>
line 84, in run_server
      self.server.recv(self.server_credit)
    File "<https://builds.apache.org/job/Qpid-proton-jni/ws/proton/tests/python/proton_tests/messenger.py",>
line 84, in run_server
      self.server.recv(self.server_credit)
    File "__pyclasspath__/proton.py", line 1297, in recv
  MessengerException: org.apache.qpid.proton.messenger.MessengerException
proton_tests.messenger.MessengerTest.testRewritePattern ................. skip
  Skipped
proton_tests.messenger.MessengerTest.testRewriteSupress ................. start
  Exception in thread server-thread:Traceback (most recent call last):
    File "/home/jenkins/jenkins-slave/maven-repositories/1/org/python/jython-standalone/2.5.3/jython-standalone-2.5.3.jar/Lib/threading.py",
line 179, in _Thread__bootstrap
      self.run()
    File "/home/jenkins/jenkins-slave/maven-repositories/1/org/python/jython-standalone/2.5.3/jython-standalone-2.5.3.jar/Lib/threading.py",
line 170, in run
      self._target(*self._args, **self._kwargs)
    File "<https://builds.apache.org/job/Qpid-proton-jni/ws/proton/tests/python/proton_tests/messenger.py",>
line 84, in run_server
      self.server.recv(self.server_credit)
    File "<https://builds.apache.org/job/Qpid-proton-jni/ws/proton/tests/python/proton_tests/messenger.py",>
line 84, in run_server
      self.server.recv(self.server_credit)
    File "__pyclasspath__/proton.py", line 1297, in recv
  MessengerException: org.apache.qpid.proton.messenger.MessengerException
proton_tests.messenger.MessengerTest.testRewriteSupress ................. skip
  Skipped
proton_tests.messenger.MessengerTest.testRewriteToAt .................... start
  Exception in thread server-thread:Traceback (most recent call last):
    File "/home/jenkins/jenkins-slave/maven-repositories/1/org/python/jython-standalone/2.5.3/jython-standalone-2.5.3.jar/Lib/threading.py",
line 179, in _Thread__bootstrap
      self.run()
    File "/home/jenkins/jenkins-slave/maven-repositories/1/org/python/jython-standalone/2.5.3/jython-standalone-2.5.3.jar/Lib/threading.py",
line 170, in run
      self._target(*self._args, **self._kwargs)
    File "<https://builds.apache.org/job/Qpid-proton-jni/ws/proton/tests/python/proton_tests/messenger.py",>
line 84, in run_server
      self.server.recv(self.server_credit)
    File "<https://builds.apache.org/job/Qpid-proton-jni/ws/proton/tests/python/proton_tests/messenger.py",>
line 84, in run_server
      self.server.recv(self.server_credit)
    File "__pyclasspath__/proton.py", line 1297, in recv
  MessengerException: org.apache.qpid.proton.messenger.MessengerException
proton_tests.messenger.MessengerTest.testRewriteToAt .................... skip
  Skipped
proton_tests.messenger.MessengerTest.testRoute .......................... start
  Exception in thread server-thread:Traceback (most recent call last):
    File "/home/jenkins/jenkins-slave/maven-repositories/1/org/python/jython-standalone/2.5.3/jython-standalone-2.5.3.jar/Lib/threading.py",
line 179, in _Thread__bootstrap
      self.run()
    File "/home/jenkins/jenkins-slave/maven-repositories/1/org/python/jython-standalone/2.5.3/jython-standalone-2.5.3.jar/Lib/threading.py",
line 170, in run
      self._target(*self._args, **self._kwargs)
    File "<https://builds.apache.org/job/Qpid-proton-jni/ws/proton/tests/python/proton_tests/messenger.py",>
line 84, in run_server
      self.server.recv(self.server_credit)
    File "<https://builds.apache.org/job/Qpid-proton-jni/ws/proton/tests/python/proton_tests/messenger.py",>
line 84, in run_server
      self.server.recv(self.server_credit)
    File "__pyclasspath__/proton.py", line 1297, in recv
  MessengerException: org.apache.qpid.proton.messenger.MessengerException
proton_tests.messenger.MessengerTest.testRoute .......................... skip
  Skipped
proton_tests.messenger.MessengerTest.testSendReceive .................... start
  Exception in thread server-thread:Traceback (most recent call last):
    File "/home/jenkins/jenkins-slave/maven-repositories/1/org/python/jython-standalone/2.5.3/jython-standalone-2.5.3.jar/Lib/threading.py",
line 179, in _Thread__bootstrap
      self.run()
    File "/home/jenkins/jenkins-slave/maven-repositories/1/org/python/jython-standalone/2.5.3/jython-standalone-2.5.3.jar/Lib/threading.py",
line 170, in run
      self._target(*self._args, **self._kwargs)
    File "<https://builds.apache.org/job/Qpid-proton-jni/ws/proton/tests/python/proton_tests/messenger.py",>
line 84, in run_server
      self.server.recv(self.server_credit)
    File "<https://builds.apache.org/job/Qpid-proton-jni/ws/proton/tests/python/proton_tests/messenger.py",>
line 84, in run_server
      self.server.recv(self.server_credit)
    File "__pyclasspath__/proton.py", line 1297, in recv
  MessengerException: org.apache.qpid.proton.messenger.MessengerException
proton_tests.messenger.MessengerTest.testSendReceive .................... pass
proton_tests.messenger.MessengerTest.testSendReceive100K ................ start
  Exception in thread server-thread:Traceback (most recent call last):
    File "/home/jenkins/jenkins-slave/maven-repositories/1/org/python/jython-standalone/2.5.3/jython-standalone-2.5.3.jar/Lib/threading.py",
line 179, in _Thread__bootstrap
      self.run()
    File "/home/jenkins/jenkins-slave/maven-repositories/1/org/python/jython-standalone/2.5.3/jython-standalone-2.5.3.jar/Lib/threading.py",
line 170, in run
      self._target(*self._args, **self._kwargs)
    File "<https://builds.apache.org/job/Qpid-proton-jni/ws/proton/tests/python/proton_tests/messenger.py",>
line 84, in run_server
      self.server.recv(self.server_credit)
    File "<https://builds.apache.org/job/Qpid-proton-jni/ws/proton/tests/python/proton_tests/messenger.py",>
line 84, in run_server
      self.server.recv(self.server_credit)
    File "__pyclasspath__/proton.py", line 1297, in recv
  MessengerException: org.apache.qpid.proton.messenger.MessengerException
proton_tests.messenger.MessengerTest.testSendReceive100K ................ pass
proton_tests.messenger.MessengerTest.testSendReceive10K ................. start
  Exception in thread server-thread:Traceback (most recent call last):
    File "/home/jenkins/jenkins-slave/maven-repositories/1/org/python/jython-standalone/2.5.3/jython-standalone-2.5.3.jar/Lib/threading.py",
line 179, in _Thread__bootstrap
      self.run()
    File "/home/jenkins/jenkins-slave/maven-repositories/1/org/python/jython-standalone/2.5.3/jython-standalone-2.5.3.jar/Lib/threading.py",
line 170, in run
      self._target(*self._args, **self._kwargs)
    File "<https://builds.apache.org/job/Qpid-proton-jni/ws/proton/tests/python/proton_tests/messenger.py",>
line 84, in run_server
      self.server.recv(self.server_credit)
    File "<https://builds.apache.org/job/Qpid-proton-jni/ws/proton/tests/python/proton_tests/messenger.py",>
line 84, in run_server
      self.server.recv(self.server_credit)
    File "__pyclasspath__/proton.py", line 1297, in recv
  MessengerException: org.apache.qpid.proton.messenger.MessengerException
proton_tests.messenger.MessengerTest.testSendReceive10K ................. pass
proton_tests.messenger.MessengerTest.testSendReceive1K .................. start
  Exception in thread server-thread:Traceback (most recent call last):
    File "/home/jenkins/jenkins-slave/maven-repositories/1/org/python/jython-standalone/2.5.3/jython-standalone-2.5.3.jar/Lib/threading.py",
line 179, in _Thread__bootstrap
      self.run()
    File "/home/jenkins/jenkins-slave/maven-repositories/1/org/python/jython-standalone/2.5.3/jython-standalone-2.5.3.jar/Lib/threading.py",
line 170, in run
      self._target(*self._args, **self._kwargs)
    File "<https://builds.apache.org/job/Qpid-proton-jni/ws/proton/tests/python/proton_tests/messenger.py",>
line 84, in run_server
      self.server.recv(self.server_credit)
    File "<https://builds.apache.org/job/Qpid-proton-jni/ws/proton/tests/python/proton_tests/messenger.py",>
line 84, in run_server
      self.server.recv(self.server_credit)
    File "__pyclasspath__/proton.py", line 1297, in recv
  MessengerException: org.apache.qpid.proton.messenger.MessengerException
proton_tests.messenger.MessengerTest.testSendReceive1K .................. pass
proton_tests.messenger.MessengerTest.testSendReceive1M .................. start
  Exception in thread server-thread:Traceback (most recent call last):
    File "/home/jenkins/jenkins-slave/maven-repositories/1/org/python/jython-standalone/2.5.3/jython-standalone-2.5.3.jar/Lib/threading.py",
line 179, in _Thread__bootstrap
      self.run()
    File "/home/jenkins/jenkins-slave/maven-repositories/1/org/python/jython-standalone/2.5.3/jython-standalone-2.5.3.jar/Lib/threading.py",
line 170, in run
      self._target(*self._args, **self._kwargs)
    File "<https://builds.apache.org/job/Qpid-proton-jni/ws/proton/tests/python/proton_tests/messenger.py",>
line 84, in run_server
      self.server.recv(self.server_credit)
    File "<https://builds.apache.org/job/Qpid-proton-jni/ws/proton/tests/python/proton_tests/messenger.py",>
line 84, in run_server
      self.server.recv(self.server_credit)
    File "__pyclasspath__/proton.py", line 1297, in recv
  MessengerException: org.apache.qpid.proton.messenger.MessengerException
proton_tests.messenger.MessengerTest.testSendReceive1M .................. pass
proton_tests.messenger.MessengerTest.testSendReceive2K .................. start
  Exception in thread server-thread:Traceback (most recent call last):
    File "/home/jenkins/jenkins-slave/maven-repositories/1/org/python/jython-standalone/2.5.3/jython-standalone-2.5.3.jar/Lib/threading.py",
line 179, in _Thread__bootstrap
      self.run()
    File "/home/jenkins/jenkins-slave/maven-repositories/1/org/python/jython-standalone/2.5.3/jython-standalone-2.5.3.jar/Lib/threading.py",
line 170, in run
      self._target(*self._args, **self._kwargs)
    File "<https://builds.apache.org/job/Qpid-proton-jni/ws/proton/tests/python/proton_tests/messenger.py",>
line 84, in run_server
      self.server.recv(self.server_credit)
    File "<https://builds.apache.org/job/Qpid-proton-jni/ws/proton/tests/python/proton_tests/messenger.py",>
line 84, in run_server
      self.server.recv(self.server_credit)
    File "__pyclasspath__/proton.py", line 1297, in recv
  MessengerException: org.apache.qpid.proton.messenger.MessengerException
proton_tests.messenger.MessengerTest.testSendReceive2K .................. pass
proton_tests.messenger.MessengerTest.testSendReceive4K .................. start
  Exception in thread server-thread:Traceback (most recent call last):
    File "/home/jenkins/jenkins-slave/maven-repositories/1/org/python/jython-standalone/2.5.3/jython-standalone-2.5.3.jar/Lib/threading.py",
line 179, in _Thread__bootstrap
      self.run()
    File "/home/jenkins/jenkins-slave/maven-repositories/1/org/python/jython-standalone/2.5.3/jython-standalone-2.5.3.jar/Lib/threading.py",
line 170, in run
      self._target(*self._args, **self._kwargs)
    File "<https://builds.apache.org/job/Qpid-proton-jni/ws/proton/tests/python/proton_tests/messenger.py",>
line 84, in run_server
      self.server.recv(self.server_credit)
    File "<https://builds.apache.org/job/Qpid-proton-jni/ws/proton/tests/python/proton_tests/messenger.py",>
line 84, in run_server
      self.server.recv(self.server_credit)
    File "__pyclasspath__/proton.py", line 1297, in recv
  MessengerException: org.apache.qpid.proton.messenger.MessengerException
proton_tests.messenger.MessengerTest.testSendReceive4K .................. pass
proton_tests.messenger.MessengerTest.testUnlimitedCredit ................ start
  Exception in thread server-thread:Traceback (most recent call last):
    File "/home/jenkins/jenkins-slave/maven-repositories/1/org/python/jython-standalone/2.5.3/jython-standalone-2.5.3.jar/Lib/threading.py",
line 179, in _Thread__bootstrap
      self.run()
    File "/home/jenkins/jenkins-slave/maven-repositories/1/org/python/jython-standalone/2.5.3/jython-standalone-2.5.3.jar/Lib/threading.py",
line 170, in run
      self._target(*self._args, **self._kwargs)
    File "<https://builds.apache.org/job/Qpid-proton-jni/ws/proton/tests/python/proton_tests/messenger.py",>
line 84, in run_server
      self.server.recv(self.server_credit)
    File "<https://builds.apache.org/job/Qpid-proton-jni/ws/proton/tests/python/proton_tests/messenger.py",>
line 84, in run_server
      self.server.recv(self.server_credit)
    File "__pyclasspath__/proton.py", line 1297, in recv
  MessengerException: org.apache.qpid.proton.messenger.MessengerException
proton_tests.messenger.MessengerTest.testUnlimitedCredit ................ pass
proton_tests.messenger.MessengerTest.test_proton222 ..................... start
  Exception in thread server-thread:Traceback (most recent call last):
    File "/home/jenkins/jenkins-slave/maven-repositories/1/org/python/jython-standalone/2.5.3/jython-standalone-2.5.3.jar/Lib/threading.py",
line 179, in _Thread__bootstrap
      self.run()
    File "/home/jenkins/jenkins-slave/maven-repositories/1/org/python/jython-standalone/2.5.3/jython-standalone-2.5.3.jar/Lib/threading.py",
line 170, in run
      self._target(*self._args, **self._kwargs)
    File "<https://builds.apache.org/job/Qpid-proton-jni/ws/proton/tests/python/proton_tests/messenger.py",>
line 84, in run_server
      self.server.recv(self.server_credit)
    File "<https://builds.apache.org/job/Qpid-proton-jni/ws/proton/tests/python/proton_tests/messenger.py",>
line 84, in run_server
      self.server.recv(self.server_credit)
    File "__pyclasspath__/proton.py", line 1297, in recv
  MessengerException: org.apache.qpid.proton.messenger.MessengerException
proton_tests.messenger.MessengerTest.test_proton222 ..................... pass
proton_tests.messenger.NBMessengerTest.testPushback ..................... pass
proton_tests.messenger.NBMessengerTest.testSmoke ........................ pass
proton_tests.messenger.NBMessengerTest.testSmoke1024 .................... pass
proton_tests.messenger.NBMessengerTest.testSmoke4096 .................... pass
proton_tests.sasl.SaslTest.testChallengeResponse ........................ pass
proton_tests.sasl.SaslTest.testFracturedSASL ............................ pass
proton_tests.sasl.SaslTest.testInitialResponse .......................... pass
proton_tests.sasl.SaslTest.testPipelined ................................ pass
proton_tests.sasl.SaslTest.testPipelined2 ............................... skip
  ProtonUnsupportedOperationException: org.apache.qpid.proton.ProtonUnsupportedOperationException
proton_tests.sasl.SaslTest.testSaslAndAmqpInSingleChunk ................. skip
  ProtonUnsupportedOperationException: org.apache.qpid.proton.ProtonUnsupportedOperationException
proton_tests.ssl.SslTest. \
    test_allow_unsecured_client_which_connects_secured .................. skip
  ProtonUnsupportedOperationException: org.apache.qpid.proton.ProtonUnsupportedOperationException
proton_tests.ssl.SslTest. \
    test_allow_unsecured_client_which_connects_unsecured ................ skip
  ProtonUnsupportedOperationException: org.apache.qpid.proton.ProtonUnsupportedOperationException
proton_tests.ssl.SslTest.test_bad_server_certificate .................... skip
  ProtonUnsupportedOperationException: org.apache.qpid.proton.ProtonUnsupportedOperationException
proton_tests.ssl.SslTest.test_client_authentication ..................... skip
  ProtonUnsupportedOperationException: org.apache.qpid.proton.ProtonUnsupportedOperationException
proton_tests.ssl.SslTest.test_client_authentication_fail_bad_cert ....... skip
  ProtonUnsupportedOperationException: org.apache.qpid.proton.ProtonUnsupportedOperationException
proton_tests.ssl.SslTest.test_client_authentication_fail_no_cert ........ skip
  ProtonUnsupportedOperationException: org.apache.qpid.proton.ProtonUnsupportedOperationException
proton_tests.ssl.SslTest.test_client_server_authentication .............. skip
  ProtonUnsupportedOperationException: org.apache.qpid.proton.ProtonUnsupportedOperationException
proton_tests.ssl.SslTest.test_defaults .................................. skip
  ProtonUnsupportedOperationException: org.apache.qpid.proton.ProtonUnsupportedOperationException
proton_tests.ssl.SslTest.test_disallow_unsecured_client ................. skip
  ProtonUnsupportedOperationException: org.apache.qpid.proton.ProtonUnsupportedOperationException
proton_tests.ssl.SslTest.test_multiple_sessions ......................... skip
  ProtonUnsupportedOperationException: org.apache.qpid.proton.ProtonUnsupportedOperationException
proton_tests.ssl.SslTest.test_server_authentication ..................... skip
  ProtonUnsupportedOperationException: org.apache.qpid.proton.ProtonUnsupportedOperationException
proton_tests.ssl.SslTest.test_server_certificate ........................ skip
  ProtonUnsupportedOperationException: org.apache.qpid.proton.ProtonUnsupportedOperationException
proton_tests.ssl.SslTest.test_server_hostname_authentication ............ skip
  ProtonUnsupportedOperationException: org.apache.qpid.proton.ProtonUnsupportedOperationException
proton_tests.ssl.SslTest.test_server_only_authentication ................ skip
  ProtonUnsupportedOperationException: org.apache.qpid.proton.ProtonUnsupportedOperationException
proton_tests.ssl.SslTest.test_session_resume ............................ skip
  ProtonUnsupportedOperationException: org.apache.qpid.proton.ProtonUnsupportedOperationException
proton_tests.ssl.SslTest.test_ssl_with_small_buffer ..................... skip
  ProtonUnsupportedOperationException: org.apache.qpid.proton.ProtonUnsupportedOperationException
proton_tests.transport.TransportTest.testBigGarbage .....................[0x7fde581075f0:0]
ERROR[-2] AMQP header mismatch: 'GARBAGE_XXX'
[0x7fde581075f0:0] ERROR[-2] AMQP header mismatch: ''
 pass
proton_tests.transport.TransportTest.testBindAfterOpen .................. skip
  ProtonUnsupportedOperationException: org.apache.qpid.proton.ProtonUnsupportedOperationException
proton_tests.transport.TransportTest.testEOS ............................[0x7fdecbcebe10:0]
ERROR[-2] AMQP header mismatch: ''
 pass
proton_tests.transport.TransportTest.testGarbage ........................[0x7fdecbb3c810:0]
ERROR[-2] AMQP header mismatch: 'GARBAGE_'
[0x7fdecbb3c810:0] ERROR[-2] AMQP header mismatch: ''
 pass
proton_tests.transport.TransportTest.testHeader .........................ERROR amqp:connection:framing-error
connection aborted
[0x7fdecba6f1a0:0] ERROR[-2] connection aborted
 pass
proton_tests.transport.TransportTest.testOutput ......................... pass
proton_tests.transport.TransportTest.testPartial ........................[0x7fdecb71f100:0]
ERROR[-2] AMQP header mismatch: ''
 pass
proton_tests.transport.TransportTest.testSmallGarbage ...................[0x7fdecb57b3e0:0]
ERROR[-2] AMQP header mismatch: 'XXX'
[0x7fdecb57b3e0:0] ERROR[-2] AMQP header mismatch: ''
 pass
Totals: 246 tests, 94 passed, 127 skipped, 25 ignored, 0 failed
Tests run: 1, Failures: 0, Errors: 0, Skipped: 0, Time elapsed: 13.234 sec
Running org.apache.qpid.proton.InteropTest
Tests run: 8, Failures: 0, Errors: 0, Skipped: 0, Time elapsed: 0.005 sec

Results :

Tests run: 34, Failures: 0, Errors: 0, Skipped: 6

ERROR: Maven JVM terminated unexpectedly with exit code 143


Mime
View raw message