qpid-notifications mailing list archives

Site index · List index
Message view « Date » · « Thread »
Top « Date » · « Thread »
From Apache Jenkins Server <jenk...@builds.apache.org>
Subject Build failed in Jenkins: Qpid-Java-Java-MMS-TestMatrix » JDK 1.6 (latest),Ubuntu,java-mms.0-10 #1237
Date Fri, 09 Aug 2013 17:20:42 GMT
See <https://builds.apache.org/job/Qpid-Java-Java-MMS-TestMatrix/jdk=JDK%201.6%20(latest),label=Ubuntu,profile=java-mms.0-10/1237/changes>

Changes:

[rgodfrey] QPID-5065 : [Java] tests do not run on Windows

------------------------------------------
[...truncated 2034 lines...]
build:
     [echo] Running ant for module : broker-plugins/amqp-msg-conv-0-8-to-0-10

prepare:
    [mkdir] Created dir: <https://builds.apache.org/job/Qpid-Java-Java-MMS-TestMatrix/jdk=JDK%201.6%20(latest),label=Ubuntu,profile=java-mms.0-10/ws/trunk/qpid/java/build/scratch/broker-plugins/amqp-msg-conv-0-8-to-0-10/classes>
    [mkdir] Created dir: <https://builds.apache.org/job/Qpid-Java-Java-MMS-TestMatrix/jdk=JDK%201.6%20(latest),label=Ubuntu,profile=java-mms.0-10/ws/trunk/qpid/java/build/scratch/broker-plugins/amqp-msg-conv-0-8-to-0-10/src>
    [mkdir] Created dir: <https://builds.apache.org/job/Qpid-Java-Java-MMS-TestMatrix/jdk=JDK%201.6%20(latest),label=Ubuntu,profile=java-mms.0-10/ws/trunk/qpid/java/build/api/broker-plugins/amqp-msg-conv-0-8-to-0-10>
    [mkdir] Created dir: <https://builds.apache.org/job/Qpid-Java-Java-MMS-TestMatrix/jdk=JDK%201.6%20(latest),label=Ubuntu,profile=java-mms.0-10/ws/trunk/qpid/java/build/test-api/broker-plugins/amqp-msg-conv-0-8-to-0-10>
    [mkdir] Created dir: <https://builds.apache.org/job/Qpid-Java-Java-MMS-TestMatrix/jdk=JDK%201.6%20(latest),label=Ubuntu,profile=java-mms.0-10/ws/trunk/qpid/java/build/scratch/broker-plugins/amqp-msg-conv-0-8-to-0-10/test/classes>
    [mkdir] Created dir: <https://builds.apache.org/job/Qpid-Java-Java-MMS-TestMatrix/jdk=JDK%201.6%20(latest),label=Ubuntu,profile=java-mms.0-10/ws/trunk/qpid/java/build/results/broker-plugins/amqp-msg-conv-0-8-to-0-10>

precompile:

compile:
     [echo] Targeting : 1.5
    [javac] Compiling 2 source files to <https://builds.apache.org/job/Qpid-Java-Java-MMS-TestMatrix/jdk=JDK%201.6%20(latest),label=Ubuntu,profile=java-mms.0-10/ws/trunk/qpid/java/build/scratch/broker-plugins/amqp-msg-conv-0-8-to-0-10/classes>

copy-resources:
     [echo] Copying resources from <https://builds.apache.org/job/Qpid-Java-Java-MMS-TestMatrix/jdk=JDK%201.6%20(latest),label=Ubuntu,profile=java-mms.0-10/ws/trunk/qpid/java/broker-plugins/amqp-msg-conv-0-8-to-0-10/src/main/resources>
to <https://builds.apache.org/job/Qpid-Java-Java-MMS-TestMatrix/jdk=JDK%201.6%20(latest),label=Ubuntu,profile=java-mms.0-10/ws/trunk/qpid/java/build/scratch/broker-plugins/amqp-msg-conv-0-8-to-0-10/classes...>

copy-project-resources-metainf:
     [copy] Copying 3 files to <https://builds.apache.org/job/Qpid-Java-Java-MMS-TestMatrix/jdk=JDK%201.6%20(latest),label=Ubuntu,profile=java-mms.0-10/ws/trunk/qpid/java/build/scratch/broker-plugins/amqp-msg-conv-0-8-to-0-10/META-INF>

copy-module-resources-metainf:

copy-module-src-resources-metainf:
     [copy] Copying 1 file to <https://builds.apache.org/job/Qpid-Java-Java-MMS-TestMatrix/jdk=JDK%201.6%20(latest),label=Ubuntu,profile=java-mms.0-10/ws/trunk/qpid/java/build/scratch/broker-plugins/amqp-msg-conv-0-8-to-0-10/META-INF>

copy-files-to-module-metainf:

jar.manifest:

jar.nomanifest:
      [jar] Building jar: <https://builds.apache.org/job/Qpid-Java-Java-MMS-TestMatrix/jdk=JDK%201.6%20(latest),label=Ubuntu,profile=java-mms.0-10/ws/trunk/qpid/java/build/lib/qpid-broker-plugins-amqp-msg-conv-0-8-to-0-10-0.25.jar>

jar:

precompile-tests:

compile-tests:

copy-test-resources:

jar-tests:
      [jar] Building MANIFEST-only jar: <https://builds.apache.org/job/Qpid-Java-Java-MMS-TestMatrix/jdk=JDK%201.6%20(latest),label=Ubuntu,profile=java-mms.0-10/ws/trunk/qpid/java/build/lib/qpid-broker-plugins-amqp-msg-conv-0-8-to-0-10-tests-0.25.jar>

jar-sources:
      [jar] Building jar: <https://builds.apache.org/job/Qpid-Java-Java-MMS-TestMatrix/jdk=JDK%201.6%20(latest),label=Ubuntu,profile=java-mms.0-10/ws/trunk/qpid/java/build/lib/qpid-broker-plugins-amqp-msg-conv-0-8-to-0-10-0.25-sources.jar>

libs:

copy-bin:

copy-etc:

postbuild:

copy-broker-plugin-jars:
     [copy] Copying 1 file to <https://builds.apache.org/job/Qpid-Java-Java-MMS-TestMatrix/jdk=JDK%201.6%20(latest),label=Ubuntu,profile=java-mms.0-10/ws/trunk/qpid/java/build/scratch/broker-plugins/lib>

build:
     [echo] Running ant for module : broker-plugins/amqp-msg-conv-0-8-to-1-0

prepare:
    [mkdir] Created dir: <https://builds.apache.org/job/Qpid-Java-Java-MMS-TestMatrix/jdk=JDK%201.6%20(latest),label=Ubuntu,profile=java-mms.0-10/ws/trunk/qpid/java/build/scratch/broker-plugins/amqp-msg-conv-0-8-to-1-0/classes>
    [mkdir] Created dir: <https://builds.apache.org/job/Qpid-Java-Java-MMS-TestMatrix/jdk=JDK%201.6%20(latest),label=Ubuntu,profile=java-mms.0-10/ws/trunk/qpid/java/build/scratch/broker-plugins/amqp-msg-conv-0-8-to-1-0/src>
    [mkdir] Created dir: <https://builds.apache.org/job/Qpid-Java-Java-MMS-TestMatrix/jdk=JDK%201.6%20(latest),label=Ubuntu,profile=java-mms.0-10/ws/trunk/qpid/java/build/api/broker-plugins/amqp-msg-conv-0-8-to-1-0>
    [mkdir] Created dir: <https://builds.apache.org/job/Qpid-Java-Java-MMS-TestMatrix/jdk=JDK%201.6%20(latest),label=Ubuntu,profile=java-mms.0-10/ws/trunk/qpid/java/build/test-api/broker-plugins/amqp-msg-conv-0-8-to-1-0>
    [mkdir] Created dir: <https://builds.apache.org/job/Qpid-Java-Java-MMS-TestMatrix/jdk=JDK%201.6%20(latest),label=Ubuntu,profile=java-mms.0-10/ws/trunk/qpid/java/build/scratch/broker-plugins/amqp-msg-conv-0-8-to-1-0/test/classes>
    [mkdir] Created dir: <https://builds.apache.org/job/Qpid-Java-Java-MMS-TestMatrix/jdk=JDK%201.6%20(latest),label=Ubuntu,profile=java-mms.0-10/ws/trunk/qpid/java/build/results/broker-plugins/amqp-msg-conv-0-8-to-1-0>

precompile:

compile:
     [echo] Targeting : 1.5
    [javac] Compiling 1 source file to <https://builds.apache.org/job/Qpid-Java-Java-MMS-TestMatrix/jdk=JDK%201.6%20(latest),label=Ubuntu,profile=java-mms.0-10/ws/trunk/qpid/java/build/scratch/broker-plugins/amqp-msg-conv-0-8-to-1-0/classes>

copy-resources:
     [echo] Copying resources from <https://builds.apache.org/job/Qpid-Java-Java-MMS-TestMatrix/jdk=JDK%201.6%20(latest),label=Ubuntu,profile=java-mms.0-10/ws/trunk/qpid/java/broker-plugins/amqp-msg-conv-0-8-to-1-0/src/main/resources>
to <https://builds.apache.org/job/Qpid-Java-Java-MMS-TestMatrix/jdk=JDK%201.6%20(latest),label=Ubuntu,profile=java-mms.0-10/ws/trunk/qpid/java/build/scratch/broker-plugins/amqp-msg-conv-0-8-to-1-0/classes...>

copy-project-resources-metainf:
     [copy] Copying 3 files to <https://builds.apache.org/job/Qpid-Java-Java-MMS-TestMatrix/jdk=JDK%201.6%20(latest),label=Ubuntu,profile=java-mms.0-10/ws/trunk/qpid/java/build/scratch/broker-plugins/amqp-msg-conv-0-8-to-1-0/META-INF>

copy-module-resources-metainf:

copy-module-src-resources-metainf:
     [copy] Copying 1 file to <https://builds.apache.org/job/Qpid-Java-Java-MMS-TestMatrix/jdk=JDK%201.6%20(latest),label=Ubuntu,profile=java-mms.0-10/ws/trunk/qpid/java/build/scratch/broker-plugins/amqp-msg-conv-0-8-to-1-0/META-INF>

copy-files-to-module-metainf:

jar.manifest:

jar.nomanifest:
      [jar] Building jar: <https://builds.apache.org/job/Qpid-Java-Java-MMS-TestMatrix/jdk=JDK%201.6%20(latest),label=Ubuntu,profile=java-mms.0-10/ws/trunk/qpid/java/build/lib/qpid-broker-plugins-amqp-msg-conv-0-8-to-1-0-0.25.jar>

jar:

precompile-tests:

compile-tests:

copy-test-resources:

jar-tests:
      [jar] Building MANIFEST-only jar: <https://builds.apache.org/job/Qpid-Java-Java-MMS-TestMatrix/jdk=JDK%201.6%20(latest),label=Ubuntu,profile=java-mms.0-10/ws/trunk/qpid/java/build/lib/qpid-broker-plugins-amqp-msg-conv-0-8-to-1-0-tests-0.25.jar>

jar-sources:
      [jar] Building jar: <https://builds.apache.org/job/Qpid-Java-Java-MMS-TestMatrix/jdk=JDK%201.6%20(latest),label=Ubuntu,profile=java-mms.0-10/ws/trunk/qpid/java/build/lib/qpid-broker-plugins-amqp-msg-conv-0-8-to-1-0-0.25-sources.jar>

libs:

copy-bin:

copy-etc:

postbuild:

copy-broker-plugin-jars:
     [copy] Copying 1 file to <https://builds.apache.org/job/Qpid-Java-Java-MMS-TestMatrix/jdk=JDK%201.6%20(latest),label=Ubuntu,profile=java-mms.0-10/ws/trunk/qpid/java/build/scratch/broker-plugins/lib>

build:
     [echo] Running ant for module : broker-plugins/derby-store

prepare:
    [mkdir] Created dir: <https://builds.apache.org/job/Qpid-Java-Java-MMS-TestMatrix/jdk=JDK%201.6%20(latest),label=Ubuntu,profile=java-mms.0-10/ws/trunk/qpid/java/build/scratch/broker-plugins/derby-store/classes>
    [mkdir] Created dir: <https://builds.apache.org/job/Qpid-Java-Java-MMS-TestMatrix/jdk=JDK%201.6%20(latest),label=Ubuntu,profile=java-mms.0-10/ws/trunk/qpid/java/build/scratch/broker-plugins/derby-store/src>
    [mkdir] Created dir: <https://builds.apache.org/job/Qpid-Java-Java-MMS-TestMatrix/jdk=JDK%201.6%20(latest),label=Ubuntu,profile=java-mms.0-10/ws/trunk/qpid/java/build/api/broker-plugins/derby-store>
    [mkdir] Created dir: <https://builds.apache.org/job/Qpid-Java-Java-MMS-TestMatrix/jdk=JDK%201.6%20(latest),label=Ubuntu,profile=java-mms.0-10/ws/trunk/qpid/java/build/test-api/broker-plugins/derby-store>
    [mkdir] Created dir: <https://builds.apache.org/job/Qpid-Java-Java-MMS-TestMatrix/jdk=JDK%201.6%20(latest),label=Ubuntu,profile=java-mms.0-10/ws/trunk/qpid/java/build/scratch/broker-plugins/derby-store/test/classes>
    [mkdir] Created dir: <https://builds.apache.org/job/Qpid-Java-Java-MMS-TestMatrix/jdk=JDK%201.6%20(latest),label=Ubuntu,profile=java-mms.0-10/ws/trunk/qpid/java/build/results/broker-plugins/derby-store>

precompile:

compile:
     [echo] Targeting : 1.5
    [javac] Compiling 2 source files to <https://builds.apache.org/job/Qpid-Java-Java-MMS-TestMatrix/jdk=JDK%201.6%20(latest),label=Ubuntu,profile=java-mms.0-10/ws/trunk/qpid/java/build/scratch/broker-plugins/derby-store/classes>
    [javac] Note: <https://builds.apache.org/job/Qpid-Java-Java-MMS-TestMatrix/jdk=JDK%201.6%20(latest),label=Ubuntu,profile=java-mms.0-10/ws/trunk/qpid/java/broker-plugins/derby-store/src/main/java/org/apache/qpid/server/store/derby/DerbyMessageStore.java>
uses unchecked or unsafe operations.
    [javac] Note: Recompile with -Xlint:unchecked for details.
     [copy] Copying 2 files to <https://builds.apache.org/job/Qpid-Java-Java-MMS-TestMatrix/jdk=JDK%201.6%20(latest),label=Ubuntu,profile=java-mms.0-10/ws/trunk/qpid/java/build/scratch/broker-plugins/derby-store/classes>
     [copy] Copying <https://builds.apache.org/job/Qpid-Java-Java-MMS-TestMatrix/jdk=JDK%201.6%20(latest),label=Ubuntu,profile=java-mms.0-10/ws/trunk/qpid/java/broker-plugins/derby-store/src/main/java/resources/js/qpid/management/virtualhost/store/derby/add.js>
to <https://builds.apache.org/job/Qpid-Java-Java-MMS-TestMatrix/jdk=JDK%201.6%20(latest),label=Ubuntu,profile=java-mms.0-10/ws/trunk/qpid/java/build/scratch/broker-plugins/derby-store/classes/resources/js/qpid/management/virtualhost/store/derby/add.js>
     [copy] Copying <https://builds.apache.org/job/Qpid-Java-Java-MMS-TestMatrix/jdk=JDK%201.6%20(latest),label=Ubuntu,profile=java-mms.0-10/ws/trunk/qpid/java/broker-plugins/derby-store/src/main/java/resources/virtualhost/store/derby/add.html>
to <https://builds.apache.org/job/Qpid-Java-Java-MMS-TestMatrix/jdk=JDK%201.6%20(latest),label=Ubuntu,profile=java-mms.0-10/ws/trunk/qpid/java/build/scratch/broker-plugins/derby-store/classes/resources/virtualhost/store/derby/add.html>

copy-resources:
     [echo] Copying resources from <https://builds.apache.org/job/Qpid-Java-Java-MMS-TestMatrix/jdk=JDK%201.6%20(latest),label=Ubuntu,profile=java-mms.0-10/ws/trunk/qpid/java/broker-plugins/derby-store/src/main/resources>
to <https://builds.apache.org/job/Qpid-Java-Java-MMS-TestMatrix/jdk=JDK%201.6%20(latest),label=Ubuntu,profile=java-mms.0-10/ws/trunk/qpid/java/build/scratch/broker-plugins/derby-store/classes...>

copy-project-resources-metainf:
     [copy] Copying 3 files to <https://builds.apache.org/job/Qpid-Java-Java-MMS-TestMatrix/jdk=JDK%201.6%20(latest),label=Ubuntu,profile=java-mms.0-10/ws/trunk/qpid/java/build/scratch/broker-plugins/derby-store/META-INF>

copy-module-resources-metainf:

copy-module-src-resources-metainf:
     [copy] Copying 1 file to <https://builds.apache.org/job/Qpid-Java-Java-MMS-TestMatrix/jdk=JDK%201.6%20(latest),label=Ubuntu,profile=java-mms.0-10/ws/trunk/qpid/java/build/scratch/broker-plugins/derby-store/META-INF>

copy-files-to-module-metainf:

jar.manifest:

jar.nomanifest:
      [jar] Building jar: <https://builds.apache.org/job/Qpid-Java-Java-MMS-TestMatrix/jdk=JDK%201.6%20(latest),label=Ubuntu,profile=java-mms.0-10/ws/trunk/qpid/java/build/lib/qpid-broker-plugins-derby-store-0.25.jar>

jar:

precompile-tests:

compile-tests:
    [javac] Compiling 3 source files to <https://builds.apache.org/job/Qpid-Java-Java-MMS-TestMatrix/jdk=JDK%201.6%20(latest),label=Ubuntu,profile=java-mms.0-10/ws/trunk/qpid/java/build/scratch/broker-plugins/derby-store/test/classes>

copy-test-resources:

jar-tests:
      [jar] Building jar: <https://builds.apache.org/job/Qpid-Java-Java-MMS-TestMatrix/jdk=JDK%201.6%20(latest),label=Ubuntu,profile=java-mms.0-10/ws/trunk/qpid/java/build/lib/qpid-broker-plugins-derby-store-tests-0.25.jar>

jar-sources:
      [jar] Building jar: <https://builds.apache.org/job/Qpid-Java-Java-MMS-TestMatrix/jdk=JDK%201.6%20(latest),label=Ubuntu,profile=java-mms.0-10/ws/trunk/qpid/java/build/lib/qpid-broker-plugins-derby-store-0.25-sources.jar>

libs:

copy-bin:

copy-etc:

postbuild:

copy-broker-plugin-jars:
     [copy] Copying 1 file to <https://builds.apache.org/job/Qpid-Java-Java-MMS-TestMatrix/jdk=JDK%201.6%20(latest),label=Ubuntu,profile=java-mms.0-10/ws/trunk/qpid/java/build/scratch/broker-plugins/lib>

build:
     [echo] Running ant for module : broker-plugins/jdbc-provider-bone

check-request-props:
     [echo] Running ant for module : broker-plugins/jdbc-provider-bone

download-ivy:

load-ivy:

configure-ivy:
[ivy:configure] :: Ivy 2.2.0 - 20100923230623 :: http://ant.apache.org/ivy/ ::
[ivy:configure] :: loading settings :: file = <https://builds.apache.org/job/Qpid-Java-Java-MMS-TestMatrix/jdk=JDK%201.6%20(latest),label=Ubuntu,profile=java-mms.0-10/ws/trunk/qpid/java/ivysettings.retrieve.xml>

download-bone:
     [echo] Resolving and retrieving dependencies...
[ivy:resolve] :: resolving dependencies :: org/apache#qpid;0.25
[ivy:resolve] 	confs: [bonecp]
[ivy:resolve] 	found com.jolbox#bonecp;0.7.1.RELEASE in chain
[ivy:resolve] 	found com.google.guava#guava;14.0.1 in m2repo
[ivy:resolve] downloading http://repo1.maven.org/maven2/com/google/guava/guava/14.0.1/guava-14.0.1.jar
...
[ivy:resolve] .. (0kB)
[ivy:resolve] .. (0kB)
[ivy:resolve] :: resolution report :: resolve 742ms :: artifacts dl 14ms
	---------------------------------------------------------------------
	|                  |            modules            ||   artifacts   |
	|       conf       | number| search|dwnlded|evicted|| number|dwnlded|
	---------------------------------------------------------------------
	|      bonecp      |   2   |   1   |   1   |   0   ||   2   |   0   |
	---------------------------------------------------------------------
[ivy:resolve] 
[ivy:resolve] :: problems summary ::
[ivy:resolve] :::: WARNINGS
[ivy:resolve] 		[FAILED     ] com.google.guava#guava;14.0.1!guava.jar(bundle): invalid sha1:
expected= computed=63801e851fe885601a0bd0eceb6501f7db37e47e (10ms)
[ivy:resolve] 		[FAILED     ] com.google.guava#guava;14.0.1!guava.jar(bundle): invalid sha1:
expected= computed=63801e851fe885601a0bd0eceb6501f7db37e47e (10ms)
[ivy:resolve] 	==== m2repo: tried
[ivy:resolve] 	  http://repo1.maven.org/maven2/com/google/guava/guava/14.0.1/guava-14.0.1.jar
[ivy:resolve] 		::::::::::::::::::::::::::::::::::::::::::::::
[ivy:resolve] 		::              FAILED DOWNLOADS            ::
[ivy:resolve] 		:: ^ see resolution messages for details  ^ ::
[ivy:resolve] 		::::::::::::::::::::::::::::::::::::::::::::::
[ivy:resolve] 		:: com.google.guava#guava;14.0.1!guava.jar(bundle)
[ivy:resolve] 		::::::::::::::::::::::::::::::::::::::::::::::
[ivy:resolve] :::: ERRORS
[ivy:resolve] 	unknown resolver maven2
[ivy:resolve] 	unknown resolver default
[ivy:resolve] 	unknown resolver maven2
[ivy:resolve] 	unknown resolver maven2
[ivy:resolve] 
[ivy:resolve] :: USE VERBOSE OR DEBUG MESSAGE LEVEL FOR MORE DETAILS

BUILD FAILED
<https://builds.apache.org/job/Qpid-Java-Java-MMS-TestMatrix/jdk=JDK%201.6%20(latest),label=Ubuntu,profile=java-mms.0-10/ws/trunk/qpid/java/build.xml>:173:
The following error occurred while executing this line:
<https://builds.apache.org/job/Qpid-Java-Java-MMS-TestMatrix/jdk=JDK%201.6%20(latest),label=Ubuntu,profile=java-mms.0-10/ws/trunk/qpid/java/build.xml>:68:
The following error occurred while executing this line:
<https://builds.apache.org/job/Qpid-Java-Java-MMS-TestMatrix/jdk=JDK%201.6%20(latest),label=Ubuntu,profile=java-mms.0-10/ws/trunk/qpid/java/broker-plugins/jdbc-provider-bone/build.xml>:40:
The following error occurred while executing this line:
<https://builds.apache.org/job/Qpid-Java-Java-MMS-TestMatrix/jdk=JDK%201.6%20(latest),label=Ubuntu,profile=java-mms.0-10/ws/trunk/qpid/java/broker-plugins/jdbc-provider-bone/build.xml>:46:
impossible to resolve dependencies:
	resolve failed - see output for details

Total time: 1 minute 50 seconds
Build step 'Invoke Ant' marked build as failure
[locks-and-latches] Releasing all the locks
[locks-and-latches] All the locks released
Recording test results

Mime
View raw message