qpid-notifications mailing list archives

Site index · List index
Message view « Date » · « Thread »
Top « Date » · « Thread »
From Apache Jenkins Server <jenk...@builds.apache.org>
Subject Build failed in Jenkins: Qpid-proton-c #145
Date Mon, 05 Aug 2013 14:42:20 GMT
See <https://builds.apache.org/job/Qpid-proton-c/145/changes>

Changes:

[rhs] moved pn_config.h -> proton/version.h and install it

[rhs] bumped somajor version

------------------------------------------
Started by an SCM change
Building remotely on ubuntu4 in workspace <https://builds.apache.org/job/Qpid-proton-c/ws/>
Cleaning up <https://builds.apache.org/job/Qpid-proton-c/ws/proton>
Deleting <https://builds.apache.org/job/Qpid-proton-c/ws/proton/build>
Deleting <https://builds.apache.org/job/Qpid-proton-c/ws/proton/testresults>
Deleting <https://builds.apache.org/job/Qpid-proton-c/ws/proton/tests/python/proton_tests/__init__.pyc>
Deleting <https://builds.apache.org/job/Qpid-proton-c/ws/proton/tests/python/proton_tests/codec.pyc>
Deleting <https://builds.apache.org/job/Qpid-proton-c/ws/proton/tests/python/proton_tests/common.pyc>
Deleting <https://builds.apache.org/job/Qpid-proton-c/ws/proton/tests/python/proton_tests/engine.pyc>
Deleting <https://builds.apache.org/job/Qpid-proton-c/ws/proton/tests/python/proton_tests/interop.pyc>
Deleting <https://builds.apache.org/job/Qpid-proton-c/ws/proton/tests/python/proton_tests/message.pyc>
Deleting <https://builds.apache.org/job/Qpid-proton-c/ws/proton/tests/python/proton_tests/messenger.pyc>
Deleting <https://builds.apache.org/job/Qpid-proton-c/ws/proton/tests/python/proton_tests/sasl.pyc>
Deleting <https://builds.apache.org/job/Qpid-proton-c/ws/proton/tests/python/proton_tests/soak.pyc>
Deleting <https://builds.apache.org/job/Qpid-proton-c/ws/proton/tests/python/proton_tests/ssl.pyc>
Deleting <https://builds.apache.org/job/Qpid-proton-c/ws/proton/tests/python/proton_tests/transport.pyc>
Deleting <https://builds.apache.org/job/Qpid-proton-c/ws/proton/proton-c/src/protocol.pyc>
Deleting <https://builds.apache.org/job/Qpid-proton-c/ws/proton/proton-c/mllib/__init__.pyc>
Deleting <https://builds.apache.org/job/Qpid-proton-c/ws/proton/proton-c/mllib/dom.pyc>
Deleting <https://builds.apache.org/job/Qpid-proton-c/ws/proton/proton-c/mllib/parsers.pyc>
Deleting <https://builds.apache.org/job/Qpid-proton-c/ws/proton/proton-c/mllib/transforms.pyc>
Deleting <https://builds.apache.org/job/Qpid-proton-c/ws/proton/proton-c/bindings/python/proton.pyc>
Updating https://svn.apache.org/repos/asf/qpid/proton/trunk at revision '2013-08-05T14:42:06.731
+0000'
D         proton-c/pn_config.h.in
A         proton-c/include/proton/version.h.in
U         proton-c/soversion.cmake
U         proton-c/CMakeLists.txt
At revision 1510511
[Qpid-proton-c] $ /bin/bash -e /tmp/hudson2149121873743320129.sh
No LSB modules are available.
Arch: x86_64 Uname: Linux janus 3.2.0-38-generic #60-Ubuntu SMP Wed Feb 13 13:22:43 UTC 2013
x86_64 x86_64 x86_64 GNU/Linux lsb_release: Distributor ID: Ubuntu Description: Ubuntu 12.04.2
LTS Release: 12.04 Codename: precise
Java home:
=============
Listing pertinent packages
=============
-- The C compiler identification is GNU
-- Check for working C compiler: /usr/bin/gcc
-- Check for working C compiler: /usr/bin/gcc -- works
-- Detecting C compiler ABI info
-- Detecting C compiler ABI info - done
-- PN_VERSION: 0.5
-- Found Java: /usr/bin/java 
-- Java version: 1.6.0.27. javac is at: /usr/bin/javac
Loading Proton's UseJava module
-- Locations of Bouncycastle 1.47 jars: BOUNCYCASTLE_BCPROV_JAR-NOTFOUND BOUNCYCASTLE_BCPKIX_JAR-NOTFOUND
-- Won't build proton-j-impl because one or more Bouncycastle jars were not found. PROTON_JAR_DEPEND_DIR
was: /usr/share/java
-- checking for module 'openssl'
--   found openssl, version 1.0.1
-- Found OpenSSL: /usr/lib/x86_64-linux-gnu/libssl.so;/usr/lib/x86_64-linux-gnu/libcrypto.so
(found version "1..1")
-- Looking for clock_gettime
-- Looking for clock_gettime - not found.
-- Looking for clock_gettime in rt
-- Looking for clock_gettime in rt - found
-- Looking for uuid_generate
-- Looking for uuid_generate - not found.
-- Looking for uuid_generate in uuid
-- Looking for uuid_generate in uuid - found
-- Looking for strerror_r
-- Looking for strerror_r - found
-- Looking for atoll
-- Looking for atoll - found
-- Found SWIG: /usr/bin/swig2.0 (found version "2.0.4")
-- Found PythonLibs: /usr/lib/libpython2.7.so 
-- Found Ruby: /usr/bin/ruby (found version "1.8.7")
-- Found Perl: /usr/bin/perl 
-- Trying alternative search for Perl
-- PerlLibs Not Found
-- Could NOT find JNI (missing:  JAVA_AWT_LIBRARY JAVA_JVM_LIBRARY JAVA_INCLUDE_PATH JAVA_INCLUDE_PATH2
JAVA_AWT_INCLUDE_PATH) 
-- Found PythonInterp: /usr/bin/python (found version "2.7.3")
-- Could NOT find Doxygen (missing:  DOXYGEN_EXECUTABLE) 
-- Looking for include files INTTYPES_AVAILABLE
-- Looking for include files INTTYPES_AVAILABLE - found
-- Can't locate the valgrind command; no run-time error detection
-- Configuring done
-- Generating done
-- Build files have been written to: <https://builds.apache.org/job/Qpid-proton-c/ws/proton/build>
Scanning dependencies of target proton-api
[  2%] Building Java objects for proton-api.jar
[  5%] Generating CMakeFiles/proton-api.dir/java_class_filelist
[  7%] Creating Java archive proton-api-0.5.jar
Rebuilding proton-api-0.5.jar to include missing resources
[  7%] Built target proton-api
[ 10%] Generating protocol.h
[ 12%] Generating encodings.h
Scanning dependencies of target qpid-proton
[ 15%] Building C object proton-c/CMakeFiles/qpid-proton.dir/src/object/object.c.o
[ 17%] Building C object proton-c/CMakeFiles/qpid-proton.dir/src/util.c.o
[ 20%] Building C object proton-c/CMakeFiles/qpid-proton.dir/src/error.c.o
[ 23%] Building C object proton-c/CMakeFiles/qpid-proton.dir/src/buffer.c.o
[ 25%] Building C object proton-c/CMakeFiles/qpid-proton.dir/src/parser.c.o
[ 28%] Building C object proton-c/CMakeFiles/qpid-proton.dir/src/scanner.c.o
[ 30%] Building C object proton-c/CMakeFiles/qpid-proton.dir/src/types.c.o
[ 33%] Building C object proton-c/CMakeFiles/qpid-proton.dir/src/framing/framing.c.o
[ 35%] Building C object proton-c/CMakeFiles/qpid-proton.dir/src/codec/codec.c.o
[ 38%] Building C object proton-c/CMakeFiles/qpid-proton.dir/src/dispatcher/dispatcher.c.o
[ 41%] Building C object proton-c/CMakeFiles/qpid-proton.dir/src/engine/engine.c.o
[ 43%] Building C object proton-c/CMakeFiles/qpid-proton.dir/src/message/message.c.o
[ 46%] Building C object proton-c/CMakeFiles/qpid-proton.dir/src/sasl/sasl.c.o
[ 48%] Building C object proton-c/CMakeFiles/qpid-proton.dir/src/messenger/messenger.c.o
[ 51%] Building C object proton-c/CMakeFiles/qpid-proton.dir/src/messenger/store.c.o
[ 53%] Building C object proton-c/CMakeFiles/qpid-proton.dir/src/messenger/transform.c.o
[ 56%] Building C object proton-c/CMakeFiles/qpid-proton.dir/src/posix/driver.c.o
[ 58%] Building C object proton-c/CMakeFiles/qpid-proton.dir/src/platform.c.o
[ 61%] Building C object proton-c/CMakeFiles/qpid-proton.dir/src/ssl/openssl.c.o
Linking C shared library libqpid-proton.so
[ 61%] Built target qpid-proton
Scanning dependencies of target proton
[ 64%] Building C object proton-c/CMakeFiles/proton.dir/src/proton.c.o
<https://builds.apache.org/job/Qpid-proton-c/ws/proton/proton-c/src/proton.c>:37:23:
fatal error: pn_config.h: No such file or directory
compilation terminated.
make[2]: *** [proton-c/CMakeFiles/proton.dir/src/proton.c.o] Error 1
make[1]: *** [proton-c/CMakeFiles/proton.dir/all] Error 2
make: *** [all] Error 2
Build step 'Execute shell' marked build as failure
Recording test results

Mime
View raw message