qpid-notifications mailing list archives

Site index · List index
Message view « Date » · « Thread »
Top « Date » · « Thread »
From Apache Jenkins Server <jenk...@builds.apache.org>
Subject Build failed in Jenkins: Qpid-Java-Java-BDB-TestMatrix » JDK 1.6 (latest),Ubuntu,java-bdb.0-9-1 #995
Date Thu, 01 Aug 2013 11:46:24 GMT
See <https://builds.apache.org/job/Qpid-Java-Java-BDB-TestMatrix/jdk=JDK%201.6%20(latest),label=Ubuntu,profile=java-bdb.0-9-1/995/changes>

Changes:

[chug] QPID-5017: WinSDK build leaves release executables stranded in \bin directory
Delete them during install post-processing

[chug] QPID-5032: Windows install LICENSE and NOTICE files have moved

[chug] QPID-5029: WinSDK tries to handle components that have been removed

[chug] QPID-5028: Qmf2 examples install script error
Don't try to install files that don't exist.
This patch may be superseded by new CMake files or by the addition of the .sln and .vcproj
that are currently missing.

[astitcher] QPID-4942: Include file not part of supported API
(missed out from earlier commit)

[chug] QPID-5027: Windows examples installed to wrong directory

[chug] QPID-5029: WinSDK tries to handle components that have been removed

[gsim] QPID-5026: make receivers target and senders source configurable, defaulting to the
named node if not specified

------------------------------------------
[...truncated 5625 lines...]
    [junit] Running org.apache.qpid.server.store.berkeleydb.HAMessageStoreSmokeTest
    [junit] Tests run: 1, Failures: 0, Errors: 0, Time elapsed: 0.008 sec
    [junit] Running org.apache.qpid.server.store.berkeleydb.MessageStoreCreatorTest
    [junit] Tests run: 1, Failures: 0, Errors: 0, Time elapsed: 0.008 sec
    [junit] Running org.apache.qpid.server.store.berkeleydb.tuple.ConfiguredObjectBindingTest
    [junit] Tests run: 1, Failures: 0, Errors: 0, Time elapsed: 0.006 sec
    [junit] Running org.apache.qpid.server.store.berkeleydb.upgrade.DatabaseTemplateTest
    [junit] Tests run: 2, Failures: 0, Errors: 0, Time elapsed: 0.049 sec
    [junit] Running org.apache.qpid.server.store.berkeleydb.upgrade.UpgradeFrom4to5Test
    [junit] Tests run: 2, Failures: 0, Errors: 0, Time elapsed: 2.674 sec
    [junit] Running org.apache.qpid.server.store.berkeleydb.upgrade.UpgradeFrom5To6Test
    [junit] Tests run: 4, Failures: 0, Errors: 0, Time elapsed: 1.869 sec
    [junit] Running org.apache.qpid.server.store.berkeleydb.upgrade.UpgraderFailOnNewerVersionTest
    [junit] Tests run: 1, Failures: 0, Errors: 0, Time elapsed: 0.048 sec
    [junit] Running org.apache.qpid.server.store.berkeleydb.upgrade.UpgraderTest
    [junit] Tests run: 2, Failures: 0, Errors: 0, Time elapsed: 2.284 sec
     [echo] Running ant for module : bdbstore

touch-failed:
     [echo] Running ant for module : bdbstore/jmx

prepare:

precompile:

compile:
     [echo] Targeting : 1.5

copy-resources:
     [echo] Copying resources from <https://builds.apache.org/job/Qpid-Java-Java-BDB-TestMatrix/jdk=JDK%201.6%20(latest),label=Ubuntu,profile=java-bdb.0-9-1/ws/trunk/qpid/java/bdbstore/jmx/src/main/resources>
to <https://builds.apache.org/job/Qpid-Java-Java-BDB-TestMatrix/jdk=JDK%201.6%20(latest),label=Ubuntu,profile=java-bdb.0-9-1/ws/trunk/qpid/java/build/scratch/bdbstore/jmx/classes...>

copy-project-resources-metainf:

copy-module-resources-metainf:

copy-module-src-resources-metainf:

copy-files-to-module-metainf:

jar.manifest:

jar.nomanifest:

jar:

precompile-tests:

compile-tests:

copy-test-resources:

jar-tests:

jar-sources:

libs:

copy-bin:

copy-etc:

postbuild:

copy-broker-plugin-jars:

build:

test:
     [echo] Using profile:java-bdb.0-9-1
    [junit] Running org.apache.qpid.server.store.berkeleydb.HAClusterManagementTest
    [junit] Tests run: 8, Failures: 0, Errors: 0, Time elapsed: 113.518 sec
    [junit] Running org.apache.qpid.server.store.berkeleydb.HAClusterTwoNodeTest
    [junit] Tests run: 7, Failures: 0, Errors: 1, Time elapsed: 194.635 sec
    [junit] TEST org.apache.qpid.server.store.berkeleydb.HAClusterTwoNodeTest FAILED
    [junit] Running org.apache.qpid.server.store.berkeleydb.jmx.BDBHAMessageStoreManagerMBeanTest
    [junit] Tests run: 15, Failures: 0, Errors: 0, Time elapsed: 0.242 sec
    [junit] Tests FAILED
     [echo] Running ant for module : bdbstore/jmx

touch-failed:
    [touch] Creating <https://builds.apache.org/job/Qpid-Java-Java-BDB-TestMatrix/jdk=JDK%201.6%20(latest),label=Ubuntu,profile=java-bdb.0-9-1/ws/trunk/qpid/java/build/results/bdbstore/jmx/FAILED>
    [touch] Creating <https://builds.apache.org/job/Qpid-Java-Java-BDB-TestMatrix/jdk=JDK%201.6%20(latest),label=Ubuntu,profile=java-bdb.0-9-1/ws/trunk/qpid/java/build/results/FAILED>
     [echo] Running ant for module : perftests/visualisation-jfc

checkjfree-request-props:
     [echo] Running ant for module : perftests/visualisation-jfc

jfree-licence-note:
     [echo] *NOTE* The JFreeChart and JFreeCommon libraries required by this optional module
are licensed under the LGPL Licence, which is not compatible with the Apache Licence v2.0.
     [echo] 
     [echo] For a copy of the LGPL Licence, please see:
     [echo] http://www.gnu.org/licenses/lgpl.html
     [echo]        

download-ivy:

load-ivy:

configure-ivy:
[ivy:configure] :: Ivy 2.2.0 - 20100923230623 :: http://ant.apache.org/ivy/ ::
[ivy:configure] :: loading settings :: file = <https://builds.apache.org/job/Qpid-Java-Java-BDB-TestMatrix/jdk=JDK%201.6%20(latest),label=Ubuntu,profile=java-bdb.0-9-1/ws/trunk/qpid/java/ivysettings.retrieve.xml>

download-jfree:
     [echo] Resolving and retrieving dependencies...
[ivy:resolve] :: resolving dependencies :: org/apache#qpid;0.25
[ivy:resolve] 	confs: [jfree]
[ivy:resolve] 	found jfree#jfreechart;1.0.13 in m2repo
[ivy:resolve] 	found jfree#jcommon;1.0.16 in m2repo
[ivy:resolve] :: resolution report :: resolve 197ms :: artifacts dl 2ms
	---------------------------------------------------------------------
	|                  |            modules            ||   artifacts   |
	|       conf       | number| search|dwnlded|evicted|| number|dwnlded|
	---------------------------------------------------------------------
	|       jfree      |   2   |   0   |   0   |   0   ||   2   |   0   |
	---------------------------------------------------------------------
[ivy:retrieve] :: retrieving :: org/apache#qpid [sync]
[ivy:retrieve] 	confs: [jfree]
[ivy:retrieve] 	0 artifacts copied, 2 already retrieved (0kB/29ms)

check-jfree-jars:

jfree-licence-note-optional:

jfree-jar-required:

checkcsvjdbc-request-props:
     [echo] Running ant for module : perftests/visualisation-jfc

csvjdbc-licence-note:
     [echo] *NOTE* The CSVJDBC library required by this optional module is licensed under
the LGPL Licence, which is not compatible with the Apache Licence v2.0.
     [echo] 
     [echo] For a copy of the LGPL Licence, please see:
     [echo] http://www.gnu.org/licenses/lgpl.html
     [echo]        

download-ivy:

load-ivy:

configure-ivy:
[ivy:configure] :: Ivy 2.2.0 - 20100923230623 :: http://ant.apache.org/ivy/ ::
[ivy:configure] :: loading settings :: file = <https://builds.apache.org/job/Qpid-Java-Java-BDB-TestMatrix/jdk=JDK%201.6%20(latest),label=Ubuntu,profile=java-bdb.0-9-1/ws/trunk/qpid/java/ivysettings.retrieve.xml>

download-csvjdbc:
     [echo] Resolving and retrieving dependencies...
[ivy:resolve] :: resolving dependencies :: org/apache#qpid;0.25
[ivy:resolve] 	confs: [csvjdbc]
[ivy:resolve] 	found net.sourceforge.csvjdbc#csvjdbc;1.0.8 in csvjdbc
[ivy:resolve] :: resolution report :: resolve 79ms :: artifacts dl 2ms
	---------------------------------------------------------------------
	|                  |            modules            ||   artifacts   |
	|       conf       | number| search|dwnlded|evicted|| number|dwnlded|
	---------------------------------------------------------------------
	|      csvjdbc     |   1   |   0   |   0   |   0   ||   1   |   0   |
	---------------------------------------------------------------------
[ivy:retrieve] :: retrieving :: org/apache#qpid [sync]
[ivy:retrieve] 	confs: [csvjdbc]
[ivy:retrieve] 	0 artifacts copied, 1 already retrieved (0kB/13ms)

check-csvjdbc-jars:

csvjdbc-licence-note-optional:

csvjdbc-jar-required:

prepare:

precompile:

compile:
     [echo] Targeting : 1.5

jar.manifest:
      [jar] Building jar: <https://builds.apache.org/job/Qpid-Java-Java-BDB-TestMatrix/jdk=JDK%201.6%20(latest),label=Ubuntu,profile=java-bdb.0-9-1/ws/trunk/qpid/java/build/lib/qpid-perftests-visualisation-jfc-0.25.jar>

copy-resources:

copy-project-resources-metainf:

copy-module-resources-metainf:

copy-module-src-resources-metainf:

copy-files-to-module-metainf:

jar.nomanifest:

jar:

precompile-tests:

compile-tests:

copy-test-resources:

jar-tests:

jar-sources:

libs:

copy-bin:

copy-etc:

postbuild:

copy-broker-plugin-jars:

module.build:

build:

test:
     [echo] Using profile:java-bdb.0-9-1
    [junit] Running org.apache.qpid.disttest.charting.chartbuilder.BaseChartBuilderTest
    [junit] Tests run: 1, Failures: 0, Errors: 0, Time elapsed: 0.269 sec
    [junit] Running org.apache.qpid.disttest.charting.chartbuilder.ChartBuilderFactoryTest
    [junit] Tests run: 6, Failures: 0, Errors: 0, Time elapsed: 0.016 sec
    [junit] Running org.apache.qpid.disttest.charting.chartbuilder.ChartProductionTest
    [junit] Tests run: 8, Failures: 0, Errors: 0, Time elapsed: 1.258 sec
    [junit] Running org.apache.qpid.disttest.charting.chartbuilder.ColorFactoryTest
    [junit] Tests run: 2, Failures: 0, Errors: 0, Time elapsed: 0.009 sec
    [junit] Running org.apache.qpid.disttest.charting.chartbuilder.TimeSeriesBuilderCallbackTest
    [junit] Tests run: 1, Failures: 0, Errors: 0, Time elapsed: 0.012 sec
    [junit] Running org.apache.qpid.disttest.charting.definition.ChartingDefinitionCreatorTest
    [junit] Tests run: 4, Failures: 0, Errors: 0, Time elapsed: 0.052 sec
    [junit] Running org.apache.qpid.disttest.charting.definition.SeriesDefinitionCreatorTest
    [junit] Tests run: 4, Failures: 0, Errors: 0, Time elapsed: 0.011 sec
    [junit] Running org.apache.qpid.disttest.charting.seriesbuilder.JdbcSeriesBuilderTest
    [junit] Tests run: 1, Failures: 0, Errors: 0, Time elapsed: 0.172 sec
    [junit] Running org.apache.qpid.disttest.charting.seriesbuilder.JdbcUrlGeneratorTest
    [junit] Tests run: 4, Failures: 0, Errors: 0, Time elapsed: 0.009 sec
    [junit] Running org.apache.qpid.disttest.charting.seriesbuilder.SeriesRowTest
    [junit] Tests run: 5, Failures: 0, Errors: 0, Time elapsed: 0.007 sec
    [junit] Running org.apache.qpid.disttest.charting.writer.ChartWriterTest
    [junit] Tests run: 3, Failures: 0, Errors: 0, Time elapsed: 0.323 sec
     [echo] Running ant for module : perftests/visualisation-jfc

touch-failed:

BUILD FAILED
<https://builds.apache.org/job/Qpid-Java-Java-BDB-TestMatrix/jdk=JDK%201.6%20(latest),label=Ubuntu,profile=java-bdb.0-9-1/ws/trunk/qpid/java/build.xml>:107:
TEST SUITE FAILED

Total time: 47 minutes 33 seconds
Build step 'Invoke Ant' marked build as failure
[locks-and-latches] Releasing all the locks
[locks-and-latches] All the locks released
Recording test results

Mime
View raw message