qpid-notifications mailing list archives

Site index · List index
Message view « Date » · « Thread »
Top « Date » · « Thread »
From Apache Jenkins Server <jenk...@builds.apache.org>
Subject Build failed in Jenkins: Qpid-Java-Cpp-Test #1352
Date Tue, 07 May 2013 01:15:10 GMT
See <https://builds.apache.org/job/Qpid-Java-Cpp-Test/1352/changes>

Changes:

[orudyy] QPID-4752: Move FileGroupProvider resources into correct location

[robbie] NO-JIRA: add missing licence headers to various java files

[robbie] QPID-4594,QPID-4682: rename BrokerOptions methods for overriding the HTTP/JMX/RMI
ports in management mode to better match their function

[robbie] QPID-4815: make BrokerOptions the primary source of the location for the logging
configuration file

[orudyy] QPID-4814: Fix the rest layer configured object update by name and multiple object
parents

[orudyy] QPID-4813: Protect operations to update queue and exchange attributes with ACL

[robbie] QPID-4645: make the broker-plugins and bdbstore modules runtime dependencies in the
broker pom, with only the latter being optional

[robbie] QPID-4809: change initial-config.json to using qpid.work_dir and qpid.home_dir config
variables instead of QPID_WORK and QPID_HOME system properties

Enables us to default the former when QPID_WORK is not set and allows the latter to be set
on a per-instance basis.

[robbie] QPID-4390: ensure the _messageStore field is populated prior configuring the store
to ensure it is set before use by the listener during the asynchronous HA store activation

[aconway] NO-JIRA: HA minor documentation updates.

[tross] NO-JIRA - Added missing item initialization in the log module.

[rhs] QPID-4798: removed non stripped spec files and updated LICENSE file accordingly

[rhs] QPID-4798: updated and renamed spec files

[orudyy] QPID-4803: Ensure the modelVersion and storeVersion attributes are saved to the configuration
store and validated at startup

[orudyy] QPID-4802: In management mode set state to ERRORED for failing to activate authentication
providers, group providers and acl providers in order to allow editing of attributes preventing
normal startup

[robbie] QPID-4809: add support for setting configuration properties through the command line
and BrokerOptions that can be used by the broker configuration store to resolve variables
in the config, use this to supply the default port number values.

Povides chance to alter the ports when first starting the broker and using the initial config
file to populate the config store.

[aconway] QPID-4775: Fix core dumps in HA tests introduced in r1478418

After this revision several of the tests in ha_tests.py were core dumping with 0
pointers in FieldTable entries in Queue::settings. It's not clear why the core
dumps were occuring nor why this patch fixes them. This patch eliminates a call
to the QueueSettings copy constructor, so something fishy going is on there.

[aconway] QPID-4798: Fix up c++ code generation to use stripped spec files.

The stripped specs have no <doc> elements, this was tripping up the code
generator. Fixed the generator to process <doc> elements if they are present but
to carry on without them if they are not.

[rgodfrey] QPID-4798 : add comments denoting where our xml extends the standard amqp xml

[tross] NO-JIRA - Additional Development
- Added buffer of saved log messages for remote retrieval.
- Added __FILE__ and __LINE__ annotations to logs.
- Refactored dx_message_check() so it can be called multiple times with different depths.
- Separated the buffer-size-specific tests into a separate unit test executable.

[rgodfrey] QPID-4798 : use stripped BSD licensed versions of the amqp spec files

[astitcher] QPID-4810: No TCP if SSL initialisation fails and TCP/SSL mux enabled

[chug] NO-JIRA: Fix Windows build more

[cliffjansen] QPID-4792: convert between UUIDs and GUIDs as needed for Microsoft APIs

[rgodfrey] QPID-4798 : use stripped BSD licensed versions of the amqp spec files

[rgodfrey] QPID-4798 : use stripped BSD licensed versions of the amqp spec files

[rhs] fixed content of 0-9 stripped to actually be 0-9

[rhs] one more ordering tweak for 0-8 and regen of 0-8 using the same script

------------------------------------------
[...truncated 14226 lines...]
    [junit] Tests run: 1, Failures: 0, Errors: 0, Time elapsed: 0.171 sec
    [junit] Running org.apache.qpid.test.unit.basic.close.CloseTest
    [junit] Tests run: 1, Failures: 0, Errors: 0, Time elapsed: 0.058 sec
    [junit] Running org.apache.qpid.test.unit.client.AMQSessionTest
    [junit] Tests run: 4, Failures: 0, Errors: 0, Time elapsed: 0.249 sec
    [junit] Running org.apache.qpid.test.unit.client.DynamicQueueExchangeCreateTest
    [junit] Tests run: 0, Failures: 0, Errors: 0, Time elapsed: 0.001 sec
    [junit] Running org.apache.qpid.test.unit.client.MaxDeliveryCountTest
    [junit] Tests run: 0, Failures: 0, Errors: 0, Time elapsed: 0.002 sec
    [junit] Running org.apache.qpid.test.unit.client.QueueSessionFactoryTest
    [junit] Tests run: 5, Failures: 0, Errors: 0, Time elapsed: 0.249 sec
    [junit] Running org.apache.qpid.test.unit.client.TopicSessionFactoryTest
    [junit] Tests run: 4, Failures: 0, Errors: 0, Time elapsed: 0.223 sec
    [junit] Running org.apache.qpid.test.unit.client.channelclose.CloseWithBlockingReceiveTest
    [junit] Tests run: 1, Failures: 0, Errors: 0, Time elapsed: 1.06 sec
    [junit] Running org.apache.qpid.test.unit.client.connection.BrokerClosesClientConnectionTest
    [junit] Tests run: 2, Failures: 0, Errors: 0, Time elapsed: 20.144 sec
    [junit] Running org.apache.qpid.test.unit.client.connection.ConnectionFactoryTest
    [junit] Tests run: 2, Failures: 0, Errors: 0, Time elapsed: 0.105 sec
    [junit] Running org.apache.qpid.test.unit.client.connection.ConnectionStartTest
    [junit] Tests run: 2, Failures: 0, Errors: 0, Time elapsed: 0.131 sec
    [junit] Running org.apache.qpid.test.unit.client.connection.ConnectionTest
    [junit] Tests run: 9, Failures: 0, Errors: 0, Time elapsed: 0.511 sec
    [junit] Running org.apache.qpid.test.unit.client.message.ObjectMessageTest
    [junit] Tests run: 10, Failures: 0, Errors: 0, Time elapsed: 0.61 sec
    [junit] Running org.apache.qpid.test.unit.client.protocol.AMQProtocolSessionTest
    [junit] Tests run: 5, Failures: 0, Errors: 0, Time elapsed: 0.247 sec
    [junit] Running org.apache.qpid.test.unit.client.temporaryqueue.TemporaryQueueTest
    [junit] Tests run: 4, Failures: 0, Errors: 0, Time elapsed: 0.251 sec
    [junit] Running org.apache.qpid.test.unit.close.JavaServerCloseRaceConditionTest
    [junit] Tests run: 0, Failures: 0, Errors: 0, Time elapsed: 0.001 sec
    [junit] Running org.apache.qpid.test.unit.close.MessageConsumerCloseTest
    [junit] Tests run: 1, Failures: 0, Errors: 0, Time elapsed: 0.07 sec
    [junit] Running org.apache.qpid.test.unit.close.MessageRequeueTest
    [junit] Tests run: 3, Failures: 0, Errors: 0, Time elapsed: 21.616 sec
    [junit] Running org.apache.qpid.test.unit.close.TopicPublisherCloseTest
    [junit] Tests run: 1, Failures: 0, Errors: 0, Time elapsed: 3.057 sec
    [junit] Running org.apache.qpid.test.unit.ct.DurableSubscriberTest
    [junit] Tests run: 0, Failures: 0, Errors: 0, Time elapsed: 0.002 sec
    [junit] Running org.apache.qpid.test.unit.message.JMSPropertiesTest
    [junit] Tests run: 2, Failures: 0, Errors: 0, Time elapsed: 0.121 sec
    [junit] Running org.apache.qpid.test.unit.message.StreamMessageTest
    [junit] Tests run: 2, Failures: 0, Errors: 0, Time elapsed: 0.127 sec
    [junit] Running org.apache.qpid.test.unit.message.UTF8Test
    [junit] Tests run: 2, Failures: 0, Errors: 0, Time elapsed: 0.12 sec
    [junit] Running org.apache.qpid.test.unit.topic.DurableSubscriptionTest
    [junit] Tests run: 18, Failures: 0, Errors: 0, Time elapsed: 30.705 sec
    [junit] Running org.apache.qpid.test.unit.topic.TemporaryTopicTest
    [junit] Tests run: 5, Failures: 0, Errors: 0, Time elapsed: 0.284 sec
    [junit] Running org.apache.qpid.test.unit.topic.TopicPublisherTest
    [junit] Tests run: 1, Failures: 0, Errors: 0, Time elapsed: 0.06 sec
    [junit] Running org.apache.qpid.test.unit.topic.TopicSessionTest
    [junit] Tests run: 7, Failures: 0, Errors: 0, Time elapsed: 5.6 sec
    [junit] Running org.apache.qpid.test.unit.transacted.CommitRollbackTest
    [junit] Tests run: 12, Failures: 0, Errors: 0, Time elapsed: 15.928 sec
    [junit] Running org.apache.qpid.test.unit.transacted.TransactedTest
    [junit] Tests run: 7, Failures: 0, Errors: 0, Time elapsed: 8.115 sec
    [junit] Running org.apache.qpid.test.unit.transacted.TransactionTimeoutDisabledTest
    [junit] Tests run: 0, Failures: 0, Errors: 0, Time elapsed: 0.001 sec
    [junit] Running org.apache.qpid.test.unit.transacted.TransactionTimeoutTest
    [junit] Tests run: 0, Failures: 0, Errors: 0, Time elapsed: 0.002 sec
    [junit] Running org.apache.qpid.test.unit.xa.FaultTest
    [junit] Tests run: 9, Failures: 0, Errors: 0, Time elapsed: 2.092 sec
    [junit] Running org.apache.qpid.test.unit.xa.QueueTest
    [junit] Tests run: 1, Failures: 0, Errors: 0, Time elapsed: 1.078 sec
    [junit] Running org.apache.qpid.test.unit.xa.TopicTest
    [junit] Tests run: 3, Failures: 0, Errors: 0, Time elapsed: 3.259 sec
    [junit] Running org.apache.qpid.test.utils.BrokerCommandHelperTest
    [junit] Tests run: 2, Failures: 0, Errors: 0, Time elapsed: 0.013 sec
    [junit] Running org.apache.qpid.util.LogMonitorTest
    [junit] Tests run: 9, Failures: 0, Errors: 0, Time elapsed: 2.031 sec
    [junit] Tests FAILED
     [echo] Running ant for module : systests

touch-failed:
    [touch] Creating <https://builds.apache.org/job/Qpid-Java-Cpp-Test/ws/trunk/qpid/java/build/results/systests/FAILED>
    [touch] Creating <https://builds.apache.org/job/Qpid-Java-Cpp-Test/ws/trunk/qpid/java/build/results/FAILED>
     [echo] Running ant for module : perftests

prepare:

precompile:

compile:
     [echo] Targeting : 1.5

copy-resources:
     [echo] Copying resources from <https://builds.apache.org/job/Qpid-Java-Cpp-Test/ws/trunk/qpid/java/perftests/src/main/resources>
to <https://builds.apache.org/job/Qpid-Java-Cpp-Test/ws/trunk/qpid/java/build/scratch/perftests/classes...>

copy-project-resources-metainf:

copy-module-resources-metainf:

copy-module-src-resources-metainf:

copy-files-to-module-metainf:

jar.manifest:

jar.nomanifest:

jar:

precompile-tests:

compile-tests:

copy-test-resources:

jar-tests:

jar-sources:

libs:

copy-bin:

copy-etc:

postbuild:

copy-broker-plugin-jars:

build:

test:
     [echo] Using profile:cpp
    [junit] Running org.apache.qpid.disttest.ArgumentParserTest
    [junit] Tests run: 0, Failures: 0, Errors: 0, Time elapsed: 0.03 sec
    [junit] Running org.apache.qpid.disttest.ConfigFileHelperTest
    [junit] Tests run: 0, Failures: 0, Errors: 0, Time elapsed: 0.011 sec
    [junit] Running org.apache.qpid.disttest.ResultsFileWriterTest
    [junit] Tests run: 0, Failures: 0, Errors: 0, Time elapsed: 0.01 sec
    [junit] Running org.apache.qpid.disttest.VisitorTest
    [junit] Tests run: 0, Failures: 0, Errors: 0, Time elapsed: 0.009 sec
    [junit] Running org.apache.qpid.disttest.client.ClientCommandVisitorTest
    [junit] Tests run: 8, Failures: 0, Errors: 0, Time elapsed: 0.086 sec
    [junit] Running org.apache.qpid.disttest.client.ClientTest
    [junit] Tests run: 8, Failures: 0, Errors: 0, Time elapsed: 0.614 sec
    [junit] Running org.apache.qpid.disttest.client.ConsumerParticipantTest
    [junit] Tests run: 7, Failures: 0, Errors: 0, Time elapsed: 0.169 sec
    [junit] Running org.apache.qpid.disttest.client.MessageProviderTest
    [junit] Tests run: 3, Failures: 0, Errors: 0, Time elapsed: 0.11 sec
    [junit] Running org.apache.qpid.disttest.client.ParticipantExecutorTest
    [junit] Tests run: 4, Failures: 0, Errors: 0, Time elapsed: 0.024 sec
    [junit] Running org.apache.qpid.disttest.client.ParticipantRegistryTest
    [junit] Tests run: 2, Failures: 0, Errors: 0, Time elapsed: 0.007 sec
    [junit] Running org.apache.qpid.disttest.client.ParticipantResultFactoryTest
    [junit] Tests run: 3, Failures: 0, Errors: 0, Time elapsed: 0.006 sec
    [junit] Running org.apache.qpid.disttest.client.ProducerParticipantTest
    [junit] Tests run: 9, Failures: 0, Errors: 0, Time elapsed: 1.591 sec
    [junit] Running org.apache.qpid.disttest.client.property.ListPropertyValueTest
    [junit] Tests run: 3, Failures: 0, Errors: 0, Time elapsed: 0.006 sec
    [junit] Running org.apache.qpid.disttest.client.property.PropertyValueFactoryTest
    [junit] Tests run: 5, Failures: 0, Errors: 0, Time elapsed: 0.009 sec
    [junit] Running org.apache.qpid.disttest.client.property.RandomPropertyValueTest
    [junit] Tests run: 5, Failures: 0, Errors: 0, Time elapsed: 0.006 sec
    [junit] Running org.apache.qpid.disttest.client.property.RangePropertyValueTest
    [junit] Tests run: 8, Failures: 0, Errors: 0, Time elapsed: 0.006 sec
    [junit] Running org.apache.qpid.disttest.client.property.SimplePropertyValueTest
    [junit] Tests run: 1, Failures: 0, Errors: 0, Time elapsed: 0.002 sec
    [junit] Running org.apache.qpid.disttest.client.utils.ExecutorWithNoLimitsTest
    [junit] Tests run: 2, Failures: 0, Errors: 0, Time elapsed: 0.003 sec
    [junit] Running org.apache.qpid.disttest.client.utils.ExecutorWithTimeLimitTest
    [junit] Tests run: 4, Failures: 0, Errors: 0, Time elapsed: 0.504 sec
    [junit] Running org.apache.qpid.disttest.controller.ClientRegistryTest
    [junit] Tests run: 8, Failures: 0, Errors: 0, Time elapsed: 2.558 sec
    [junit] Running org.apache.qpid.disttest.controller.ControllerTest
    [junit] Tests run: 6, Failures: 0, Errors: 0, Time elapsed: 0.045 sec
    [junit] Running org.apache.qpid.disttest.controller.ParticipatingClientsTest
    [junit] Tests run: 5, Failures: 0, Errors: 0, Time elapsed: 0.004 sec
    [junit] Running org.apache.qpid.disttest.controller.TestRunnerTest
    [junit] Tests run: 6, Failures: 0, Errors: 0, Time elapsed: 1.137 sec
    [junit] Running org.apache.qpid.disttest.controller.config.ClientConfigTest
    [junit] Tests run: 4, Failures: 0, Errors: 0, Time elapsed: 0.009 sec
    [junit] Running org.apache.qpid.disttest.controller.config.ConfigReaderTest
    [junit] Tests run: 5, Failures: 0, Errors: 0, Time elapsed: 0.341 sec
    [junit] Running org.apache.qpid.disttest.controller.config.ConfigTest
    [junit] Tests run: 1, Failures: 0, Errors: 0, Time elapsed: 0.007 sec
    [junit] Running org.apache.qpid.disttest.controller.config.ConnectionConfigTest
    [junit] Tests run: 3, Failures: 0, Errors: 0, Time elapsed: 0.015 sec
    [junit] Running org.apache.qpid.disttest.controller.config.ConsumerConfigTest
    [junit] Tests run: 2, Failures: 0, Errors: 0, Time elapsed: 0.009 sec
    [junit] Running org.apache.qpid.disttest.controller.config.IterationValueTest
    [junit] Tests run: 3, Failures: 0, Errors: 0, Time elapsed: 0.026 sec
    [junit] Running org.apache.qpid.disttest.controller.config.JavaScriptConfigEvaluatorTest
    [junit] Tests run: 1, Failures: 0, Errors: 0, Time elapsed: 0.051 sec
    [junit] Running org.apache.qpid.disttest.controller.config.MessageProviderConfigTest
    [junit] Tests run: 2, Failures: 0, Errors: 0, Time elapsed: 0.003 sec
    [junit] Running org.apache.qpid.disttest.controller.config.ParticipantConfigTest
    [junit] Tests run: 1, Failures: 0, Errors: 0, Time elapsed: 0.01 sec
    [junit] Running org.apache.qpid.disttest.controller.config.ProducerConfigTest
    [junit] Tests run: 3, Failures: 0, Errors: 0, Time elapsed: 0.003 sec
    [junit] Running org.apache.qpid.disttest.controller.config.SessionConfigTest
    [junit] Tests run: 3, Failures: 0, Errors: 0, Time elapsed: 0.021 sec
    [junit] Running org.apache.qpid.disttest.controller.config.TestConfigTest
    [junit] Tests run: 5, Failures: 0, Errors: 0, Time elapsed: 0.007 sec
    [junit] Running org.apache.qpid.disttest.controller.config.TestInstanceTest
    [junit] Tests run: 3, Failures: 0, Errors: 0, Time elapsed: 0.006 sec
    [junit] Running org.apache.qpid.disttest.db.ResultsDbWriterTest
    [junit] Tests run: 2, Failures: 0, Errors: 0, Time elapsed: 1.408 sec
    [junit] Running org.apache.qpid.disttest.jms.JmsMessageAdaptorTest
    [junit] Tests run: 1, Failures: 0, Errors: 0, Time elapsed: 0.002 sec
    [junit] Running org.apache.qpid.disttest.message.JsonHandlerTest
    [junit] Tests run: 2, Failures: 0, Errors: 0, Time elapsed: 0.024 sec
    [junit] Running org.apache.qpid.disttest.message.ParticipantResultTest
    [junit] Tests run: 3, Failures: 0, Errors: 0, Time elapsed: 0.047 sec
    [junit] Running org.apache.qpid.disttest.results.aggregation.AggregatorTest
    [junit] Tests run: 1, Failures: 0, Errors: 0, Time elapsed: 0.014 sec
    [junit] Running org.apache.qpid.disttest.results.aggregation.ParticipantResultAggregatorTest
    [junit] Tests run: 14, Failures: 0, Errors: 0, Time elapsed: 0.005 sec
    [junit] Running org.apache.qpid.disttest.results.aggregation.SeriesStatisticsTest
    [junit] Tests run: 1, Failures: 0, Errors: 0, Time elapsed: 0.002 sec
    [junit] Running org.apache.qpid.disttest.results.aggregation.TestResultAggregatorTest
    [junit] Tests run: 4, Failures: 0, Errors: 0, Time elapsed: 0.003 sec
    [junit] Running org.apache.qpid.disttest.results.formatting.CSVFormatterTest
    [junit] Tests run: 1, Failures: 0, Errors: 0, Time elapsed: 0.004 sec
    [junit] Running org.apache.qpid.disttest.results.formatting.CSVOrderParticipantResultComparatorTest
    [junit] Tests run: 6, Failures: 0, Errors: 0, Time elapsed: 0.008 sec
    [junit] Running org.apache.qpid.systest.disttest.QpidQueueCreatorTest
    [junit] Tests run: 0, Failures: 0, Errors: 0, Time elapsed: 0.002 sec
    [junit] Running org.apache.qpid.systest.disttest.clientonly.BasicDistributedClientTest
    [junit] Tests run: 5, Failures: 0, Errors: 0, Time elapsed: 1.305 sec
    [junit] Running org.apache.qpid.systest.disttest.clientonly.ConsumerParticipantTest
    [junit] Tests run: 3, Failures: 0, Errors: 0, Time elapsed: 6.477 sec
    [junit] Running org.apache.qpid.systest.disttest.clientonly.DistributedClientTest
    [junit] Tests run: 9, Failures: 0, Errors: 0, Time elapsed: 1.118 sec
    [junit] Running org.apache.qpid.systest.disttest.clientonly.MessageProviderTest
    [junit] Tests run: 2, Failures: 0, Errors: 0, Time elapsed: 0.145 sec
    [junit] Running org.apache.qpid.systest.disttest.clientonly.ProducerParticipantTest
    [junit] Tests run: 1, Failures: 0, Errors: 0, Time elapsed: 0.602 sec
    [junit] Running org.apache.qpid.systest.disttest.controllerandclient.ControllerAndClientTest
    [junit] Tests run: 5, Failures: 0, Errors: 0, Time elapsed: 2.278 sec
    [junit] Running org.apache.qpid.systest.disttest.controlleronly.DistributedControllerTest
    [junit] Tests run: 1, Failures: 0, Errors: 0, Time elapsed: 1.107 sec
    [junit] Running org.apache.qpid.systest.disttest.endtoend.EndToEndTest
    [junit] Tests run: 1, Failures: 0, Errors: 0, Time elapsed: 0.586 sec
     [echo] Running ant for module : perftests

touch-failed:

BUILD FAILED
<https://builds.apache.org/job/Qpid-Java-Cpp-Test/ws/trunk/qpid/java/build.xml>:104:
TEST SUITE FAILED

Total time: 7 minutes 6 seconds
Build step 'Invoke Ant' marked build as failure
[locks-and-latches] Releasing all the locks
[locks-and-latches] All the locks released
Recording test results

Mime
View raw message