qpid-notifications mailing list archives

Site index · List index
Message view « Date » · « Thread »
Top « Date » · « Thread »
From Apache Jenkins Server <jenk...@builds.apache.org>
Subject Build failed in Jenkins: Qpid-Python-Cpp-Test #512
Date Mon, 22 Apr 2013 16:41:10 GMT
See <https://builds.apache.org/job/Qpid-Python-Cpp-Test/512/changes>

Changes:

[gsim] Fix warning about uninitialised variable when running test under valgrind; caused by
r1469088, QPID-3689

[robbie] QPID-4685: update documentation for CLI options

[robbie] QPID-4751: change Hello example to remove mention of 'test' virtualhost

[orudyy] QPID-4762: Upgrade dojo to version 1.8.3

[orudyy] QPID-4761: Rename jetty pom xmls

[rgodfrey] QPID-4763 : [Java Broker] Add JDBC store

[orudyy] QPID-4761: Upgrade jetty to version 7.6.10.v20130312

------------------------------------------
[...truncated 4002 lines...]
../../../include/qpid/messaging/Message.h:199: Warning 467: Overloaded method qpid::messaging::decode(qpid::messaging::Message
const &,qpid::types::Variant::Map &) not supported (no type checking rule for 'qpid::types::Variant::Map
&').
../../../include/qpid/messaging/Message.h:211: Warning 467: Overloaded method qpid::messaging::decode(qpid::messaging::Message
const &,qpid::types::Variant::List &,std::string const &) not supported (no type
checking rule for 'qpid::types::Variant::List &').
../../../include/qpid/messaging/Message.h:199: Warning 467: Overloaded method qpid::messaging::decode(qpid::messaging::Message
const &,qpid::types::Variant::Map &) not supported (no type checking rule for 'qpid::types::Variant::Map
&').
../../../include/qpid/messaging/Message.h:211: Warning 467: Overloaded method qpid::messaging::decode(qpid::messaging::Message
const &,qpid::types::Variant::List &,std::string const &) not supported (no type
checking rule for 'qpid::types::Variant::List &').
../../../include/qpid/messaging/Message.h:223: Warning 467: Overloaded method qpid::messaging::encode(qpid::types::Variant::Map
const &,qpid::messaging::Message &) not supported (no type checking rule for 'qpid::types::Variant::Map
const &').
../../../include/qpid/messaging/Message.h:235: Warning 467: Overloaded method qpid::messaging::encode(qpid::types::Variant::List
const &,qpid::messaging::Message &,std::string const &) not supported (no type
checking rule for 'qpid::types::Variant::List const &').
../../../include/qpid/messaging/Message.h:223: Warning 467: Overloaded method qpid::messaging::encode(qpid::types::Variant::Map
const &,qpid::messaging::Message &) not supported (no type checking rule for 'qpid::types::Variant::Map
const &').
../../../include/qpid/messaging/Message.h:235: Warning 467: Overloaded method qpid::messaging::encode(qpid::types::Variant::List
const &,qpid::messaging::Message &,std::string const &) not supported (no type
checking rule for 'qpid::types::Variant::List const &').
../../../include/qpid/messaging/Connection.h:82: Warning 467: Overloaded method qpid::messaging::Connection::Connection(std::string
const &,qpid::types::Variant::Map const &) not supported (no type checking rule for
'qpid::types::Variant::Map const &').
../../../include/qpid/messaging/Connection.h:82: Warning 467: Overloaded method qpid::messaging::Connection::Connection(std::string
const &,qpid::types::Variant::Map const &) not supported (no type checking rule for
'qpid::types::Variant::Map const &').
make  all-am
make[4]: Entering directory `<https://builds.apache.org/job/Qpid-Python-Cpp-Test/ws/trunk/qpid/cpp/bindings/qpid/python'>
/bin/bash ../../../libtool  --tag=CXX   --mode=compile g++ -DHAVE_CONFIG_H -I. -I../../../src
-I../../../include -I../../../bindings -I../../../include -I../../../src/qmf -I../../../src
-I../../../src   -I../../../include -I../../../bindings -I../../../include -I../../../src/qmf
-I../../../src -I../../../src -I/usr/include/python2.7   -fno-strict-aliasing -Wno-unused-result
-MT _cqpid_la-cqpid.lo -MD -MP -MF .deps/_cqpid_la-cqpid.Tpo -c -o _cqpid_la-cqpid.lo `test
-f 'cqpid.cpp' || echo './'`cqpid.cpp
libtool: compile:  g++ -DHAVE_CONFIG_H -I. -I../../../src -I../../../include -I../../../bindings
-I../../../include -I../../../src/qmf -I../../../src -I../../../src -I../../../include -I../../../bindings
-I../../../include -I../../../src/qmf -I../../../src -I../../../src -I/usr/include/python2.7
-fno-strict-aliasing -Wno-unused-result -MT _cqpid_la-cqpid.lo -MD -MP -MF .deps/_cqpid_la-cqpid.Tpo
-c cqpid.cpp  -fPIC -DPIC -o .libs/_cqpid_la-cqpid.o
mv -f .deps/_cqpid_la-cqpid.Tpo .deps/_cqpid_la-cqpid.Plo
/bin/bash ../../../libtool --tag=CXX   --mode=link g++ -I../../../include -I../../../bindings
-I../../../include -I../../../src/qmf -I../../../src -I../../../src -I/usr/include/python2.7
  -fno-strict-aliasing -Wno-unused-result -avoid-version -module -shared  -o _cqpid.la -rpath
/usr/local/lib/python2.7/site-packages _cqpid_la-cqpid.lo -lpython2.7   -L../../../src/.libs
-lqpidmessaging -lqpidtypes ../../../src/libqpidmessaging.la ../../../src/libqpidtypes.la

libtool: link: g++  -fPIC -DPIC -shared -nostdlib /usr/lib/gcc/x86_64-linux-gnu/4.6/../../../x86_64-linux-gnu/crti.o
/usr/lib/gcc/x86_64-linux-gnu/4.6/crtbeginS.o  .libs/_cqpid_la-cqpid.o   -Wl,-rpath -Wl,<https://builds.apache.org/job/Qpid-Python-Cpp-Test/ws/trunk/qpid/cpp/src/.libs>
-lpython2.7 -L../../../src/.libs <https://builds.apache.org/job/Qpid-Python-Cpp-Test/ws/trunk/qpid/cpp/src/.libs/libqpidmessaging.so>
<https://builds.apache.org/job/Qpid-Python-Cpp-Test/ws/trunk/qpid/cpp/src/.libs/libqpidtypes.so>
../../../src/.libs/libqpidmessaging.so ../../../src/.libs/libqpidtypes.so -L/usr/lib/gcc/x86_64-linux-gnu/4.6
-L/usr/lib/gcc/x86_64-linux-gnu/4.6/../../../x86_64-linux-gnu -L/usr/lib/gcc/x86_64-linux-gnu/4.6/../../../../lib
-L/lib/x86_64-linux-gnu -L/lib/../lib -L/usr/lib/x86_64-linux-gnu -L/usr/lib/../lib -L/usr/lib/gcc/x86_64-linux-gnu/4.6/../../..
-lstdc++ -lm -lc -lgcc_s /usr/lib/gcc/x86_64-linux-gnu/4.6/crtendS.o /usr/lib/gcc/x86_64-linux-gnu/4.6/../../../x86_64-linux-gnu/crtn.o
   -Wl,-soname -Wl,_cqpid.so -o .libs/_cqpid.so
libtool: link: ( cd ".libs" && rm -f "_cqpid.la" && ln -s "../_cqpid.la" "_cqpid.la"
)
make[4]: Leaving directory `<https://builds.apache.org/job/Qpid-Python-Cpp-Test/ws/trunk/qpid/cpp/bindings/qpid/python'>
make[3]: Leaving directory `<https://builds.apache.org/job/Qpid-Python-Cpp-Test/ws/trunk/qpid/cpp/bindings/qpid/python'>
make[3]: Entering directory `<https://builds.apache.org/job/Qpid-Python-Cpp-Test/ws/trunk/qpid/cpp/bindings/qpid'>
mkdir -p perl
cd perl; \
		perl Makefile.PL PREFIX=/usr/local ; \
	cd ..
Note (probably harmless): No library found for -lqpidmessaging
Note (probably harmless): No library found for -lqpidtypes
Writing Makefile for cqpid_perl
Writing MYMETA.yml
cd perl; \
		make OPTIMIZE="-Wno-unused-result" ; \
	cd ..
make[4]: Entering directory `<https://builds.apache.org/job/Qpid-Python-Cpp-Test/ws/trunk/qpid/cpp/bindings/qpid/perl'>
cc -c   -D_REENTRANT -D_GNU_SOURCE -DDEBIAN -fno-strict-aliasing -pipe -fstack-protector -I/usr/local/include
-D_LARGEFILE_SOURCE -D_FILE_OFFSET_BITS=64 -Wno-unused-result   -DVERSION=\"\" -DXS_VERSION=\"\"
-fPIC "-I/usr/lib/perl/5.14/CORE"   cqpid_perl.cpp
Running Mkbootstrap for cqpid_perl ()
chmod 644 cqpid_perl.bs
cp cqpid_perl.bs blib/arch/auto/cqpid_perl/cqpid_perl.bs
chmod 644 blib/arch/auto/cqpid_perl/cqpid_perl.bs
cp lib/qpid/messaging/Address.pm blib/lib/qpid/messaging/Address.pm
cp lib/qpid/messaging/Duration.pm blib/lib/qpid/messaging/Duration.pm
cp qpid.pm blib/lib/qpid.pm
cp cqpid_perl.pm blib/lib/cqpid_perl.pm
cp lib/qpid/messaging/codec.pm blib/lib/qpid/messaging/codec.pm
cp lib/qpid/messaging/Connection.pm blib/lib/qpid/messaging/Connection.pm
cp lib/qpid/messaging/Message.pm blib/lib/qpid/messaging/Message.pm
cp lib/qpid/messaging/Sender.pm blib/lib/qpid/messaging/Sender.pm
cp lib/qpid_messaging.pm blib/lib/qpid_messaging.pm
cp lib/qpid/messaging/Receiver.pm blib/lib/qpid/messaging/Receiver.pm
cp lib/qpid/messaging/Session.pm blib/lib/qpid/messaging/Session.pm
cqpid_perl.cpp:1589:39: fatal error: qpid/messaging/exceptions.h: No such file or directory
compilation terminated.
make[4]: *** [cqpid_perl.o] Error 1
make[4]: Leaving directory `<https://builds.apache.org/job/Qpid-Python-Cpp-Test/ws/trunk/qpid/cpp/bindings/qpid/perl'>
make[3]: Leaving directory `<https://builds.apache.org/job/Qpid-Python-Cpp-Test/ws/trunk/qpid/cpp/bindings/qpid'>
make[2]: Leaving directory `<https://builds.apache.org/job/Qpid-Python-Cpp-Test/ws/trunk/qpid/cpp/bindings/qpid'>
make[1]: Leaving directory `<https://builds.apache.org/job/Qpid-Python-Cpp-Test/ws/trunk/qpid/cpp/bindings/qpid'>
Making all in bindings/qmf2
make[1]: Entering directory `<https://builds.apache.org/job/Qpid-Python-Cpp-Test/ws/trunk/qpid/cpp/bindings/qmf2'>
Making all in examples/cpp
make[2]: Entering directory `<https://builds.apache.org/job/Qpid-Python-Cpp-Test/ws/trunk/qpid/cpp/bindings/qmf2/examples/cpp'>
depbase=`echo agent.o | sed 's|[^/]*$|.deps/&|;s|\.o$||'`;\
	g++ -DHAVE_CONFIG_H -I. -I../../../../src  -I../../../../include   -Wno-unused-result -MT
agent.o -MD -MP -MF $depbase.Tpo -c -o agent.o agent.cpp &&\
	mv -f $depbase.Tpo $depbase.Po
depbase=`echo event_driven_list_agents.o | sed 's|[^/]*$|.deps/&|;s|\.o$||'`;\
	g++ -DHAVE_CONFIG_H -I. -I../../../../src  -I../../../../include   -Wno-unused-result -MT
event_driven_list_agents.o -MD -MP -MF $depbase.Tpo -c -o event_driven_list_agents.o event_driven_list_agents.cpp
&&\
	mv -f $depbase.Tpo $depbase.Po
depbase=`echo list_agents.o | sed 's|[^/]*$|.deps/&|;s|\.o$||'`;\
	g++ -DHAVE_CONFIG_H -I. -I../../../../src  -I../../../../include   -Wno-unused-result -MT
list_agents.o -MD -MP -MF $depbase.Tpo -c -o list_agents.o list_agents.cpp &&\
	mv -f $depbase.Tpo $depbase.Po
depbase=`echo print_events.o | sed 's|[^/]*$|.deps/&|;s|\.o$||'`;\
	g++ -DHAVE_CONFIG_H -I. -I../../../../src  -I../../../../include   -Wno-unused-result -MT
print_events.o -MD -MP -MF $depbase.Tpo -c -o print_events.o print_events.cpp &&\
	mv -f $depbase.Tpo $depbase.Po
/bin/bash ../../../../libtool --tag=CXX   --mode=link g++  -Wno-unused-result   -o print_events
print_events.o ../../../../src/libqmf2.la ../../../../src/libqpidtypes.la ../../../../src/libqpidmessaging.la

/bin/bash ../../../../libtool --tag=CXX   --mode=link g++  -Wno-unused-result   -o list_agents
list_agents.o ../../../../src/libqmf2.la ../../../../src/libqpidmessaging.la 
/bin/bash ../../../../libtool --tag=CXX   --mode=link g++  -Wno-unused-result   -o event_driven_list_agents
event_driven_list_agents.o ../../../../src/libqmf2.la ../../../../src/libqpidmessaging.la

libtool: link: g++ -Wno-unused-result -o .libs/list_agents list_agents.o  ../../../../src/.libs/libqmf2.so
../../../../src/.libs/libqpidmessaging.so
libtool: link: g++ -Wno-unused-result -o .libs/event_driven_list_agents event_driven_list_agents.o
 ../../../../src/.libs/libqmf2.so ../../../../src/.libs/libqpidmessaging.so
libtool: link: g++ -Wno-unused-result -o .libs/print_events print_events.o  ../../../../src/.libs/libqmf2.so
../../../../src/.libs/libqpidtypes.so ../../../../src/.libs/libqpidmessaging.so
/bin/bash ../../../../libtool --tag=CXX   --mode=link g++  -Wno-unused-result   -o agent agent.o
../../../../src/libqmf2.la ../../../../src/libqpidtypes.la ../../../../src/libqpidmessaging.la

libtool: link: g++ -Wno-unused-result -o .libs/agent agent.o  ../../../../src/.libs/libqmf2.so
../../../../src/.libs/libqpidtypes.so ../../../../src/.libs/libqpidmessaging.so
make[2]: Leaving directory `<https://builds.apache.org/job/Qpid-Python-Cpp-Test/ws/trunk/qpid/cpp/bindings/qmf2/examples/cpp'>
Making all in ruby
make[2]: Entering directory `<https://builds.apache.org/job/Qpid-Python-Cpp-Test/ws/trunk/qpid/cpp/bindings/qmf2/ruby'>
/usr/bin/swig -ruby -c++ -w362,401 -I../../../include -I../../../bindings -I../../../include
-I../../../src -I../../../src   -I/usr/include -o cqmf2.cpp ./ruby.i
../../../include/qmf/DataAddr.h:47: Warning 467: Overloaded method qmf::DataAddr::DataAddr(qpid::types::Variant::Map
const &) not supported (no type checking rule for 'qpid::types::Variant::Map const &').
make  all-am
make[3]: Entering directory `<https://builds.apache.org/job/Qpid-Python-Cpp-Test/ws/trunk/qpid/cpp/bindings/qmf2/ruby'>
/bin/bash ../../../libtool  --tag=CXX   --mode=compile g++ -DHAVE_CONFIG_H -I. -I../../../src
-I../../../include -I../../../bindings -I../../../include -I../../../src -I../../../src  
 -I../../../include -I../../../bindings -I../../../include -I../../../src -I../../../src 
-I/usr/lib/ruby/1.8/x86_64-linux -I/usr/lib/ruby/1.8/x86_64-linux -fno-strict-aliasing -Wno-unused-result
-MT cqmf2_la-cqmf2.lo -MD -MP -MF .deps/cqmf2_la-cqmf2.Tpo -c -o cqmf2_la-cqmf2.lo `test -f
'cqmf2.cpp' || echo './'`cqmf2.cpp
libtool: compile:  g++ -DHAVE_CONFIG_H -I. -I../../../src -I../../../include -I../../../bindings
-I../../../include -I../../../src -I../../../src -I../../../include -I../../../bindings -I../../../include
-I../../../src -I../../../src -I/usr/lib/ruby/1.8/x86_64-linux -I/usr/lib/ruby/1.8/x86_64-linux
-fno-strict-aliasing -Wno-unused-result -MT cqmf2_la-cqmf2.lo -MD -MP -MF .deps/cqmf2_la-cqmf2.Tpo
-c cqmf2.cpp  -fPIC -DPIC -o .libs/cqmf2_la-cqmf2.o
mv -f .deps/cqmf2_la-cqmf2.Tpo .deps/cqmf2_la-cqmf2.Plo
/bin/bash ../../../libtool --tag=CXX   --mode=link g++ -I../../../include -I../../../bindings
-I../../../include -I../../../src -I../../../src  -I/usr/lib/ruby/1.8/x86_64-linux -I/usr/lib/ruby/1.8/x86_64-linux
-fno-strict-aliasing -Wno-unused-result -avoid-version -module -shared -shrext ".so"  -o cqmf2.la
-rpath /usr/local/local/lib/site_ruby/1.8/x86_64-linux cqmf2_la-cqmf2.lo  -L../../../src/.libs
-lqmf2 ../../../src/libqmf2.la 
libtool: link: g++  -fPIC -DPIC -shared -nostdlib /usr/lib/gcc/x86_64-linux-gnu/4.6/../../../x86_64-linux-gnu/crti.o
/usr/lib/gcc/x86_64-linux-gnu/4.6/crtbeginS.o  .libs/cqmf2_la-cqmf2.o   -Wl,-rpath -Wl,<https://builds.apache.org/job/Qpid-Python-Cpp-Test/ws/trunk/qpid/cpp/src/.libs>
-L../../../src/.libs <https://builds.apache.org/job/Qpid-Python-Cpp-Test/ws/trunk/qpid/cpp/src/.libs/libqmf2.so>
../../../src/.libs/libqmf2.so -L/usr/lib/gcc/x86_64-linux-gnu/4.6 -L/usr/lib/gcc/x86_64-linux-gnu/4.6/../../../x86_64-linux-gnu
-L/usr/lib/gcc/x86_64-linux-gnu/4.6/../../../../lib -L/lib/x86_64-linux-gnu -L/lib/../lib
-L/usr/lib/x86_64-linux-gnu -L/usr/lib/../lib -L/usr/lib/gcc/x86_64-linux-gnu/4.6/../../..
-lstdc++ -lm -lc -lgcc_s /usr/lib/gcc/x86_64-linux-gnu/4.6/crtendS.o /usr/lib/gcc/x86_64-linux-gnu/4.6/../../../x86_64-linux-gnu/crtn.o
   -Wl,-soname -Wl,cqmf2.so -o .libs/cqmf2.so
libtool: link: ( cd ".libs" && rm -f "cqmf2.la" && ln -s "../cqmf2.la" "cqmf2.la"
)
make[3]: Leaving directory `<https://builds.apache.org/job/Qpid-Python-Cpp-Test/ws/trunk/qpid/cpp/bindings/qmf2/ruby'>
make[2]: Leaving directory `<https://builds.apache.org/job/Qpid-Python-Cpp-Test/ws/trunk/qpid/cpp/bindings/qmf2/ruby'>
Making all in python
make[2]: Entering directory `<https://builds.apache.org/job/Qpid-Python-Cpp-Test/ws/trunk/qpid/cpp/bindings/qmf2/python'>
/usr/bin/swig -c++ -python -w362,401 -I../../../include -I../../../bindings -I../../../include
-I../../../src -I../../../src   -I/usr/include -o cqmf2.cpp ./python.i
/usr/bin/swig -c++ -python -w362,401 -I../../../include -I../../../bindings -I../../../include
-I../../../src -I../../../src   -I/usr/include -o cqmf2.cpp ./python.i
../../../include/qmf/DataAddr.h:47: Warning 467: Overloaded method qmf::DataAddr::DataAddr(qpid::types::Variant::Map
const &) not supported (no type checking rule for 'qpid::types::Variant::Map const &').
../../../include/qmf/DataAddr.h:47: Warning 467: Overloaded method qmf::DataAddr::DataAddr(qpid::types::Variant::Map
const &) not supported (no type checking rule for 'qpid::types::Variant::Map const &').
make  all-am
make[3]: Entering directory `<https://builds.apache.org/job/Qpid-Python-Cpp-Test/ws/trunk/qpid/cpp/bindings/qmf2/python'>
/bin/bash ../../../libtool  --tag=CXX   --mode=compile g++ -DHAVE_CONFIG_H -I. -I../../../src
-I../../../include -I../../../bindings -I../../../include -I../../../src -I../../../src  
 -I../../../include -I../../../bindings -I../../../include -I../../../src -I../../../src 
-I./qmf -I/usr/include/python2.7   -fno-strict-aliasing -Wno-unused-result -MT _cqmf2_la-cqmf2.lo
-MD -MP -MF .deps/_cqmf2_la-cqmf2.Tpo -c -o _cqmf2_la-cqmf2.lo `test -f 'cqmf2.cpp' || echo
'./'`cqmf2.cpp
libtool: compile:  g++ -DHAVE_CONFIG_H -I. -I../../../src -I../../../include -I../../../bindings
-I../../../include -I../../../src -I../../../src -I../../../include -I../../../bindings -I../../../include
-I../../../src -I../../../src -I./qmf -I/usr/include/python2.7 -fno-strict-aliasing -Wno-unused-result
-MT _cqmf2_la-cqmf2.lo -MD -MP -MF .deps/_cqmf2_la-cqmf2.Tpo -c cqmf2.cpp  -fPIC -DPIC -o
.libs/_cqmf2_la-cqmf2.o
mv -f .deps/_cqmf2_la-cqmf2.Tpo .deps/_cqmf2_la-cqmf2.Plo
/bin/bash ../../../libtool --tag=CXX   --mode=link g++ -I../../../include -I../../../bindings
-I../../../include -I../../../src -I../../../src  -I./qmf -I/usr/include/python2.7   -fno-strict-aliasing
-Wno-unused-result -avoid-version -module -shared  -o _cqmf2.la -rpath /usr/local/lib/python2.7/site-packages
_cqmf2_la-cqmf2.lo -lpython2.7   -L../../../src/.libs ../../../src/libqmf2.la 
libtool: link: g++  -fPIC -DPIC -shared -nostdlib /usr/lib/gcc/x86_64-linux-gnu/4.6/../../../x86_64-linux-gnu/crti.o
/usr/lib/gcc/x86_64-linux-gnu/4.6/crtbeginS.o  .libs/_cqmf2_la-cqmf2.o   -Wl,-rpath -Wl,<https://builds.apache.org/job/Qpid-Python-Cpp-Test/ws/trunk/qpid/cpp/src/.libs>
-lpython2.7 -L../../../src/.libs ../../../src/.libs/libqmf2.so -L/usr/lib/gcc/x86_64-linux-gnu/4.6
-L/usr/lib/gcc/x86_64-linux-gnu/4.6/../../../x86_64-linux-gnu -L/usr/lib/gcc/x86_64-linux-gnu/4.6/../../../../lib
-L/lib/x86_64-linux-gnu -L/lib/../lib -L/usr/lib/x86_64-linux-gnu -L/usr/lib/../lib -L/usr/lib/gcc/x86_64-linux-gnu/4.6/../../..
-lstdc++ -lm -lc -lgcc_s /usr/lib/gcc/x86_64-linux-gnu/4.6/crtendS.o /usr/lib/gcc/x86_64-linux-gnu/4.6/../../../x86_64-linux-gnu/crtn.o
   -Wl,-soname -Wl,_cqmf2.so -o .libs/_cqmf2.so
libtool: link: ( cd ".libs" && rm -f "_cqmf2.la" && ln -s "../_cqmf2.la" "_cqmf2.la"
)
make[3]: Leaving directory `<https://builds.apache.org/job/Qpid-Python-Cpp-Test/ws/trunk/qpid/cpp/bindings/qmf2/python'>
make[2]: Leaving directory `<https://builds.apache.org/job/Qpid-Python-Cpp-Test/ws/trunk/qpid/cpp/bindings/qmf2/python'>
make[2]: Entering directory `<https://builds.apache.org/job/Qpid-Python-Cpp-Test/ws/trunk/qpid/cpp/bindings/qmf2'>
make[2]: Nothing to be done for `all-am'.
make[2]: Leaving directory `<https://builds.apache.org/job/Qpid-Python-Cpp-Test/ws/trunk/qpid/cpp/bindings/qmf2'>
make[1]: Leaving directory `<https://builds.apache.org/job/Qpid-Python-Cpp-Test/ws/trunk/qpid/cpp/bindings/qmf2'>
make[1]: Entering directory `<https://builds.apache.org/job/Qpid-Python-Cpp-Test/ws/trunk/qpid/cpp'>
make[1]: Nothing to be done for `all-am'.
make[1]: Leaving directory `<https://builds.apache.org/job/Qpid-Python-Cpp-Test/ws/trunk/qpid/cpp'>
[Qpid-Python-Cpp-Test] $ /bin/bash -xe /tmp/hudson8736845158340446537.sh
+ cd trunk/qpid/python
+ ulimit -n 1024
+ ant -v -file qpid-python-test-ant.xml -Dqpid.executable=../cpp/src/qpidd '-Dpython.test.modules=-mqpid_tests.broker_0_10
-m qmf.console -v DEBUG' -Dqpid.port=35672 '-Dqpid.executable.args=--auth no --log-to-file
build/results/qpidd.log -p 35672' test
Apache Ant(TM) version 1.8.2 compiled on December 3 2011
Buildfile: <https://builds.apache.org/job/Qpid-Python-Cpp-Test/ws/trunk/qpid/python/qpid-python-test-ant.xml>
Detected Java version: 1.6 in: /home/jenkins/tools/java/jdk1.6.0_27-32/jre
Detected OS: Linux
parsing buildfile <https://builds.apache.org/job/Qpid-Python-Cpp-Test/ws/trunk/qpid/python/qpid-python-test-ant.xml>
with URI = <https://builds.apache.org/job/Qpid-Python-Cpp-Test/ws/trunk/qpid/python/qpid-python-test-ant.xml>
Project base dir set to: <https://builds.apache.org/job/Qpid-Python-Cpp-Test/ws/trunk/qpid/python>
parsing buildfile jar:file:/usr/share/ant/lib/ant.jar!/org/apache/tools/ant/antlib.xml with
URI = jar:file:/usr/share/ant/lib/ant.jar!/org/apache/tools/ant/antlib.xml from a zip file
Override ignored for property "qpid.port"
Override ignored for property "qpid.executable"
Override ignored for property "qpid.executable.args"
Override ignored for property "python.test.modules"
 [macrodef] creating macro  get-pid
 [macrodef] creating macro  kill-pid
 [macrodef] creating macro  await-port-free
 [macrodef] creating macro  await-port-bound
Build sequence for target(s) `test' is [clean, init, ensure-port-free, start-broker, run-tests,
stop-broker, kill-broker, report, test]
Complete build sequence is [clean, init, ensure-port-free, start-broker, run-tests, stop-broker,
kill-broker, report, test, ]

clean:
   [delete] Deleting directory <https://builds.apache.org/job/Qpid-Python-Cpp-Test/ws/trunk/qpid/python/build/results>
   [delete] Deleting <https://builds.apache.org/job/Qpid-Python-Cpp-Test/ws/trunk/qpid/python/build/results/results.err>
   [delete] Deleting <https://builds.apache.org/job/Qpid-Python-Cpp-Test/ws/trunk/qpid/python/build/results/TEST-python.xml>
   [delete] Deleting <https://builds.apache.org/job/Qpid-Python-Cpp-Test/ws/trunk/qpid/python/build/results/results.out>
   [delete] Deleting <https://builds.apache.org/job/Qpid-Python-Cpp-Test/ws/trunk/qpid/python/build/results/qpidd.log>
   [delete] Deleting directory <https://builds.apache.org/job/Qpid-Python-Cpp-Test/ws/trunk/qpid/python/build/results>
   [delete] Deleting directory <https://builds.apache.org/job/Qpid-Python-Cpp-Test/ws/trunk/qpid/python/build/work>
   [delete] Deleting directory <https://builds.apache.org/job/Qpid-Python-Cpp-Test/ws/trunk/qpid/python/build/work>

init:
    [mkdir] Created dir: <https://builds.apache.org/job/Qpid-Python-Cpp-Test/ws/trunk/qpid/python/build/results>
    [mkdir] Created dir: <https://builds.apache.org/job/Qpid-Python-Cpp-Test/ws/trunk/qpid/python/build/work>

ensure-port-free:
Checking for listener at localhost:35672
waitfor: condition was met

start-broker:
     [echo] Starting Qpid with ../cpp/src/qpidd --auth no --log-to-file build/results/qpidd.log
-p 35672
     [exec] Current OS is Linux
     [exec] Setting environment variable: QPID_WORK=<https://builds.apache.org/job/Qpid-Python-Cpp-Test/ws/trunk/qpid/python/build/work>
     [exec] Executing '../cpp/src/qpidd' with arguments:
     [exec] '--auth'
     [exec] 'no'
     [exec] '--log-to-file'
     [exec] 'build/results/qpidd.log'
     [exec] '-p'
     [exec] '35672'
     [exec] 
     [exec] The ' characters around the executable and arguments are
     [exec] not part of the command.
spawned process java.lang.UNIXProcess@1f66cff
Checking for listener at localhost:35672
Checking for listener at localhost:35672
waitfor: condition was met

run-tests:
     [echo] Running test-suite
     [exec] Current OS is Linux
     [exec] Output redirected to <https://builds.apache.org/job/Qpid-Python-Cpp-Test/ws/trunk/qpid/python/build/results/results.out>
     [exec] Error redirected to <https://builds.apache.org/job/Qpid-Python-Cpp-Test/ws/trunk/qpid/python/build/results/results.err>
     [exec] Setting environment variable: PYTHONPATH=<https://builds.apache.org/job/Qpid-Python-Cpp-Test/ws/trunk/qpid/python/../tests/src/py>:<https://builds.apache.org/job/Qpid-Python-Cpp-Test/ws/trunk/qpid/python/../extras/qmf/src/py>:<https://builds.apache.org/job/Qpid-Python-Cpp-Test/ws/trunk/qpid/python/../tools/src/py>
     [exec] Executing '<https://builds.apache.org/job/Qpid-Python-Cpp-Test/ws/trunk/qpid/python/qpid-python-test'>
with arguments:
     [exec] '-b'
     [exec] 'amqp://guest/guest@localhost:35672'
     [exec] '-x'
     [exec] '<https://builds.apache.org/job/Qpid-Python-Cpp-Test/ws/trunk/qpid/python/build/results/TEST-python.xml'>
     [exec] '-mqpid_tests.broker_0_10'
     [exec] '-m'
     [exec] 'qmf.console'
     [exec] '-v'
     [exec] 'DEBUG'
     [exec] 
     [exec] The ' characters around the executable and arguments are
     [exec] not part of the command.
     [exec] Result: 1

stop-broker:
     [exec] Current OS is Linux
     [exec] Output redirected to property: pid
     [exec] Executing 'lsof' with arguments:
     [exec] '-t'
     [exec] '-i'
     [exec] ':35672'
     [exec] 
     [exec] The ' characters around the executable and arguments are
     [exec] not part of the command.
     [echo] Stopping Qpid 15126
     [exec] Current OS is Linux
     [exec] Executing 'kill' with arguments:
     [exec] '-15'
     [exec] '15126'
     [exec] 
     [exec] The ' characters around the executable and arguments are
     [exec] not part of the command.
Checking for listener at localhost:35672
waitfor: condition was met

kill-broker:
Skipped because property 'stop.timeout' not set.

report:

BUILD FAILED
<https://builds.apache.org/job/Qpid-Python-Cpp-Test/ws/trunk/qpid/python/qpid-python-test-ant.xml>:113:
Test(s) failed
	at org.apache.tools.ant.taskdefs.Exit.execute(Exit.java:164)
	at org.apache.tools.ant.UnknownElement.execute(UnknownElement.java:291)
	at sun.reflect.GeneratedMethodAccessor6.invoke(Unknown Source)
	at sun.reflect.DelegatingMethodAccessorImpl.invoke(DelegatingMethodAccessorImpl.java:25)
	at java.lang.reflect.Method.invoke(Method.java:597)
	at org.apache.tools.ant.dispatch.DispatchUtils.execute(DispatchUtils.java:106)
	at org.apache.tools.ant.Task.perform(Task.java:348)
	at org.apache.tools.ant.Target.execute(Target.java:390)
	at org.apache.tools.ant.Target.performTasks(Target.java:411)
	at org.apache.tools.ant.Project.executeSortedTargets(Project.java:1399)
	at org.apache.tools.ant.Project.executeTarget(Project.java:1368)
	at org.apache.tools.ant.helper.DefaultExecutor.executeTargets(DefaultExecutor.java:41)
	at org.apache.tools.ant.Project.executeTargets(Project.java:1251)
	at org.apache.tools.ant.Main.runBuild(Main.java:809)
	at org.apache.tools.ant.Main.startAnt(Main.java:217)
	at org.apache.tools.ant.launch.Launcher.run(Launcher.java:280)
	at org.apache.tools.ant.launch.Launcher.main(Launcher.java:109)

Total time: 5 minutes 3 seconds
Build step 'Execute shell' marked build as failure
[locks-and-latches] Releasing all the locks
[locks-and-latches] All the locks released
Recording test results

Mime
View raw message